{"text_format":"1","workbook":"xlsx","n_sheets":10,"sheets":["set","site","table","getlinkteams","home","away","match","analyze","analyzematch","result"],"not_rendered":{"charts":1,"images":0,"macros":1,"external_links":0,"defined_names":3318,"comments":0,"pivot_tables":0},"unopened":[],"bounds":{"document_bytes":16777216,"sheet_cells":100000,"rows_first":2000,"rows_last":500,"rows_between":2000,"halvings":0,"cell_chars":16384,"cell_head_chars":4096},"cells_cut":0,"cells_raw":0,"read":"whole","date_system":"1900"}

{"sheet":"set","index":0,"n_rows":12,"n_cols":13,"rows_kept":12,"cut":false,"hidden":true,"merged":[]}
[null,5,1,2,3,4,null,null,{"$f":"CONCATENATE(\"https://primatips.com/tips/\",J1)","v":"https://primatips.com/tips/2022-01-30"},{"$f":"fmt(INDEX(I2:I10,I12),\"YYYY-MM-DD\")","v":"2022-01-30"},null,null,4]
[158,{"$f":"INDEX(site!$A:$E,$A2,B$1)","v":"https://primatips.com/tip/america-de-cali-atletico-bucaramanga-categoria-primera-a-colombia-693169"},{"$f":"fmt(INDEX(site!$A:$E,$A2,C$1)+M1/24,\"HH:MM\")","v":"03:10"},{"$f":"INDEX(site!$A:$E,$A2,D$1)","v":"Col1"},{"$f":"INDEX(site!$A:$E,$A2,E$1)","v":"America de Cali - CA Bucaramanga"},{"$f":"INDEX(site!$A:$E,$A2,F$1)","v":" "},null,null,{"$f":"fmt(I3-1,\"YYYY-MM-DD\")","v":"2022-01-26"}]
[null,null,null,null,null,null,null,null,"2022-01-27"]
[null,null,null,null,null,null,null,null,"2022-01-28"]
[1,{"$f":"INDEX(getlinkteams!A:A,A5)","v":"https://primatips.com/teams/colombia/america-de-cali/no-links"},null,null,null,null,null,null,{"$f":"fmt(I6-1,\"YYYY-MM-DD\")","v":"2022-01-29"}]
[2,{"$f":"INDEX(getlinkteams!A:A,A6)","v":"https://primatips.com/teams/colombia/atletico-bucaramanga/no-links"},null,null,null,null,null,null,{"$f":"fmt(TODAY(),\"YYYY-MM-DD\")","v":"2022-01-30"}]
[null,null,null,null,null,null,null,null,{"$f":"fmt(I6+1,\"YYYY-MM-DD\")","v":"2022-01-31"}]
[null,null,null,null,null,null,null,null,{"$f":"fmt(I7+1,\"YYYY-MM-DD\")","v":"2022-02-01"}]
[null,null,null,null,null,null,null,null,"2022-02-02"]
[null,null,null,null,null,null,null,null,"2022-02-03"]
[]
[null,null,null,null,null,null,null,null,5]

{"sheet":"site","index":1,"n_rows":158,"n_cols":5,"rows_kept":158,"cut":false,"hidden":true,"merged":[]}
["00:00","Bra","Luverdense MT - Cuiaba MT","2 - 1","https://primatips.com/tip/luverdense-mt-cuiaba-mt-brazil-692767"]
["01:00","Els1","Chalatenango - Firpo Usulutan","2 - 1","https://primatips.com/tip/cd-chalatenango-firpo-usulutan-primera-division-el-salvador-692777"]
["01:00","Els1","Isidro Metapan - Platense Zac.","1 - 1","https://primatips.com/tip/isidro-metapan-platense-zacatecoluca-primera-division-el-salvador-692779"]
["01:05","Mex2","Correcaminos - Cimarrones","0 - 2","https://primatips.com/tip/correcaminos-uat-cimarrones-de-sonora-liga-de-expansion-mx-mexico-693046"]
["01:15","Col1","Millonarios - Atl. Nacional","0 - 2","https://primatips.com/tip/millonarios-bogota-atletico-nacional-categoria-primera-a-colombia-692985"]
["01:15","Els1","Santa Tecla - Jocoro FC","3 - 0","https://primatips.com/tip/santa-tecla-fc-jocoro-fc-primera-division-el-salvador-692781"]
["02:00","Gua1","Xelaju MC - Nueva Concepcion","2 - 1","https://primatips.com/tip/xelaju-mc-deportivo-nueva-concepcion-liga-nacional-guatemala-693009"]
["03:05","Mex2","Celaya - Raya2 Expansion","2 - 1","https://primatips.com/tip/celaya-raya2-expansion-liga-de-expansion-mx-mexico-693047"]
["05:05","Aus1","Sydney - CC Mariners","3 - 2","https://primatips.com/tip/sydney-fc-central-coast-mariners-a-league-australia-692952"]
["07:45","Aus1","Newcastle Jets - Adelaide Utd","1 - 2","https://primatips.com/tip/newcastle-united-jets-adelaide-united-a-league-australia-692953"]
["10:00","And1","UE Engordany - UE Santa Coloma","1 - 1","https://primatips.com/tip/ue-engordany-ue-santa-coloma-primera-divisio-andorra-692963"]
["10:00","Fr","KFUM Oslo - Skeid","2 - 0","https://primatips.com/tip/kfum-oslo-skeid-club-friendly-693445"]
["11:00","Por2","Mafra - Academico Viseu","0 - 0","https://primatips.com/tip/mafra-academico-de-viseu-segunda-liga-portugal-693058"]
["11:00","Por2","Nacional Madeira - Porto B","1 - 0","https://primatips.com/tip/nacional-porto-b-segunda-liga-portugal-693059"]
["11:00","Spa3","Calahorra - Zamora CF","0 - 0","https://primatips.com/tip/calahorra-zamora-cf-primera-division-rfef-group-1-spain-693065"]
{"$rows_left_out":144}
{"sheet":"table","index":2,"n_rows":21,"n_cols":2,"rows_kept":21,"cut":false,"hidden":true,"merged":[]}
["Jaguares Cordoba",6]
["J. Barranquilla",6]
["Santa Fe Bogota",5]
["Once Caldas",5]
["Atl. Nacional",4]
["Alianza Petr.",4]
["America de Cali",4]
["Millonarios",4]
["Patriotas",3]
["Deportes Tolima",3]
["Envigado",3]
["Ind. Medellin",3]
["CA Bucaramanga",2]
["Union Magdalena",2]
["Cortulua Tulua",2]
{"$rows_left_out":7}
{"sheet":"getlinkteams","index":3,"n_rows":2,"n_cols":1,"rows_kept":2,"cut":false,"hidden":true,"merged":[]}
["https://primatips.com/teams/colombia/america-de-cali/no-links"]
["https://primatips.com/teams/colombia/atletico-bucaramanga/no-links"]

{"sheet":"home","index":4,"n_rows":3,"n_cols":4,"rows_kept":3,"cut":false,"hidden":true,"merged":[]}
["2022-01-28","Dep. Pereira","1 - 1","America de Cali"]
["2022-01-21","America de Cali","1 - 0","Envigado"]
[null,null,"-"]

{"sheet":"away","index":5,"n_rows":3,"n_cols":4,"rows_kept":3,"cut":false,"hidden":true,"merged":[]}
["2022-01-26","CA Bucaramanga","0 - 0","Millonarios"]
["2022-01-20","Rionegro","1 - 1","CA Bucaramanga"]
[null,null,"-"]

{"sheet":"match","index":6,"n_rows":22,"n_cols":40,"rows_kept":22,"cut":false,"hidden":true,"merged":[]}
["05.12.21","Royal Pari - Blooming","04:03:00","05.12.21","Real Potosi - Guabira","01:03:00",{"$f":"IF($K$7=K1,\"H\",\"A\")","v":"A"},{"$f":"A1","v":"05.12.21"},{"$f":"B1","v":"Royal Pari - Blooming"},{"$f":"analyze!D3","v":"1 - 1"},{"$f":"analyze!C3","v":"Dep. Pereira"},{"$f":"analyze!E3","v":"America de Cali"},{"$f":"IFERROR(LEFT(J1,SEARCH(\" - \",J1)-1)*1,\"\")","v":1},{"$f":"IFERROR(MID(J1,SEARCH(\" - \",J1)+3,100)*1,\"\")","v":1},{"$f":"IF($K$7=K1,M1,N1)","v":1},{"$f":"IF($K$7=L1,M1,N1)","v":1},{"$f":"IF(P1=\"\",\"\",IF(O1>P1,\"W\",IF(O1=P1,\"D\",IF(O1<P1,\"L\",\"\"))))","v":"D"},{"$f":"IFERROR(IF((O1+P1)>2,\"2,5 O\",\"2,5 U\"),\"\")","v":"2,5 U"},{"$f":"IF(R1=\"\",\"\",IF(AND(O1>0,P1>0),\"BTS Y\",\"BTS N\"))","v":"BTS Y"},1,{"$f":"IF(Q1=\"W\",1,IF(Q1=\"D\",0.5,IF(Q1=\"L\",0,\"\")))","v":0.5},{"$f":"IFERROR(O1-P1,\"\")","v":0},{"$f":"IF(V1=\"\",\"\",IF(O1>0,\"OK\",\"NO\"))","v":"OK"},null,"G","W","D","L","2,5 O","2,5 U","BTS Y","BTS N","TEAM TEMP","POINTS","GOALS","GOAL S","GOAL NS"]
["01.12.21","Blooming - Always Ready","01:02:00","02.12.21","Real Potosi - Petrolero","00:05:00",{"$f":"IF($K$7=K2,\"H\",\"A\")","v":"H"},{"$f":"A2","v":"01.12.21"},"Blooming - Always Ready",{"$f":"analyze!D4","v":"1 - 0"},{"$f":"analyze!C4","v":"America de Cali"},{"$f":"analyze!E4","v":"Envigado"},{"$f":"IFERROR(LEFT(J2,SEARCH(\" - \",J2)-1)*1,\"\")","v":1},{"$f":"IFERROR(MID(J2,SEARCH(\" - \",J2)+3,100)*1,\"\")","v":0},{"$f":"IF($K$7=K2,M2,N2)","v":1},{"$f":"IF($K$7=L2,M2,N2)","v":0},{"$f":"IF(P2=\"\",\"\",IF(O2>P2,\"W\",IF(O2=P2,\"D\",IF(O2<P2,\"L\",\"\"))))","v":"W"},{"$f":"IFERROR(IF((O2+P2)>2,\"2,5 O\",\"2,5 U\"),\"\")","v":"2,5 U"},{"$f":"IF(R2=\"\",\"\",IF(AND(O2>0,P2>0),\"BTS Y\",\"BTS N\"))","v":"BTS N"},{"$f":"IF(S2=\"\",T1,T1+1)","v":2},{"$f":"IF(Q2=\"W\",1,IF(Q2=\"D\",0.5,IF(Q2=\"L\",0,\"\")))","v":1},{"$f":"IFERROR(O2-P2,\"\")","v":1},{"$f":"IF(V2=\"\",\"\",IF(O2>0,\"OK\",\"NO\"))","v":"OK"},null,{"$f":"T6","v":2},{"$f":"COUNTIF($Q$1:$S$6,Z1)","v":1},{"$f":"COUNTIF($Q$1:$S$6,AA1)","v":1},0,0,2,1,1,{"$f":"U7","v":0.75},{"$f":"SUM(U1:U6)","v":1.5},{"$f":"V7","v":1},{"$f":"COUNTIF($W$1:$W$6,\"OK\")","v":2},{"$f":"COUNTIF($W$1:$W$6,\"NO\")","v":0}]
["27.11.21","Atletico Palmaflor - Blooming","03:00:00","28.11.21","Royal Pari - Real Potosi","05:00:00","A","27.11.21","Atletico Palmaflor - Blooming",{"$f":"analyze!D5","v":"-"},{"$f":"analyze!C5","v":0},{"$f":"analyze!E5","v":0},"","","","","","","",{"$f":"IF(S3=\"\",T2,T2+1)","v":2},"","","",null,{"$f":"T14","v":2},{"$f":"COUNTIF($Q$9:$S$14,Z1)","v":0},{"$f":"COUNTIF($Q$9:$S$14,AA1)","v":2},0,0,2,1,1,{"$f":"U8","v":0.5},{"$f":"SUM(U9:U14)","v":1},{"$f":"V8","v":0},{"$f":"COUNTIF($W$9:$W$14,\"OK\")","v":1},{"$f":"COUNTIF($W$9:$W$14,\"NO\")","v":1}]
["22.11.21","Blooming - Wilstermann","02:02:00","21.11.21","Real Potosi - Always Ready","03:02:00","A","22.11.21","Blooming - Wilstermann",{"$f":"analyze!D6","v":0},{"$f":"analyze!C6","v":0},{"$f":"analyze!E6","v":0},"","","","","","","",2,"","",""]
["30.10.21","The Strongest - Blooming","02:01:00","02.11.21","Atletico Palmaflor - Real Potosi","00:01:00","A","30.10.21","The Strongest - Blooming",{"$f":"analyze!D7","v":0},{"$f":"analyze!C7","v":0},{"$f":"analyze!E7","v":0},"","","","","","","",2,"","","",null,null,{"$f":"Z2/$Y$2","v":0.5},{"$f":"AA2/$Y$2","v":0.5},0,0,1,0.5,0.5,null,null,null,{"$f":"AJ2/$Y$2","v":1},0]
["28.10.21","Blooming - Oriente Petrolero","01:01:00","27.10.21","Real Potosi - Wilstermann","02:02:00","A","28.10.21","Blooming - Oriente Petrolero",{"$f":"analyze!D8","v":0},{"$f":"analyze!C8","v":0},{"$f":"analyze!E8","v":0},"","","","","","","",2,"","","",null,null,{"$f":"Z3/$Y$3","v":0},{"$f":"AA3/$Y$3","v":1},0,0,1,0.5,0.5,null,null,null,0.5,0.5]
[null,null,null,null,null,null,null,null,null,null,{"$f":"IF(COUNTIF(K1:L6,K1)>COUNTIF(K1:L6,L1),K1,L1)","v":"America de Cali"},null,null,null,null,null,null,null,null,null,{"$f":"AVERAGE(U1:U6)","v":0.75},{"$f":"SUM(V1:V6)","v":1}]
[null,null,null,null,null,null,null,null,null,null,null,null,null,null,null,null,null,null,null,null,{"$f":"IFERROR(AVERAGE(U9:U14),\"NG\")","v":0.5},{"$f":"SUM(V9:V14)","v":0},null,null,null,{"$f":"AVERAGE(Z5,AB6)","v":0.25},{"$f":"AVERAGE(AA5:AA6)","v":0.75},{"$f":"AVERAGE(Z6,AB5)","v":0},{"$f":"AVERAGE(AC5:AC6)","v":0},{"$f":"AVERAGE(AD5:AD6)","v":1},0.5,0.5,null,null,null,{"$f":"AVERAGE(AJ5:AJ6)","v":0.75},{"$f":"AVERAGE(AK5:AK6)","v":0.25}]
[null,null,null,null,null,null,{"$f":"IF($K$15=K9,\"H\",\"A\")","v":"H"},{"$f":"D1","v":"05.12.21"},{"$f":"E1","v":"Real Potosi - Guabira"},{"$f":"analyze!D13","v":"0 - 0"},{"$f":"analyze!C13","v":"CA Bucaramanga"},{"$f":"analyze!E13","v":"Millonarios"},{"$f":"IFERROR(LEFT(J9,SEARCH(\" - \",J9)-1)*1,\"\")","v":0},{"$f":"IFERROR(MID(J9,SEARCH(\" - \",J9)+3,100)*1,\"\")","v":0},{"$f":"IF($K$15=K9,M9,N9)","v":0},{"$f":"IF($K$15=L9,M9,N9)","v":0},{"$f":"IF(P9=\"\",\"\",IF(O9>P9,\"W\",IF(O9=P9,\"D\",IF(O9<P9,\"L\",\"\"))))","v":"D"},{"$f":"IF(Q9=\"\",\"\",IF((O9+P9)>2,\"2,5 O\",\"2,5 U\"))","v":"2,5 U"},{"$f":"IF(R9=\"\",\"\",IF(AND(O9>0,P9>0),\"BTS Y\",\"BTS N\"))","v":"BTS N"},1,{"$f":"IF(Q9=\"W\",1,IF(Q9=\"D\",0.5,IF(Q9=\"L\",0,\"\")))","v":0.5},{"$f":"IFERROR(O9-P9,\"\")","v":0},{"$f":"IF(V9=\"\",\"\",IF(O9>0,\"OK\",\"NO\"))","v":"NO"}]
[null,null,null,null,null,null,{"$f":"IF($K$15=K10,\"H\",\"A\")","v":"A"},{"$f":"D2","v":"02.12.21"},"Real Potosi - Petrolero",{"$f":"analyze!D14","v":"1 - 1"},{"$f":"analyze!C14","v":"Rionegro"},{"$f":"analyze!E14","v":"CA Bucaramanga"},{"$f":"IFERROR(LEFT(J10,SEARCH(\" - \",J10)-1)*1,\"\")","v":1},{"$f":"IFERROR(MID(J10,SEARCH(\" - \",J10)+3,100)*1,\"\")","v":1},{"$f":"IF($K$15=K10,M10,N10)","v":1},{"$f":"IF($K$15=L10,M10,N10)","v":1},{"$f":"IF(P10=\"\",\"\",IF(O10>P10,\"W\",IF(O10=P10,\"D\",IF(O10<P10,\"L\",\"\"))))","v":"D"},{"$f":"IF(Q10=\"\",\"\",IF((O10+P10)>2,\"2,5 O\",\"2,5 U\"))","v":"2,5 U"},{"$f":"IF(R10=\"\",\"\",IF(AND(O10>0,P10>0),\"BTS Y\",\"BTS N\"))","v":"BTS Y"},{"$f":"IF(S10=\"\",T9,T9+1)","v":2},{"$f":"IF(Q10=\"W\",1,IF(Q10=\"D\",0.5,IF(Q10=\"L\",0,\"\")))","v":0.5},{"$f":"IFERROR(O10-P10,\"\")","v":0},{"$f":"IF(V10=\"\",\"\",IF(O10>0,\"OK\",\"NO\"))","v":"OK"}]
[null,null,null,null,null,null,"A","28.11.21","Royal Pari - Real Potosi",{"$f":"analyze!D15","v":"-"},{"$f":"analyze!C15","v":0},{"$f":"analyze!E15","v":0},{"$f":"IFERROR(LEFT(J11,SEARCH(\" - \",J11)-1)*1,\"\")","v":""},{"$f":"IFERROR(MID(J11,SEARCH(\" - \",J11)+3,100)*1,\"\")","v":""},"","",{"$f":"IF(P11=\"\",\"\",IF(O11>P11,\"W\",IF(O11=P11,\"D\",IF(O11<P11,\"L\",\"\"))))","v":""},{"$f":"IF(Q11=\"\",\"\",IF((O11+P11)>2,\"2,5 O\",\"2,5 U\"))","v":""},"",{"$f":"IF(S11=\"\",T10,T10+1)","v":2},"","",""]
[null,null,null,null,null,null,"A","21.11.21","Real Potosi - Always Ready",{"$f":"analyze!D16","v":0},{"$f":"analyze!C16","v":0},{"$f":"analyze!E16","v":0},"","","","","","","",2,"","",""]
[null,null,null,null,null,null,"A","02.11.21","Atletico Palmaflor - Real Potosi",{"$f":"analyze!D17","v":0},{"$f":"analyze!C17","v":0},{"$f":"analyze!E17","v":0},"","","","","","","",2,"","",""]
[null,null,null,null,null,null,"A","27.10.21","Real Potosi - Wilstermann",{"$f":"analyze!D18","v":0},{"$f":"analyze!C18","v":0},{"$f":"analyze!E18","v":0},"","","","","","","",2,"","",""]
[null,null,null,null,null,null,null,null,null,null,{"$f":"IF(COUNTIF(K9:L14,K9)>COUNTIF(K9:L14,L9),K9,L9)","v":"CA Bucaramanga"}]
{"$rows_left_out":8}
{"sheet":"analyze","index":7,"n_rows":18,"n_cols":34,"rows_kept":18,"cut":false,"hidden":true,"merged":[[0,1,0,4],[10,1,10,4]]}
[null,{"$f":"IF(COUNTIF(C3:E7,C3)>COUNTIF(C3:E7,E3),C3,E3)","v":"America de Cali"},null,null,null,{"$f":"IFERROR(VLOOKUP(B1,table!$A:$B,2,0),\"-\")","v":4},null,null,null,null,null,null,null,null,null,{"$f":"set!J1","v":"2022-01-30"},{"$f":"match!X22","v":"03:10"},{"$f":"match!W22","v":"Col1"},{"$f":"match!Y22","v":0.75},{"$f":"match!Z22","v":1.5},{"$f":"match!AA22","v":1},{"$f":"set!E2","v":"America de Cali - CA Bucaramanga"},{"$f":"match!AC22","v":0},{"$f":"match!AD22","v":1},{"$f":"match!AE22","v":0.5},{"$f":"match!AF22","v":0.25},{"$f":"match!AG22","v":0.75},{"$f":"match!AH22","v":0},{"$f":"match!AI22","v":0},{"$f":"match!AJ22","v":1},{"$f":"match!AK22","v":0.5},{"$f":"match!AL22","v":0.5},{"$f":"match!AM22","v":0.75},{"$f":"match!AN22","v":0.25}]
[null,1,2,3,4]
[1,{"$f":"INDEX(home!$A:$D,$A3,B$2)","v":"2022-01-28"},{"$f":"INDEX(home!$A:$D,$A3,C$2)","v":"Dep. Pereira"},{"$f":"INDEX(home!$A:$D,$A3,D$2)","v":"1 - 1"},{"$f":"INDEX(home!$A:$D,$A3,E$2)","v":"America de Cali"},{"$f":"IFERROR(LEFT(D3,SEARCH(\"-\",D3)-2)*1,\"\")","v":1},{"$f":"IFERROR(MID(D3,SEARCH(\"-\",D3)+2,10)*1,\"\")","v":1},{"$f":"IF($B$1=C3,F3,G3)","v":1},{"$f":"IF($B$1=E3,F3,G3)","v":1},{"$f":"IF(I3=\"\",\"\",IF(H3>I3,\"W\",IF(H3=I3,\"D\",IF(H3<I3,\"L\",\"\"))))","v":"D"},{"$f":"IF(J3=\"\",\"\",IF((H3+I3)>2,\"O\",\"U\"))","v":"U"},{"$f":"IF(K3=\"\",\"\",IF(AND(H3>0,I3>0),\"Y\",\"N\")\n)","v":"Y"}]
[{"$f":"A3+1","v":2},{"$f":"INDEX(home!$A:$D,$A4,B$2)","v":"2022-01-21"},{"$f":"INDEX(home!$A:$D,$A4,C$2)","v":"America de Cali"},{"$f":"INDEX(home!$A:$D,$A4,D$2)","v":"1 - 0"},{"$f":"INDEX(home!$A:$D,$A4,E$2)","v":"Envigado"},{"$f":"IFERROR(LEFT(D4,SEARCH(\"-\",D4)-2)*1,\"\")","v":1},{"$f":"IFERROR(MID(D4,SEARCH(\"-\",D4)+2,10)*1,\"\")","v":0},{"$f":"IF($B$1=C4,F4,G4)","v":1},{"$f":"IF($B$1=E4,F4,G4)","v":0},{"$f":"IF(I4=\"\",\"\",IF(H4>I4,\"W\",IF(H4=I4,\"D\",IF(H4<I4,\"L\",\"\"))))","v":"W"},{"$f":"IF(J4=\"\",\"\",IF((H4+I4)>2,\"O\",\"U\"))","v":"U"},{"$f":"IF(K4=\"\",\"\",IF(AND(H4>0,I4>0),\"Y\",\"N\")\n)","v":"N"}]
[{"$f":"A4+1","v":3},{"$f":"INDEX(home!$A:$D,$A5,B$2)","v":0},{"$f":"INDEX(home!$A:$D,$A5,C$2)","v":0},{"$f":"INDEX(home!$A:$D,$A5,D$2)","v":"-"},{"$f":"INDEX(home!$A:$D,$A5,E$2)","v":0},"","","","","","",""]
[4,{"$f":"INDEX(home!$A:$D,$A6,B$2)","v":0},{"$f":"INDEX(home!$A:$D,$A6,C$2)","v":0},{"$f":"INDEX(home!$A:$D,$A6,D$2)","v":0},{"$f":"INDEX(home!$A:$D,$A6,E$2)","v":0},"","","","","","",""]
[5,{"$f":"INDEX(home!$A:$D,$A7,B$2)","v":0},{"$f":"INDEX(home!$A:$D,$A7,C$2)","v":0},{"$f":"INDEX(home!$A:$D,$A7,D$2)","v":0},{"$f":"INDEX(home!$A:$D,$A7,E$2)","v":0},"","","","","","",""]
[null,{"$f":"INDEX(home!$A:$D,$A8,B$2)","v":0},{"$f":"INDEX(home!$A:$D,$A8,C$2)","v":0},{"$f":"INDEX(home!$A:$D,$A8,D$2)","v":0},{"$f":"INDEX(home!$A:$D,$A8,E$2)","v":0},{"$f":"IFERROR(LEFT(D8,SEARCH(\"-\",D8)-2)*1,\"\")","v":""},{"$f":"IFERROR(MID(D8,SEARCH(\"-\",D8)+2,10)*1,\"\")","v":""},{"$f":"IF($B$1=C8,F8,G8)","v":""},{"$f":"IF($B$1=E8,F8,G8)","v":""},{"$f":"IF(I8=\"\",\"\",IF(H8>I8,\"W\",IF(H8=I8,\"D\",IF(H8<I8,\"L\",\"\"))))","v":""},{"$f":"IF(J8=\"\",\"\",IF((H8+I8)>2,\"O\",\"U\"))","v":""},{"$f":"IF(K8=\"\",\"\",IF(AND(H8>0,I8>0),\"Y\",\"N\")\n)","v":""}]
[]
[]
[null,{"$f":"IF(COUNTIF(C13:E17,C13)>COUNTIF(C13:E17,E13),C13,E13)","v":"CA Bucaramanga"},null,null,null,{"$f":"IFERROR(VLOOKUP(B11,table!$A:$B,2,0),\"-\")","v":2}]
[null,{"$f":"B2","v":1},{"$f":"C2","v":2},{"$f":"D2","v":3},{"$f":"E2","v":4}]
[{"$f":"A3","v":1},{"$f":"INDEX(away!$A:$D,$A13,B$12)","v":"2022-01-26"},{"$f":"INDEX(away!$A:$D,$A13,C$12)","v":"CA Bucaramanga"},{"$f":"INDEX(away!$A:$D,$A13,D$12)","v":"0 - 0"},{"$f":"INDEX(away!$A:$D,$A13,E$12)","v":"Millonarios"},{"$f":"IFERROR(LEFT(D13,SEARCH(\"-\",D13)-2)*1,\"\")","v":0},{"$f":"IFERROR(MID(D13,SEARCH(\"-\",D13)+2,10)*1,\"\")","v":0},{"$f":"IF($B$11=C13,F13,G13)","v":0},{"$f":"IF($B$11=E13,F13,G13)","v":0},{"$f":"IF(I13=\"\",\"\",IF(H13>I13,\"W\",IF(H13=I13,\"D\",IF(H13<I13,\"L\",\"\"))))","v":"D"},{"$f":"IF(J13=\"\",\"\",IF((H13+I13)>2,\"O\",\"U\"))","v":"U"},{"$f":"IF(K13=\"\",\"\",IF(AND(H13>0,I13>0),\"Y\",\"N\")\n)","v":"N"}]
[{"$f":"A4","v":2},{"$f":"INDEX(away!$A:$D,$A14,B$12)","v":"2022-01-20"},{"$f":"INDEX(away!$A:$D,$A14,C$12)","v":"Rionegro"},{"$f":"INDEX(away!$A:$D,$A14,D$12)","v":"1 - 1"},{"$f":"INDEX(away!$A:$D,$A14,E$12)","v":"CA Bucaramanga"},{"$f":"IFERROR(LEFT(D14,SEARCH(\"-\",D14)-2)*1,\"\")","v":1},{"$f":"IFERROR(MID(D14,SEARCH(\"-\",D14)+2,10)*1,\"\")","v":1},{"$f":"IF($B$11=C14,F14,G14)","v":1},{"$f":"IF($B$11=E14,F14,G14)","v":1},{"$f":"IF(I14=\"\",\"\",IF(H14>I14,\"W\",IF(H14=I14,\"D\",IF(H14<I14,\"L\",\"\"))))","v":"D"},{"$f":"IF(J14=\"\",\"\",IF((H14+I14)>2,\"O\",\"U\"))","v":"U"},{"$f":"IF(K14=\"\",\"\",IF(AND(H14>0,I14>0),\"Y\",\"N\")\n)","v":"Y"}]
[3,{"$f":"INDEX(away!$A:$D,$A15,B$12)","v":0},{"$f":"INDEX(away!$A:$D,$A15,C$12)","v":0},{"$f":"INDEX(away!$A:$D,$A15,D$12)","v":"-"},{"$f":"INDEX(away!$A:$D,$A15,E$12)","v":0},"","","","","","",""]
{"$rows_left_out":4}
{"sheet":"analyzematch","index":8,"n_rows":18,"n_cols":19,"rows_kept":18,"cut":false,"hidden":true,"merged":[[1,6,1,8],[1,10,1,14],[12,3,14,9],[12,12,14,18],[17,4,19,7],[17,13,19,16]]}
[]
[null,null,null,null,null,null,{"$f":"set!B32","v":0},null,null,{"$f":"set!C32","v":0},{"$f":"set!D32","v":0}]
[]
[null,null,null,{"$f":"match!K1","v":"Dep. Pereira"},{"$f":"match!L1","v":"America de Cali"},{"$f":"IF(G4=\"\",\"\",match!G1)","v":"A"},{"$f":"IF(match!M1=\"\",\"\",CONCATENATE(match!M1,\" : \",match!N1))","v":"1 : 1"},{"$f":"match!Q1","v":"D"},{"$f":"match!R1","v":"2,5 U"},{"$f":"match!S1","v":"BTS Y"},null,null,{"$f":"match!K9","v":"CA Bucaramanga"},{"$f":"match!L9","v":"Millonarios"},{"$f":"IF(P4=\"\",\"\",match!G9)","v":"H"},{"$f":"IF(match!N9=\"\",\"\",CONCATENATE(match!M9,\" : \",match!N9))","v":"0 : 0"},{"$f":"match!Q9","v":"D"},{"$f":"match!R9","v":"2,5 U"},{"$f":"match!S9","v":"BTS N"}]
[null,null,null,{"$f":"match!K2","v":"America de Cali"},{"$f":"match!L2","v":"Envigado"},{"$f":"IF(G5=\"\",\"\",match!G2)","v":"H"},{"$f":"IF(match!M2=\"\",\"\",CONCATENATE(match!M2,\" : \",match!N2))","v":"1 : 0"},{"$f":"match!Q2","v":"W"},{"$f":"match!R2","v":"2,5 U"},{"$f":"match!S2","v":"BTS N"},null,null,{"$f":"match!K10","v":"Rionegro"},{"$f":"match!L10","v":"CA Bucaramanga"},{"$f":"IF(P5=\"\",\"\",match!G10)","v":"A"},{"$f":"IF(match!N10=\"\",\"\",CONCATENATE(match!M10,\" : \",match!N10))","v":"1 : 1"},{"$f":"match!Q10","v":"D"},{"$f":"match!R10","v":"2,5 U"},{"$f":"match!S10","v":"BTS Y"}]
[null,null,null,{"$f":"match!K3","v":0},{"$f":"match!L3","v":0},{"$f":"IF(G6=\"\",\"\",match!G3)","v":""},{"$f":"IF(match!M3=\"\",\"\",CONCATENATE(match!M3,\" : \",match!N3))","v":""},{"$f":"match!Q3","v":""},{"$f":"match!R3","v":""},{"$f":"match!S3","v":""},null,null,{"$f":"match!K11","v":0},{"$f":"match!L11","v":0},{"$f":"IF(P6=\"\",\"\",match!G11)","v":""},{"$f":"IF(match!N11=\"\",\"\",CONCATENATE(match!M11,\" : \",match!N11))","v":""},{"$f":"match!Q11","v":""},{"$f":"match!R11","v":""},{"$f":"match!S11","v":""}]
[null,null,null,{"$f":"match!K4","v":0},{"$f":"match!L4","v":0},{"$f":"IF(G7=\"\",\"\",match!G4)","v":""},{"$f":"IF(match!M4=\"\",\"\",CONCATENATE(match!M4,\" : \",match!N4))","v":""},{"$f":"match!Q4","v":""},{"$f":"match!R4","v":""},{"$f":"match!S4","v":""},null,null,{"$f":"match!K12","v":0},{"$f":"match!L12","v":0},{"$f":"IF(P7=\"\",\"\",match!G12)","v":""},{"$f":"IF(match!N12=\"\",\"\",CONCATENATE(match!M12,\" : \",match!N12))","v":""},{"$f":"match!Q12","v":""},{"$f":"match!R12","v":""},{"$f":"match!S12","v":""}]
[null,null,null,{"$f":"match!K5","v":0},{"$f":"match!L5","v":0},{"$f":"IF(G8=\"\",\"\",match!G5)","v":""},{"$f":"IF(match!M5=\"\",\"\",CONCATENATE(match!M5,\" : \",match!N5))","v":""},{"$f":"match!Q5","v":""},{"$f":"match!R5","v":""},{"$f":"match!S5","v":""},null,null,{"$f":"match!K13","v":0},{"$f":"match!L13","v":0},{"$f":"IF(P8=\"\",\"\",match!G13)","v":""},{"$f":"IF(match!N13=\"\",\"\",CONCATENATE(match!M13,\" : \",match!N13))","v":""},{"$f":"match!Q13","v":""},{"$f":"match!R13","v":""},{"$f":"match!S13","v":""}]
[null,null,null,{"$f":"match!K6","v":0},{"$f":"match!L6","v":0},{"$f":"IF(G9=\"\",\"\",match!G6)","v":""},{"$f":"IF(match!M6=\"\",\"\",CONCATENATE(match!M6,\" : \",match!N6))","v":""},{"$f":"match!Q6","v":""},{"$f":"match!R6","v":""},{"$f":"match!S6","v":""},null,null,{"$f":"match!K14","v":0},{"$f":"match!L14","v":0},{"$f":"IF(P9=\"\",\"\",match!G14)","v":""},{"$f":"IF(match!N14=\"\",\"\",CONCATENATE(match!M14,\" : \",match!N14))","v":""},{"$f":"match!Q14","v":""},{"$f":"match!R14","v":""},{"$f":"match!S14","v":""}]
[]
[]
[]
[null,null,null,{"$f":"match!U7","v":0.75},null,null,null,null,null,null,null,null,{"$f":"match!U8","v":0.5}]
[]
[]
{"$rows_left_out":4}
{"sheet":"result","index":9,"n_rows":856,"n_cols":20,"rows_kept":856,"cut":false,"hidden":false,"merged":[[0,0,0,19]]}
[]
["DATE","TIME","LEAGUE","TEMPO","POINTS","GOALS","HOME-AWAY",{"$f":"F2","v":"GOALS"},{"$f":"E2","v":"POINTS"},{"$f":"D2","v":"TEMPO"},"W","D","L","2,5 O","2,5 U","BTS Y","BTS N","G S","G NS","RESULT"]
["2022-01-30","04:00:00","Bra",{"$error":"#DIV/0!"},0,0,"Luverdense MT - Cuiaba MT",-2,2.5,0.41666666666666669,0.16666666666666666,0.25,8.3333333333333329E-2,0.16666666666666666,0.33333333333333331,0.25,0.25,0.33333333333333331,0.16666666666666666,{"$f":"IFERROR(VLOOKUP(G3,site!$C:$D,2,0),\"\")","v":"2 - 1"}]
["2022-01-30","05:00:00","Els1",0.16666666666666666,-3,0.5,"Chalatenango - Firpo Usulutan",0,1.5,0.5,0.16666666666666666,0.33333333333333331,0.5,0.5,0.5,0.5,0.5,0.66666666666666663,0.33333333333333331,{"$f":"IFERROR(VLOOKUP(G4,site!$C:$D,2,0),\"\")","v":"2 - 1"}]
["2022-01-30","05:00:00","Els1",0.83333333333333337,3,2.5,"Isidro Metapan - Platense Zac.",-2,0.5,0.16666666666666666,0.66666666666666663,0.33333333333333331,0,0.33333333333333331,0.66666666666666663,0.5,0.5,0.66666666666666663,0.33333333333333331,{"$f":"IFERROR(VLOOKUP(G5,site!$C:$D,2,0),\"\")","v":"1 - 1"}]
["2022-01-30","05:05:00","Mex2",0.5,2,2,"Correcaminos - Cimarrones",1,1,0.33333333333333331,0.45833333333333331,0.25,0.29166666666666663,0.41666666666666663,0.58333333333333326,0.25,0.75,0.54166666666666663,0.45833333333333331,{"$f":"IFERROR(VLOOKUP(G6,site!$C:$D,2,0),\"\")","v":"0 - 2"}]
["2022-01-30","05:15:00","Col1",0.75,1,1.5,"Millonarios - Atl. Nacional",2,1.5,0.75,0.25,0.5,0.25,0.25,0.75,0.5,0.5,0.75,0.25,{"$f":"IFERROR(VLOOKUP(G7,site!$C:$D,2,0),\"\")","v":"0 - 2"}]
["2022-01-30","05:15:00","Els1",0.5,-2,1.5,"Santa Tecla - Jocoro FC",1,2,0.66666666666666663,0.16666666666666666,0.5,0.33333333333333331,0.5,0.5,0.66666666666666663,0.33333333333333331,0.83333333333333326,0.16666666666666666,{"$f":"IFERROR(VLOOKUP(G8,site!$C:$D,2,0),\"\")","v":"3 - 0"}]
["2022-01-30","06:00:00","Gua1",0.25,-2,0.5,"Xelaju MC - Nueva Concepcion",-7,0.5,0.25,0.25,0.5,0.25,0.5,0.5,0.25,0.75,0.25,0.75,{"$f":"IFERROR(VLOOKUP(G9,site!$C:$D,2,0),\"\")","v":"2 - 1"}]
["2022-01-30","07:05:00","Mex2",0.33333333333333331,-2,1,"Celaya - Raya2 Expansion",3,3,0.75,0.125,0.33333333333333331,0.54166666666666663,0,1,0.33333333333333331,0.66666666666666663,0.70833333333333326,0.29166666666666663,{"$f":"IFERROR(VLOOKUP(G10,site!$C:$D,2,0),\"\")","v":"2 - 1"}]
["2022-01-30","09:05:00","Aus1",0.5,2,3,"Sydney - CC Mariners",0,2,0.4,0.46666666666666667,0.16666666666666666,0.3666666666666667,0.53333333333333333,0.46666666666666667,0.53333333333333333,0.46666666666666667,0.81666666666666665,0.18333333333333335,{"$f":"IFERROR(VLOOKUP(G11,site!$C:$D,2,0),\"\")","v":"3 - 2"}]
["2022-01-30","11:45:00","Aus1",0.4,2,2,"Newcastle Jets - Adelaide Utd",5,3,0.6,0.2,0.4,0.4,0.8,0.2,0.7,0.30000000000000004,0.9,0.1,{"$f":"IFERROR(VLOOKUP(G12,site!$C:$D,2,0),\"\")","v":"1 - 2"}]
["2022-01-30","14:00:00","And1",0.16666666666666666,-7,1,"UE Engordany - UE Santa Coloma",-3,2,0.4,0.28333333333333333,0.2,0.51666666666666672,0.8,0.2,0.81666666666666665,0.18333333333333335,0.91666666666666674,8.3333333333333329E-2,{"$f":"IFERROR(VLOOKUP(G13,site!$C:$D,2,0),\"\")","v":"1 - 1"}]
["2022-01-30","14:00:00","Fr",{"$error":"#DIV/0!"},0,0,"KFUM Oslo - Skeid",0,0,"NG",0,0,0,0,0,0,0,0,0,{"$f":"IFERROR(VLOOKUP(G14,site!$C:$D,2,0),\"\")","v":"2 - 0"}]
["2022-01-30","15:00:00","Por2",0.58333333333333337,2,3.5,"Mafra - Academico Viseu",-4,2,0.33333333333333331,0.41666666666666663,0.41666666666666663,0.16666666666666666,0.5,0.5,0.58333333333333326,0.41666666666666663,0.66666666666666663,0.33333333333333331,{"$f":"IFERROR(VLOOKUP(G15,site!$C:$D,2,0),\"\")","v":"0 - 0"}]
{"$rows_left_out":841}