{"text_format":"1","workbook":"xlsx","n_sheets":16,"sheets":["Результат","обработка","тест","Данные","settings","Прогноз","Команда 1","Команда 2","С1","С2","С3","С4","С5","С6","С7","Лист1 (3)"],"not_rendered":{"charts":1,"images":3,"macros":1,"external_links":3,"defined_names":9,"comments":0,"pivot_tables":0},"unopened":[],"bounds":{"document_bytes":16777216,"sheet_cells":100000,"rows_first":2000,"rows_last":500,"rows_between":2000,"halvings":0,"cell_chars":16384,"cell_head_chars":4096},"cells_cut":0,"cells_raw":0,"read":"whole","date_system":"1900"}

{"sheet":"Результат","index":0,"n_rows":59,"n_cols":61,"rows_kept":59,"cut":false,"hidden":false,"merged":[[1,25,1,26],[1,61,1,62],[1,29,1,30],[1,4,1,5],[1,63,1,64],[1,19,1,20],[1,65,1,66],[1,52,1,53],[1,46,1,47],[1,48,1,49],[1,50,1,51]]}
[]
["Команда 1","Команда 2","Исход1","Исход2","1x2",null,"ТБ3.5","ТМ6.5","Тотал","ИТБ1","ИТМ1","ИТБ2","ИТМ2","ТС 1","ТС 2","ТС 3","Первый гол","Обе забьют","Забьют",null,null,null,null,null,null,null,null,"1Х2","1Х2","1-Х-2",null,"ТБ2.5","1Х",null,null,null,null,null,"Ср.Т","ТМ2.5",null,null,null,"Тотал","Т1","Т2","Счет 1",null,"Счет 2",null,"Счет 3",null,"1-ый Гол ",null,null,"Индекс Работы","Индекс Победы","Индекс Формы","Индекс Работы","Индекс Победы","Индекс Формы"]
[{"$f":"Прогноз!I1","v":"Линчеппинг"},{"$f":"Прогноз!L1","v":"Фрелунда"},{"$f":"Прогноз!A12","v":"Ф2(0)"},{"$f":"Прогноз!H25","v":"П2"},{"$f":"Прогноз!G1","v":0.31175355816182482},{"$f":"Прогноз!O1","v":0.68824644183817507},{"$f":"Прогноз!I16/100","v":1.7511904761904764},{"$f":"Прогноз!I17/100","v":-0.75119047619047652},{"$f":"Прогноз!C12","v":"ТБ4"},{"$f":"Прогноз!B19","v":1},{"$f":"Прогноз!C19","v":2.5},{"$f":"Прогноз!B20","v":3},{"$f":"Прогноз!C20","v":4.5},{"$f":"CONCATENATE(ROUND(Прогноз!B23,0),\"-\",ROUND(Прогноз!C23,0))","v":"2-3"},{"$f":"CONCATENATE(ROUND(Прогноз!B25,0),\"-\",ROUND(Прогноз!C25,0))","v":"2-3"},{"$f":"CONCATENATE(ROUND(Прогноз!B27,0),\"-\",ROUND(Прогноз!C27,0))","v":"3-5"},{"$f":"Прогноз!B15","v":"Фрелунда"},{"$f":"Прогноз!E4","v":"ДА"},{"$f":"Прогноз!H4","v":5.1023809523809529}]
["Зноймо","Ред Булл Зальцбург","X2","П2",0.39944679088957069,0.60055320911042931,2.125,-1.125,"ТБ4",2,3.5,3,4.5,"2-4","3-3","4-6","Ред Булл Зальцбург","ДА",5.85]
["Ниппон","Сахалин","Ф2(0)","П2",0.27062598334718124,0.72937401665281876,2.6166666666666676,-1.6166666666666674,"ТБ4",1,2.5,5,6.5,"2-5","3-5","2-5","Сахалин","ДА",6.8333333333333339]
["ЕфБ Айсхоккей","Ольборг","Ф1(0)","П1",0.69952651215506023,0.30047348784493993,1.96875,-0.96875,"ТБ4",3,4.5,1,2.5,"4-2","4-1","6-4","ЕфБ Айсхоккей","ДА",5.5374999999999996]
["Рингстед","Оденсе Бульдогс","П1","П1",0.85475246876647226,0.14524753123352768,2.7791666666666663,-1.7791666666666663,"ТБ4",7,8.5,0,1.5,"6-1","6-2","5-4","Рингстед","ДА",7.1583333333333332]
["Родорве Майти Буллз","Фредериксхавн Уайт Хокс","Ф2(0)","1X",0.32664910226385635,0.67335089773614354,2.5125000000000002,-1.5125,"ТБ4",2,3.5,3,4.5,"3-4","4-4","2-5","Фредериксхавн Уайт Хокс","ДА",6.625]
["Сондерийске","Хернинг Блю Фокс","Х","1X",0.50051519213912499,0.49948480786087501,1.9482142857142861,-0.94821428571428612,"ТБ4",2,3.5,2,3.5,"3-3","3-3","5-3","Хернинг Блю Фокс","ДА",5.4964285714285719]
["Хвидори","Херлев","X2","П2",0.41541234561136042,0.58458765438863958,2.2374999999999998,-1.2374999999999998,"ТБ4",3,4.5,3,4.5,"3-4","3-3","7-5","Хвидори","ДА",6.0749999999999993]
["Алматы","Temirtau",{"$error":"#DIV/0!"},"",{"$error":"#DIV/0!"},{"$error":"#DIV/0!"},{"$error":"#DIV/0!"},{"$error":"#DIV/0!"},{"$error":"#DIV/0!"},{"$error":"#DIV/0!"},{"$error":"#DIV/0!"},{"$error":"#DIV/0!"},{"$error":"#DIV/0!"},{"$error":"#DIV/0!"},{"$error":"#DIV/0!"},"7-3",{"$error":"#DIV/0!"},"ДА",{"$error":"#DIV/0!"}]
["Астана","Бейбарыс","П2","Х2",1.455031695721078E-2,0.98544968304278924,2.3000000000000003,-1.3000000000000003,"ТБ4",-1,0.5,8,9.5,"0-6","1-5","2-7","Бейбарыс","ДА",6.2]
["Рига Призма","Земгале","Ф2(0)","П2",0.29097289628910622,0.70902710371089372,1.8125000000000002,-0.81250000000000033,"ТБ4",1,2.5,3,4.5,"2-4","2-3","4-4","Земгале","ДА",5.2250000000000005]
["Волеренга","Ставангер","1Х","1X",0.55154914158895818,0.44845085841104193,1.575,-0.57499999999999996,"ТБ4",1,2.5,1,2.5,"2-2","2-2","3-4","Волеренга","ДА",4.75]
["Лиллехаммер","Стьернен","П1","П1",0.82391867958347564,0.17608132041652441,2.0375000000000001,-1.0375000000000001,"ТБ4",5,6.5,0,1.5,"5-1","5-1","4-3","Лиллехаммер","ДА",5.6749999999999998]
["Манглеруд","Фриск Аскер","Ф2(0)","П2",0.33257375796139377,0.66742624203860623,2.4750000000000001,-1.4750000000000001,"ТБ4",2,3.5,4,5.5,"2-4","3-4","5-6","Фриск Аскер","ДА",6.55]
["Спарта Cарпcборг","Сторхамар","Ф1(0)","П1",0.73404898592846424,0.26595101407153571,1.3291666666666668,-0.32916666666666683,"ТБ4",2,3.5,1,2.5,"3-2","2-1","4-6","Спарта Cарпcборг","ДА",4.2583333333333337]
["Катовице","ПЖЛ Катовице U23","П1","1X",0.9854512764672323,1.4548723532767739E-2,3.0281250000000002,-2.0281250000000002,"ТБ4",10,11.5,-2,-0.5,"8-0","7-1","11-0","Катовице","НЕТ",7.65625]
["Локомотив","Металлург Магнитогорск","X2","Х2",0.41655903699585928,0.58344096300414061,1.0770833333333334,-7.7083333333333282E-2,"ТБ4",1,2.5,1,2.5,"2-2","2-2","3-0","Металлург Магнитогорск","ДА",3.7541666666666664]
["Северсталь","Трактор","1Х","1X",0.64005244208043877,0.35994755791956123,1.1666666666666665,-0.16666666666666657,"ТБ4",3,4.5,1,2.5,"2-2","3-2","2-2","Северсталь","ДА",3.9333333333333331]
["Ермак","Нефтяник","X2","Х2",0.4106426748606844,0.5893573251393156,1.375,-0.375,"ТБ4",1,2.5,2,3.5,"2-3","2-2","2-5","Ермак","ДА",4.3499999999999996]
["Сокол","Ижсталь","Ф1(0)","П1",0.67896491811256221,0.32103508188743773,1.7208333333333337,-0.72083333333333366,"ТБ4",3,4.5,1,2.5,"3-2","3-2","4-2","Сокол","ДА",5.041666666666667]
["Челмет","Южный Урал","1Х","П1",0.64953190968340913,0.35046809031659076,1.6625000000000005,-0.66250000000000053,"ТБ4",3,4.5,1,2.5,"3-2","3-2","4-3","Челмет","ДА",4.9250000000000007]
["Рубин","Торпедо","Х","Х2",0.49941084666703739,0.50058915333296272,1.3875,-0.38750000000000001,"ТБ4",1,2.5,2,3.5,"2-2","2-2","4-2","Торпедо","ДА",4.375]
["ЦСК ВВС","Дизель",{"$error":"#DIV/0!"},"Х2",{"$error":"#DIV/0!"},{"$error":"#DIV/0!"},1.1875000000000002,-0.18750000000000014,"ТБ4",1,2.5,2,3.5,"2-2","2-1","4-4","ЦСК ВВС","ДА",3.9750000000000001]
["Кузнецкие Медведи","Стальные Лисы","X2","П2",0.41844393022200344,0.58155606977799645,1.5291666666666668,-0.5291666666666669,"ТБ4",2,3.5,2,3.5,"2-3","2-2","2-3","Стальные Лисы","ДА",4.6583333333333332]
["Ладья","Омские Ястребы","Х","Х2",0.50526765501338355,0.49473234498661639,1.8741071428571427,-0.87410714285714275,"ТБ4",2,3.5,2,3.5,"3-3","2-3","2-4","Омские Ястребы","ДА",5.3482142857142856]
["Сибирские Снайперы","Сарматы","1Х","П1",0.55438838542985636,0.44561161457014364,1.8104166666666668,-0.8104166666666669,"ТБ4",2,3.5,2,3.5,"3-2","3-2","3-1","Сибирские Снайперы","ДА",5.2208333333333332]
["Алтай","Авто","П2","Х2",2.5689370728258311E-2,0.97431062927174172,1.9750000000000001,-0.97499999999999998,"ТБ4",-1,0.5,6,7.5,"0-5","1-5","1-6","Авто","ДА",5.55]
["Ирбис","Белые Медведи","X2","1X",0.44824131667308853,0.55175868332691147,1.675,-0.67500000000000004,"ТБ4",1,2.5,2,3.5,"2-3","2-2","2-3","Белые Медведи","ДА",4.95]
["Снежные Барсы","Толпар","Х","1X",0.50515630562463754,0.49484369437536246,2.0458333333333334,-1.0458333333333334,"ТБ4",2,3.5,3,4.5,"2-3","3-3","1-6","Снежные Барсы","ДА",5.6916666666666664]
["Спутник Альметьевск","Тюменский Легион","Ф1(0)","Х2",0.68788423363103601,0.31211576636896393,2.1583333333333337,-1.1583333333333337,"ТБ4",3,4.5,3,4.5,"3-3","3-3","3-4","Спутник Альметьевск","ДА",5.916666666666667]
["Реактор","Мамонты Югры","1Х","П1",0.57816438774730727,0.42183561225269273,1.7250000000000005,-0.72500000000000053,"ТБ4",2,3.5,2,3.5,"3-2","3-2","2-3","Реактор","ДА",5.0500000000000007]
["Атланты","Чайка","1Х","Х2",0.58574762594559804,0.41425237405440207,2.078125,-1.078125,"ТБ4",4,5.5,2,3.5,"3-3","4-2","5-4","Атланты","ДА",5.7562499999999996]
["Тверичи","Полёт","П1","П1",0.91982184235791786,8.0178157642082137E-2,2.9,-1.9,"ТБ4",6,7.5,1,2.5,"6-2","5-2","7-2","Тверичи","ДА",7.4]
["Агидель (Ж)","Сборная Свердловской области (Ж)","П1","1X",0.98284932408393089,1.7150675916069127E-2,3.5437500000000002,-2.5437500000000002,"ТБ4",11,12.5,-3,-1.5,"9-0","8-1","14-0","Агидель (Ж)","НЕТ",8.6875]
["Жилина","Попрад","X2","1X",0.45760122230710465,0.54239877769289535,1.675,-0.67500000000000004,"ТБ4",2,3.5,2,3.5,"2-3","3-2","3-4","Жилина","ДА",4.95]
["Детва","Микулаш","1Х","П1",0.61694041395242161,0.38305958604757839,2.3035714285714288,-1.3035714285714286,"ТБ4",4,5.5,2,3.5,"4-3","4-3","4-3","Детва","ДА",6.2071428571428573]
["Нитра","05 Банска Быстрица","X2","П2",0.41381802208537799,0.58618197791462201,2.2437500000000004,-1.2437500000000004,"ТБ4",2,3.5,3,4.5,"3-3","3-3","5-4","Нитра","ДА",6.0875000000000004]
["Филадельфия","Колорадо","X2","П2",0.38675712554173464,0.61324287445826542,1.9803571428571431,-0.98035714285714304,"ТБ4",2,3.5,3,4.5,"2-3","3-3","4-7","Колорадо","ДА",5.5607142857142859]
["Детройт","Каролина","X2","П2",0.36136554518057407,0.63863445481942593,1.6071428571428572,-0.60714285714285721,"ТБ4",2,3.5,3,4.5,"2-3","2-2","4-3","Каролина","ДА",4.8142857142857141]
["Виннипег","Сент-Луис","1Х","П1",0.60920905470223574,0.39079094529776426,1.9125000000000001,-0.91249999999999998,"ТБ4",3,4.5,1,2.5,"3-2","3-3","6-3","Виннипег","ДА",5.4249999999999998]
["Ванкувер","Вашингтон","1Х","1X",0.51123236251338733,0.48876763748661278,2.1583333333333332,-1.1583333333333332,"ТБ4",3,4.5,2,3.5,"3-3","4-3","5-3","Ванкувер","ДА",5.9166666666666661]
["Калпа","Ильвес","X2","П2",0.43119490695396667,0.56880509304603333,1.825,-0.82499999999999996,"ТБ4",2,3.5,3,4.5,"2-3","3-3","3-5","Ильвес","ДА",5.25]
["Брест","Анже","Х","Х2",0.49044066339835979,0.50955933660164021,2.5833333333333339,-1.5833333333333337,"ТБ4",3,4.5,3,4.5,"3-3","4-3","3-7","Брест","ДА",6.7666666666666666]
["Эпиналь","Страсбур","Ф1(0)","П1",0.6771158830545152,0.32288411694548486,2.625,-1.625,"ТБ4",4,5.5,2,3.5,"4-3","4-3","4-4","Эпиналь","ДА",6.85]
["Англе","Бордо","Ф2(0)","П2",0.33855582618701241,0.66144417381298759,2.1214285714285719,-1.1214285714285717,"ТБ4",2,3.5,3,4.5,"2-3","3-3","2-3","Бордо","ДА",5.8428571428571434]
["Мон-Блан","Бриансон","X2","Х2",0.47132762521894056,0.52867237478105955,1.9291666666666671,-0.92916666666666714,"ТБ4",2,3.5,3,4.5,"3-3","3-2","5-6","Мон-Блан","ДА",5.4583333333333339]
["Спарта","Литвинов","Ф1(0)","П1",0.69792809023969915,0.30207190976030085,1.95,-0.95,"ТБ4",4,5.5,2,3.5,"4-2","3-3","6-1","Спарта","ДА",5.5]
["Лангнау Тайгерз","Лозанна","1Х","П1",0.6357925795920667,0.36420742040793319,1.7208333333333332,-0.7208333333333331,"ТБ4",3,4.5,2,3.5,"3-2","3-2","4-2","Лангнау Тайгерз","ДА",5.0416666666666661]
["Лугано","Цуг","X2","1X",0.48027028131320354,0.5197297186867964,1.66875,-0.66874999999999996,"ТБ4",2,3.5,1,2.5,"3-2","3-2","3-4","Лугано","ДА",4.9375]
["Рапперсвиль","Серветт","Ф2(0)","П2",0.26844597503228584,0.73155402496771416,1.8125,-0.8125,"ТБ4",1,2.5,4,5.5,"2-4","2-3","0-4","Серветт","ДА",5.2249999999999996]
["Фрибург","Амбри Пиотта","X2","Х2",0.47569342166273221,0.52430657833726779,1.9520833333333334,-0.95208333333333339,"ТБ4",2,3.5,2,3.5,"3-3","3-3","1-5","Фрибург","ДА",5.5041666666666664]
["Цюрих Лайонз","Биль","1Х","1X",0.5493080921607193,0.4506919078392807,1.6083333333333332,-0.60833333333333317,"ТБ4",2,3.5,2,3.5,"2-3","2-2","5-4","Цюрих Лайонз","ДА",4.8166666666666664]
["Academy Zug","Ажуа","X2","П2",0.35771222043671635,0.64228777956328353,2.65625,-1.65625,"ТБ4",2,3.5,5,6.5,"2-5","3-4","3-7","Ажуа","ДА",6.9124999999999996]
["Еллоу Винтертур","Тичино Рокетс","Ф1(0)","П1",0.71664775490355004,0.28335224509644996,1.8687500000000004,-0.86875000000000024,"ТБ4",4,5.5,1,2.5,"4-2","3-2","6-2","Еллоу Винтертур","ДА",5.3375000000000004]
["Лангенталь","Шо-де-Фондз","1Х","Х2",0.57370017980221755,0.42629982019778245,1.6625000000000001,-0.66249999999999998,"ТБ4",2,3.5,1,2.5,"3-2","3-2","3-3","Лангенталь","ДА",4.9249999999999998]
["Тургау","Лионс","Ф1(0)","П1",0.66176242080023573,0.33823757919976427,1.5,-0.5,"ТБ4",2,3.5,1,2.5,"3-2","2-2","4-4","Тургау","ДА",4.5999999999999996]
["Линчеппинг","Фрелунда","Ф2(0)","П2",0.31175355816182482,0.68824644183817507,1.7511904761904764,-0.75119047619047652,"ТБ4",1,2.5,3,4.5,"2-3","2-3","3-5","Фрелунда","ДА",5.1023809523809529]

{"sheet":"обработка","index":1,"n_rows":27,"n_cols":23,"rows_kept":27,"cut":false,"hidden":true,"merged":[]}
[null,null,null,null,null,null,null,null,null,null,null,null,null,null,null,null,null,null,{"$f":"P2+P3+P4+P5+P6+P9+P10+P11+P12+P13+P16+P17+P18+P19+P20","v":43},{"$f":"S1+U1","v":78},{"$f":"Q2+Q3+Q4+Q5+Q6+Q9+Q10+Q11+Q12+Q13+Q16+Q17+Q18+Q19+Q20","v":35}]
["21.10.18","SHL","Линчеппинг","Шеллефтео","1 : 1",null,null,null,{"$f":"E2","v":"1 : 1"},null,{"$f":"SUBSTITUTE(I2,CHAR(58),\"    :   \")","v":"1     :    1"},null,{"$f":"LEFT(K2,LEN(K2)-FIND(\":\",K2)-1)","v":"1   "},{"$f":"RIGHT(K2,LEN(K2)-FIND(\":\",K2)-1)","v":"   1"},null,{"$f":"TRIM(M2)","v":"1"},{"$f":"TRIM(N2)","v":"1"},null,{"$f":"T1","v":78},null,{"$f":"S2/15","v":5.2}]
["11.10.18","SHL","Линчеппинг","Тимре","4 : 2",null,null,null,{"$f":"E3","v":"4 : 2"},null,{"$f":"SUBSTITUTE(I3,CHAR(58),\"    :   \")","v":"4     :    2"},null,"4   ","   2",null,{"$f":"TRIM(M3)","v":"4"},"2"]
["06.10.18","SHL","Ферьестад","Линчеппинг","3 : 0",null,null,null,"3 : 0",null,"3     :    0",null,"3   ","   0",null,"3","0"]
["04.10.18","SHL","Линчеппинг","Мора","7 : 4",null,null,null,"7 : 4",null,"7     :    4",null,"7   ","   4",null,"7","4"]
["02.10.18","SHL","Линчеппинг","Брюнес","4 : 0",null,null,null,"4 : 0",null,"4     :    0",null,"4   ","   0",null,"4","0"]
[]
[]
["20.10.18","SHL","Фрелунда","ХВ-71","4 : 1",null,null,null,{"$f":"E9","v":"4 : 1"},null,"4     :    1",null,"4   ","   1",null,"4","1"]
["18.10.18","SHL","Фрелунда","Лулео","1 : 5",null,null,null,{"$f":"E10","v":"1 : 5"},null,"1     :    5",null,"1   ","   5",null,"1","5"]
["16.10.18","ЛЧ","Ольборг","Фрелунда","1 : 5",null,null,null,"1 : 5",null,"1     :    5",null,"1   ","   5",null,"1","5"]
["13.10.18","SHL","Ферьестад","Фрелунда","3 : 4",null,null,null,"3 : 4",null,"3     :    4",null,"3   ","   4",null,"3","4"]
["11.10.18","SHL","Лулео","Фрелунда","2 : 3",null,null,null,"2 : 3",null,"2     :    3",null,"2   ","   3",null,"2","3",null,{"$f":"RIGHT(A1,LEN(A1)-FIND(\":\",A1))","v":{"$error":"#VALUE!"}},null,{"$f":"RIGHT(A8,LEN(A8)-FIND(\":\",A8))","v":{"$error":"#VALUE!"}},null,{"$f":"U2","v":5.2}]
[null,null,null,null,null,null,null,null,null,null,null,null,null,null,null,null,null,null,{"$f":"IFERROR(S13,\"команда-1\")","v":"команда-1"},null,{"$f":"IFERROR(U13,\"команда-2\")","v":"команда-2"},null,{"$f":"W13","v":5.2}]
[]
["19.12.17","SHL","Линчеппинг","Фрелунда","0 : 2",null,null,null,{"$f":"E16","v":"0 : 2"},null,"0     :    2",null,"0   ","   2",null,"0","2"]
["25.11.17","SHL","Фрелунда","Линчеппинг","5 : 1",null,null,null,{"$f":"E17","v":"5 : 1"},null,"5     :    1",null,"5   ","   1",null,"5","1"]
["28.10.17","SHL","Фрелунда","Линчеппинг","4 : 0",null,null,null,"4 : 0",null,"4     :    0",null,"4   ","   0",null,"4","0"]
["14.10.17","SHL","Линчеппинг","Фрелунда","2 : 3",null,null,null,"2 : 3",null,"2     :    3",null,"2   ","   3",null,"2","3"]
["09.03.17","SHL","Линчеппинг","Фрелунда","2 : 4",null,null,null,"2 : 4",null,"2     :    4",null,"2   ","   4",null,"2","4",null," ГАМБУРГ",null," АУГСБЮРГЕР",null,6.2]
[]
[]
[null,null,null,null,null,null,null,null,null,null,null,null,null,null,null,null,null,1,{"$f":"P2+Q2+P9+Q9+P16+Q16","v":9},{"$f":"S23/3","v":3},5]
[null,null,null,null,null,null,null,null,null,null,null,null,null,null,null,null,null,2,{"$f":"P2+Q2+P3+Q3+P9+Q9+P10+Q10+P16+Q16+P17+Q17","v":27},{"$f":"S24/6","v":4.5}]
[null,null,null,null,null,null,null,null,null,null,null,null,null,null,null,null,null,3,{"$f":"P2+Q2+P3+Q3+P4+Q4+P9+Q9+P10+Q10+P11+Q11+P16+Q16+P17+Q17+P18+Q18","v":40},{"$f":"S25/9","v":4.4444444444444446}]
[null,null,null,null,null,null,null,null,null,null,null,null,null,null,null,null,null,4,{"$f":"P2+Q2+P3+Q3+P4+Q4+P5+Q5+P9+Q9+P10+Q10+P11+Q11+P12+Q12+P16+Q16+P17+Q17+P18+Q18+P19+Q19","v":63},{"$f":"S26/12","v":5.25}]
[null,null,null,null,null,null,null,null,null,null,null,null,null,null,null,null,null,5,{"$f":"T1","v":78},{"$f":"S27/15","v":5.2}]

{"sheet":"тест","index":2,"n_rows":0,"n_cols":0,"rows_kept":0,"cut":false,"hidden":true,"merged":[]}

{"sheet":"Данные","index":3,"n_rows":1080,"n_cols":5,"rows_kept":1080,"cut":false,"hidden":false,"merged":[]}
["Последние игры: Таиланд"]
["19.11.16",null,"Таиланд","Индонезия","4 : 2"]
["15.11.16",null,"Таиланд","Австралия","2 : 2"]
["11.10.16",null,"Ирак","Таиланд","4 : 0"]
["06.10.16",null,"ОАЭ","Таиланд","3 : 1"]
["06.09.16",null,"Таиланд","Япония","0 : 2"]
[]
["Последние игры: Сингапур"]
["19.11.16",null,"Филиппины","Сингапур","0 : 0"]
["13.11.16",null,"Сингапур","Камбоджа","1 : 0"]
["09.11.16",null,"Сирия","Сингапур","2 : 0"]
["11.10.16",null,"Гонконг","Сингапур","2 : 0"]
["07.10.16",null,"Сингапур","Малайзия","0 : 0"]
[]
[]
["26.03.15",null,"Таиланд","Сингапур","2 : 0"]
["23.11.14",null,"Сингапур","Таиланд","1 : 2"]
["22.12.12",null,"Таиланд","Сингапур","1 : 0"]
["19.12.12",null,"Сингапур","Таиланд","3 : 1"]
["24.08.11",null,"Таиланд","Сингапур","0 : 0"]
["Последние игры: Индонезия"]
["19.11.16",null,"Таиланд","Индонезия","4 : 2"]
["08.11.16",null,"Вьетнам","Индонезия","3 : 2"]
["04.11.16",null,"Мьянма","Индонезия","0 : 0"]
["09.10.16",null,"Индонезия","Вьетнам","2 : 2"]
["06.09.16",null,"Индонезия","Малайзия","3 : 0"]
[]
["Последние игры: Филиппины"]
["19.11.16",null,"Филиппины","Сингапур","0 : 0"]
["09.11.16",null,"Филиппины","Киргизия","1 : 0"]
["10.10.16",null,"Филиппины","Северная Корея","1 : 3"]
["07.10.16",null,"Филиппины","Бахрейн","1 : 3"]
["06.09.16",null,"Киргизия","Филиппины","1 : 2"]
[]
[]
["25.11.14",null,"Филиппины","Индонезия","4 : 0"]
["14.08.13",null,"Индонезия","Филиппины","2 : 0"]
["05.06.12",null,"Филиппины","Индонезия","2 : 2"]
["19.12.10",null,"Индонезия","Филиппины","1 : 0"]
["16.12.10",null,"Филиппины","Индонезия","0 : 1"]
["Последние игры: Бредфорд Сити"]
["19.11.16",null,"Саутенд Юнайтед","Бредфорд Сити","3 : 0"]
["12.11.16",null,"Бредфорд Сити","Рочдейл","4 : 0"]
["09.11.16",null,"Морекамб","Бредфорд Сити","3 : 2"]
["05.11.16",null,"Бредфорд Сити","Аккрингтон","1 : 2"]
["29.10.16",null,"Уимблдон","Бредфорд Сити","2 : 3"]
[]
["Последние игры: Нортхэмптон"]
["19.11.16",null,"Нортхэмптон","Петерборо Юнайтед","0 : 1"]
["12.11.16",null,"Гиллингем","Нортхэмптон","2 : 1"]
["08.11.16",null,"Нортхэмптон","Вест Хэм U23","1 : 2"]
["05.11.16",null,"Нортхэмптон","Харроу Боро","6 : 0"]
["29.10.16",null,"Нортхэмптон","Бьюри","3 : 2"]
[]
[]
["18.05.13",null,"Бредфорд Сити","Нортхэмптон","3 : 0"]
["06.04.13",null,"Бредфорд Сити","Нортхэмптон","1 : 0"]
["13.11.12",null,"Бредфорд Сити","Нортхэмптон","4 : 3"]
["03.11.12",null,"Нортхэмптон","Бредфорд Сити","1 : 1"]
["23.10.12",null,"Нортхэмптон","Бредфорд Сити","0 : 1"]
["Последние игры: МК Донс"]
["19.11.16",null,"Бристоль Роверс","МК Донс","0 : 0"]
["12.11.16",null,"МК Донс","Уоллсол","1 : 1"]
["08.11.16",null,"Норвич U23","МК Донс","4 : 1"]
["05.11.16",null,"МК Донс","Спеннимур","3 : 2"]
["29.10.16",null,"Шеффилд Юнайтед","МК Донс","2 : 1"]
[]
["Последние игры: Честерфилд"]
["19.11.16",null,"Флитвуд","Честерфилд","2 : 1"]
["13.11.16",null,"Честерфилд","Шеффилд Юнайтед","1 : 4"]
["08.11.16",null,"Крю","Честерфилд","0 : 2"]
["05.11.16",null,"Колчестер Юнайтед","Честерфилд","1 : 2"]
["01.11.16",null,"Ковентри Сити","Честерфилд","2 : 0"]
[]
[]
["03.03.15",null,"МК Донс","Честерфилд","1 : 2"]
["02.01.15",null,"МК Донс","Честерфилд","0 : 1"]
["06.12.14",null,"МК Донс","Честерфилд","0 : 1"]
["19.08.14",null,"Честерфилд","МК Донс","0 : 1"]
["17.03.12",null,"Честерфилд","МК Донс","1 : 1"]
["Последние игры: Оксфорд Юнайтед"]
["19.11.16",null,"Оксфорд Юнайтед","Ковентри Сити","4 : 1"]
["12.11.16",null,"Шрусбери Таун","Оксфорд Юнайтед","2 : 0"]
["08.11.16",null,"Челси U23","Оксфорд Юнайтед","2 : 1"]
["05.11.16",null,"Мерстам","Оксфорд Юнайтед","0 : 5"]
["29.10.16",null,"Оксфорд Юнайтед","Миллуол","1 : 2"]
[]
["Последние игры: Гиллингем"]
["19.11.16",null,"Уоллсол","Гиллингем","1 : 2"]
["16.11.16",null,"Бракли","Гиллингем","4 : 3"]
["12.11.16",null,"Гиллингем","Нортхэмптон","2 : 1"]
["08.11.16",null,"Вест Бромвич U23","Гиллингем","0 : 2"]
["05.11.16",null,"Гиллингем","Бракли","2 : 2"]
[]
[]
["26.02.13",null,"Гиллингем","Оксфорд Юнайтед","0 : 1"]
["06.10.12",null,"Оксфорд Юнайтед","Гиллингем","0 : 0"]
["14.04.12",null,"Оксфорд Юнайтед","Гиллингем","0 : 0"]
["22.10.11",null,"Гиллингем","Оксфорд Юнайтед","1 : 0"]
["05.02.11",null,"Гиллингем","Оксфорд Юнайтед","0 : 0"]
["Последние игры: Петерборо Юнайтед"]
["19.11.16",null,"Нортхэмптон","Петерборо Юнайтед","0 : 1"]
["13.11.16",null,"Петерборо Юнайтед","Болтон","1 : 0"]
["08.11.16",null,"Барнет","Петерборо Юнайтед","1 : 2"]
["05.11.16",null,"Петерборо Юнайтед","Чешам","2 : 1"]
["29.10.16",null,"Бристоль Роверс","Петерборо Юнайтед","1 : 2"]
[]
["Последние игры: Сканторп Юнайтед"]
["19.11.16",null,"Сканторп Юнайтед","Олдхэм","1 : 0"]
["12.11.16",null,"Ковентри Сити","Сканторп Юнайтед","0 : 1"]
["08.11.16",null,"Кембридж Юнайтед","Сканторп Юнайтед","0 : 2"]
["05.11.16",null,"Чарльтон","Сканторп Юнайтед","3 : 1"]
["29.10.16",null,"Сканторп Юнайтед","Свиндон Таун","4 : 1"]
[]
[]
["23.04.16",null,"Петерборо Юнайтед","Сканторп Юнайтед","0 : 2"]
["28.11.15",null,"Сканторп Юнайтед","Петерборо Юнайтед","0 : 4"]
["03.04.15",null,"Сканторп Юнайтед","Петерборо Юнайтед","2 : 0"]
["01.11.14",null,"Петерборо Юнайтед","Сканторп Юнайтед","1 : 2"]
["23.03.10",null,"Сканторп Юнайтед","Петерборо Юнайтед","4 : 0"]
["Последние игры: Порт Вэйл"]
["19.11.16",null,"Чарльтон","Порт Вэйл","2 : 0"]
["12.11.16",null,"Порт Вэйл","Флитвуд","2 : 1"]
["08.11.16",null,"Донкастер","Порт Вэйл","0 : 1"]
["05.11.16",null,"Порт Вэйл","Стивенейдж","1 : 0"]
["29.10.16",null,"Болтон","Порт Вэйл","3 : 1"]
[]
["Последние игры: Олдхэм"]
["19.11.16",null,"Сканторп Юнайтед","Олдхэм","1 : 0"]
["12.11.16",null,"Олдхэм","Уимблдон","0 : 0"]
["08.11.16",null,"Блэкберн U23","Олдхэм","2 : 3"]
["05.11.16",null,"Олдхэм","Донкастер","2 : 1"]
["29.10.16",null,"Рочдейл","Олдхэм","1 : 0"]
[]
[]
["01.03.16",null,"Олдхэм","Порт Вэйл","1 : 1"]
["29.09.15",null,"Порт Вэйл","Олдхэм","1 : 1"]
["03.03.15",null,"Порт Вэйл","Олдхэм","0 : 1"]
["19.08.14",null,"Олдхэм","Порт Вэйл","1 : 1"]
["18.01.14",null,"Порт Вэйл","Олдхэм","1 : 0"]
["Последние игры: Рочдейл"]
["19.11.16",null,"Рочдейл","Свиндон Таун","4 : 0"]
["15.11.16",null,"Рочдейл","Мэйдстоун","2 : 0"]
["12.11.16",null,"Бредфорд Сити","Рочдейл","4 : 0"]
["09.11.16",null,"Хартлпул Юнайтед","Рочдейл","1 : 2"]
["06.11.16",null,"Мэйдстоун","Рочдейл","1 : 1"]
[]
["Последние игры: Уоллсол"]
["19.11.16",null,"Уоллсол","Гиллингем","1 : 2"]
["12.11.16",null,"МК Донс","Уоллсол","1 : 1"]
["08.11.16",null,"Лестер U23","Уоллсол","0 : 1"]
["05.11.16",null,"Уоллсол","Маклсфилд","0 : 1"]
["29.10.16",null,"Уоллсол","Ковентри Сити","1 : 1"]
[]
[]
["02.01.16",null,"Уоллсол","Рочдейл","0 : 3"]
["18.08.15",null,"Рочдейл","Уоллсол","1 : 2"]
["10.02.15",null,"Уоллсол","Рочдейл","3 : 2"]
["07.10.14",null,"Рочдейл","Уоллсол","0 : 1"]
["16.09.14",null,"Рочдейл","Уоллсол","4 : 0"]
["Последние игры: Саутенд Юнайтед"]
["19.11.16",null,"Саутенд Юнайтед","Бредфорд Сити","3 : 0"]
["12.11.16",null,"Бьюри","Саутенд Юнайтед","1 : 4"]
["08.11.16",null,"Стивенейдж","Саутенд Юнайтед","4 : 0"]
["04.11.16",null,"Миллуол","Саутенд Юнайтед","1 : 0"]
["29.10.16",null,"Саутенд Юнайтед","Шрусбери Таун","1 : 1"]
[]
["Последние игры: Свиндон Таун"]
["19.11.16",null,"Рочдейл","Свиндон Таун","4 : 0"]
["15.11.16",null,"Свиндон Таун","Истли","1 : 3"]
["12.11.16",null,"Свиндон Таун","Чарльтон","3 : 0"]
["08.11.16",null,"Эксетер Сити","Свиндон Таун","1 : 2"]
["04.11.16",null,"Истли","Свиндон Таун","1 : 1"]
[]
[]
["09.01.16",null,"Свиндон Таун","Саутенд Юнайтед","4 : 2"]
["22.08.15",null,"Саутенд Юнайтед","Свиндон Таун","0 : 1"]
["31.01.12",null,"Саутенд Юнайтед","Свиндон Таун","1 : 4"]
["06.12.11",null,"Саутенд Юнайтед","Свиндон Таун","1 : 2"]
["10.09.11",null,"Свиндон Таун","Саутенд Юнайтед","2 : 0"]
["Последние игры: Шеффилд Юнайтед"]
["19.11.16",null,"Шеффилд Юнайтед","Шрусбери Таун","2 : 1"]
["13.11.16",null,"Честерфилд","Шеффилд Юнайтед","1 : 4"]
["09.11.16",null,"Гримсби Таун","Шеффилд Юнайтед","2 : 4"]
["06.11.16",null,"Шеффилд Юнайтед","Лейтон Ориент","6 : 0"]
["29.10.16",null,"Шеффилд Юнайтед","МК Донс","2 : 1"]
[]
["Последние игры: Бьюри"]
["19.11.16",null,"Уимблдон","Бьюри","5 : 1"]
["15.11.16",null,"Уимблдон","Бьюри","5 : 0"]
["12.11.16",null,"Бьюри","Саутенд Юнайтед","1 : 4"]
["08.11.16",null,"Сток Сити U23","Бьюри","2 : 1"]
["05.11.16",null,"Бьюри","Уимблдон","2 : 2"]
[]
[]
["16.02.16",null,"Бьюри","Шеффилд Юнайтед","1 : 0"]
["12.09.15",null,"Шеффилд Юнайтед","Бьюри","1 : 3"]
["13.07.13",null,"Бьюри","Шеффилд Юнайтед","1 : 3"]
["12.02.13",null,"Бьюри","Шеффилд Юнайтед","0 : 2"]
["15.09.12",null,"Шеффилд Юнайтед","Бьюри","1 : 1"]
["Последние игры: Гримсби Таун"]
["19.11.16",null,"Плимут","Гримсби Таун","0 : 3"]
["12.11.16",null,"Гримсби Таун","Барнет","2 : 2"]
["09.11.16",null,"Гримсби Таун","Шеффилд Юнайтед","2 : 4"]
["05.11.16",null,"Болтон","Гримсби Таун","1 : 0"]
["29.10.16",null,"Йовил","Гримсби Таун","0 : 0"]
[]
["Последние игры: Карлайл Юнайтед"]
["19.11.16",null,"Карлайл Юнайтед","Эксетер Сити","3 : 2"]
["12.11.16",null,"Ньюпорт","Карлайл Юнайтед","2 : 0"]
["09.11.16",null,"Карлайл Юнайтед","Флитвуд","4 : 2"]
["06.11.16",null,"Ст. Албанс","Карлайл Юнайтед","3 : 5"]
["29.10.16",null,"Карлайл Юнайтед","Кроули Таун","3 : 1"]
[]
[]
["20.11.07",null,"Гримсби Таун","Карлайл Юнайтед","1 : 0"]
["10.11.07",null,"Карлайл Юнайтед","Гримсби Таун","1 : 1"]
["08.04.06",null,"Карлайл Юнайтед","Гримсби Таун","1 : 0"]
["02.01.06",null,"Гримсби Таун","Карлайл Юнайтед","1 : 2"]
["28.09.04",null,"Карлайл Юнайтед","Гримсби Таун","2 : 1"]
["Последние игры: Йовил"]
["19.11.16",null,"Йовил","Колчестер Юнайтед","2 : 1"]
["15.11.16",null,"Солихалл","Йовил","2 : 1"]
["12.11.16",null,"Стивенейдж","Йовил","2 : 2"]
["09.11.16",null,"Рединг U23","Йовил","0 : 2"]
["05.11.16",null,"Йовил","Солихалл","2 : 2"]
[]
["Последние игры: Кроули Таун"]
["19.11.16",null,"Мансфилд Таун","Кроули Таун","3 : 1"]
["15.11.16",null,"Бристоль Роверс","Кроули Таун","4 : 2"]
["12.11.16",null,"Кроули Таун","Кембридж Юнайтед","1 : 3"]
["09.11.16",null,"Саутгемптон U23","Кроули Таун","4 : 0"]
["05.11.16",null,"Кроули Таун","Бристоль Роверс","1 : 1"]
[]
[]
["23.01.16",null,"Йовил","Кроули Таун","2 : 1"]
["19.09.15",null,"Кроули Таун","Йовил","0 : 1"]
["07.02.15",null,"Йовил","Кроули Таун","2 : 1"]
["08.11.14",null,"Йовил","Кроули Таун","1 : 0"]
["27.09.14",null,"Кроули Таун","Йовил","2 : 0"]
["Последние игры: Крю"]
["19.11.16",null,"Барнет","Крю","0 : 0"]
["15.11.16",null,"Крю","Челтенхэм","1 : 4"]
["12.11.16",null,"Крю","Плимут","1 : 2"]
["08.11.16",null,"Крю","Честерфилд","0 : 2"]
["05.11.16",null,"Челтенхэм","Крю","1 : 1"]
[]
["Последние игры: Морекамб"]
["19.11.16",null,"Морекамб","Лутон Таун","0 : 2"]
["15.11.16",null,"Ковентри Сити","Морекамб","2 : 1"]
["12.11.16",null,"Уикомб Уондерерз","Морекамб","2 : 0"]
["09.11.16",null,"Морекамб","Бредфорд Сити","3 : 2"]
["06.11.16",null,"Морекамб","Ковентри Сити","1 : 1"]
[]
[]
["02.01.12",null,"Крю","Морекамб","0 : 1"]
["19.11.11",null,"Морекамб","Крю","1 : 2"]
["22.04.11",null,"Крю","Морекамб","2 : 1"]
["27.11.10",null,"Морекамб","Крю","1 : 2"]
["02.04.10",null,"Морекамб","Крю","4 : 3"]
["Последние игры: Лейтон Ориент"]
["19.11.16",null,"Лейтон Ориент","Блэкпул","1 : 2"]
["12.11.16",null,"Колчестер Юнайтед","Лейтон Ориент","0 : 3"]
["08.11.16",null,"Брайтон U23","Лейтон Ориент","1 : 0"]
["06.11.16",null,"Шеффилд Юнайтед","Лейтон Ориент","6 : 0"]
["29.10.16",null,"Лейтон Ориент","Крю","0 : 2"]
[]
["Последние игры: Эксетер Сити"]
["19.11.16",null,"Карлайл Юнайтед","Эксетер Сити","3 : 2"]
["12.11.16",null,"Эксетер Сити","Донкастер","1 : 3"]
["08.11.16",null,"Эксетер Сити","Свиндон Таун","1 : 2"]
["05.11.16",null,"Эксетер Сити","Лутон Таун","1 : 3"]
["29.10.16",null,"Морекамб","Эксетер Сити","0 : 3"]
[]
[]
["16.01.16",null,"Лейтон Ориент","Эксетер Сити","1 : 3"]
["05.09.15",null,"Эксетер Сити","Лейтон Ориент","4 : 0"]
["09.04.12",null,"Эксетер Сити","Лейтон Ориент","3 : 0"]
["10.12.11",null,"Лейтон Ориент","Эксетер Сити","3 : 0"]
["16.04.11",null,"Эксетер Сити","Лейтон Ориент","2 : 1"]
["Последние игры: Мансфилд Таун"]
["19.11.16",null,"Мансфилд Таун","Кроули Таун","3 : 1"]
["12.11.16",null,"Портсмут","Мансфилд Таун","4 : 0"]
["08.11.16",null,"Дерби Каунти U23","Мансфилд Таун","2 : 3"]
["05.11.16",null,"Мансфилд Таун","Плимут","1 : 2"]
["29.10.16",null,"Мансфилд Таун","Стивенейдж","1 : 2"]
[]
["Последние игры: Блэкпул"]
["19.11.16",null,"Лейтон Ориент","Блэкпул","1 : 2"]
["12.11.16",null,"Блэкпул","Ноттс Каунти","4 : 0"]
["08.11.16",null,"Эвертон U23","Блэкпул","1 : 2"]
["06.11.16",null,"Блэкпул","Киддерминстер","2 : 0"]
["29.10.16",null,"Челтенхэм","Блэкпул","2 : 2"]
[]
[]
["21.04.03",null,"Блэкпул","Мансфилд Таун","3 : 3"]
["14.12.02",null,"Мансфилд Таун","Блэкпул","4 : 0"]
["30.10.01",null,"Мансфилд Таун","Блэкпул","0 : 4"]
["17.03.01",null,"Блэкпул","Мансфилд Таун","2 : 2"]
["17.10.00",null,"Мансфилд Таун","Блэкпул","0 : 1"]
["Последние игры: Ноттс Каунти"]
["19.11.16",null,"Ноттс Каунти","Ньюпорт","0 : 3"]
["15.11.16",null,"Ноттс Каунти","Борхэм Вуд","2 : 0"]
["12.11.16",null,"Блэкпул","Ноттс Каунти","4 : 0"]
["09.11.16",null,"Сандерленд U23","Ноттс Каунти","2 : 1"]
["06.11.16",null,"Борхэм Вуд","Ноттс Каунти","2 : 2"]
[]
["Последние игры: Кембридж Юнайтед"]
["19.11.16",null,"Кембридж Юнайтед","Уикомб Уондерерз","1 : 2"]
["17.11.16",null,"Довер","Кембридж Юнайтед","2 : 4"]
["12.11.16",null,"Кроули Таун","Кембридж Юнайтед","1 : 3"]
["08.11.16",null,"Кембридж Юнайтед","Сканторп Юнайтед","0 : 2"]
["05.11.16",null,"Кембридж Юнайтед","Довер","1 : 1"]
[]
[]
["23.04.16",null,"Ноттс Каунти","Кембридж Юнайтед","1 : 2"]
["28.11.15",null,"Кембридж Юнайтед","Ноттс Каунти","3 : 1"]
["07.05.05",null,"Кембридж Юнайтед","Ноттс Каунти","0 : 0"]
["27.11.04",null,"Ноттс Каунти","Кембридж Юнайтед","2 : 1"]
["12.01.02",null,"Кембридж Юнайтед","Ноттс Каунти","0 : 2"]
["Последние игры: Ньюпорт"]
["19.11.16",null,"Ноттс Каунти","Ньюпорт","0 : 3"]
["15.11.16",null,"Ньюпорт","Алфретон","4 : 1"]
["12.11.16",null,"Ньюпорт","Карлайл Юнайтед","2 : 0"]
["08.11.16",null,"Ньюпорт","Уимблдон","2 : 0"]
["06.11.16",null,"Алфретон","Ньюпорт","1 : 1"]
[]
["Последние игры: Уикомб Уондерерз"]
["19.11.16",null,"Кембридж Юнайтед","Уикомб Уондерерз","1 : 2"]
["12.11.16",null,"Уикомб Уондерерз","Морекамб","2 : 0"]
["09.11.16",null,"Уикомб Уондерерз","Ковентри Сити","2 : 4"]
["05.11.16",null,"Портсмут","Уикомб Уондерерз","1 : 2"]
["29.10.16",null,"Донкастер","Уикомб Уондерерз","2 : 2"]
[]
[]
["05.03.16",null,"Ньюпорт","Уикомб Уондерерз","1 : 0"]
["20.10.15",null,"Уикомб Уондерерз","Ньюпорт","0 : 2"]
["14.02.15",null,"Уикомб Уондерерз","Ньюпорт","1 : 2"]
["09.08.14",null,"Ньюпорт","Уикомб Уондерерз","0 : 2"]
["12.04.14",null,"Ньюпорт","Уикомб Уондерерз","2 : 0"]
["Последние игры: Плимут"]
["19.11.16",null,"Плимут","Гримсби Таун","0 : 3"]
["12.11.16",null,"Крю","Плимут","1 : 2"]
["08.11.16",null,"Суонси U23","Плимут","2 : 0"]
["05.11.16",null,"Мансфилд Таун","Плимут","1 : 2"]
["29.10.16",null,"Плимут","Колчестер Юнайтед","2 : 1"]
[]
["Последние игры: Барнет"]
["19.11.16",null,"Барнет","Крю","0 : 0"]
["12.11.16",null,"Гримсби Таун","Барнет","2 : 2"]
["08.11.16",null,"Барнет","Петерборо Юнайтед","1 : 2"]
["05.11.16",null,"Шрусбери Таун","Барнет","3 : 0"]
["29.10.16",null,"Барнет","Хартлпул Юнайтед","3 : 2"]
[]
[]
["01.03.16",null,"Барнет","Плимут","1 : 0"]
["29.09.15",null,"Плимут","Барнет","2 : 1"]
["02.03.13",null,"Плимут","Барнет","2 : 1"]
["13.10.12",null,"Барнет","Плимут","1 : 4"]
["14.02.12",null,"Плимут","Барнет","0 : 0"]
["Последние игры: Хартлпул Юнайтед"]
["19.11.16",null,"Донкастер","Хартлпул Юнайтед","2 : 1"]
["12.11.16",null,"Хартлпул Юнайтед","Челтенхэм","2 : 0"]
["09.11.16",null,"Хартлпул Юнайтед","Рочдейл","1 : 2"]
["06.11.16",null,"Хартлпул Юнайтед","Стэмфорд","3 : 0"]
["29.10.16",null,"Барнет","Хартлпул Юнайтед","3 : 2"]
[]
["Последние игры: Аккрингтон"]
["19.11.16",null,"Аккрингтон","Стивенейдж","0 : 1"]
["12.11.16",null,"Лутон Таун","Аккрингтон","1 : 0"]
["08.11.16",null,"Вулверхэмптон U23","Аккрингтон","4 : 0"]
["05.11.16",null,"Бредфорд Сити","Аккрингтон","1 : 2"]
["29.10.16",null,"Аккрингтон","Ньюпорт","1 : 3"]
[]
[]
["19.04.16",null,"Хартлпул Юнайтед","Аккрингтон","1 : 2"]
["19.01.16",null,"Аккрингтон","Хартлпул Юнайтед","3 : 1"]
["14.04.15",null,"Хартлпул Юнайтед","Аккрингтон","1 : 1"]
["21.10.14",null,"Аккрингтон","Хартлпул Юнайтед","3 : 1"]
["11.03.14",null,"Аккрингтон","Хартлпул Юнайтед","0 : 0"]
["Последние игры: Челтенхэм"]
["19.11.16",null,"Челтенхэм","Портсмут","1 : 1"]
["15.11.16",null,"Крю","Челтенхэм","1 : 4"]
["12.11.16",null,"Хартлпул Юнайтед","Челтенхэм","2 : 0"]
["08.11.16",null,"Челтенхэм","Болтон","1 : 0"]
["05.11.16",null,"Челтенхэм","Крю","1 : 1"]
[]
["Последние игры: Колчестер Юнайтед"]
["19.11.16",null,"Йовил","Колчестер Юнайтед","2 : 1"]
["12.11.16",null,"Колчестер Юнайтед","Лейтон Ориент","0 : 3"]
["08.11.16",null,"Колчестер Юнайтед","Чарльтон","2 : 1"]
["05.11.16",null,"Колчестер Юнайтед","Честерфилд","1 : 2"]
["29.10.16",null,"Плимут","Колчестер Юнайтед","2 : 1"]
[]
[]
["17.01.09",null,"Колчестер Юнайтед","Челтенхэм","3 : 1"]
["11.10.08",null,"Челтенхэм","Колчестер Юнайтед","4 : 3"]
["24.01.06",null,"Челтенхэм","Колчестер Юнайтед","0 : 1"]
["24.08.04",null,"Колчестер Юнайтед","Челтенхэм","2 : 1"]
["14.10.03",null,"Челтенхэм","Колчестер Юнайтед","1 : 3"]
["Последние игры: Алдершот Таун"]
["19.11.16",null,"Алдершот Таун","Маклсфилд","1 : 2"]
["12.11.16",null,"Линкольн Сити","Алдершот Таун","3 : 3"]
["05.11.16",null,"Форест Грин","Алдершот Таун","2 : 1"]
["29.10.16",null,"Алдершот Таун","Гуисли","1 : 0"]
["25.10.16",null,"Дагенхэм энд Редбридж","Алдершот Таун","1 : 0"]
[]
["Последние игры: Истли"]
["19.11.16",null,"Гейтсхэд","Истли","2 : 2"]
["15.11.16",null,"Свиндон Таун","Истли","1 : 3"]
["12.11.16",null,"Истли","Йорк Сити","1 : 1"]
["04.11.16",null,"Истли","Свиндон Таун","1 : 1"]
["29.10.16",null,"Барроу","Истли","4 : 0"]
[]
[]
["28.12.15",null,"Истли","Алдершот Таун","1 : 1"]
["12.12.15",null,"Алдершот Таун","Истли","0 : 1"]
["29.08.15",null,"Алдершот Таун","Истли","1 : 2"]
["22.11.14",null,"Алдершот Таун","Истли","0 : 2"]
["14.08.14",null,"Истли","Алдершот Таун","1 : 0"]
["Последние игры: Барроу"]
["19.11.16",null,"Барроу","Солихалл","2 : 1"]
["15.11.16",null,"Барроу","Тонтон","2 : 1"]
["12.11.16",null,"Саттон Юнайтед","Барроу","0 : 0"]
["06.11.16",null,"Тонтон","Барроу","2 : 2"]
["29.10.16",null,"Барроу","Истли","4 : 0"]
[]
["Последние игры: Гуисли"]
["19.11.16",null,"Довер","Гуисли","2 : 0"]
["12.11.16",null,"Гуисли","Торки Юнайтед","2 : 0"]
["29.10.16",null,"Алдершот Таун","Гуисли","1 : 0"]
["25.10.16",null,"Гуисли","Гейтсхэд","1 : 1"]
["22.10.16",null,"Форест Грин","Гуисли","3 : 0"]
[]
[]
["07.11.15",null,"Гуисли","Барроу","3 : 1"]
["18.08.15",null,"Барроу","Гуисли","1 : 1"]
["22.11.14",null,"Гуисли","Барроу","2 : 3"]
["01.11.14",null,"Барроу","Гуисли","1 : 0"]
["28.01.14",null,"Барроу","Гуисли","1 : 0"]
["Последние игры: Борхэм Вуд"]
["19.11.16",null,"Борхэм Вуд","Саутпорт","2 : 0"]
["15.11.16",null,"Ноттс Каунти","Борхэм Вуд","2 : 0"]
["12.11.16",null,"Бромли","Борхэм Вуд","1 : 0"]
["06.11.16",null,"Борхэм Вуд","Ноттс Каунти","2 : 2"]
["29.10.16",null,"Борхэм Вуд","Уокинг","2 : 1"]
[]
["Последние игры: Саттон Юнайтед"]
["19.11.16",null,"Норт Ферриби","Саттон Юнайтед","2 : 1"]
["12.11.16",null,"Саттон Юнайтед","Барроу","0 : 0"]
["05.11.16",null,"Дартфорд","Саттон Юнайтед","3 : 6"]
["29.10.16",null,"Йорк Сити","Саттон Юнайтед","2 : 2"]
["25.10.16",null,"Саттон Юнайтед","Мэйдстоун","2 : 2"]
[]
[]
["06.04.15",null,"Борхэм Вуд","Саттон Юнайтед","2 : 0"]
["25.08.14",null,"Саттон Юнайтед","Борхэм Вуд","1 : 3"]
["01.04.14",null,"Саттон Юнайтед","Борхэм Вуд","1 : 0"]
["09.12.13",null,"Борхэм Вуд","Саттон Юнайтед","1 : 3"]
["01.04.13",null,"Саттон Юнайтед","Борхэм Вуд","2 : 1"]
["Последние игры: Брэйнтри"]
["19.11.16",null,"Брэйнтри","Транмер Роверс","0 : 1"]
["12.11.16",null,"Рексхем","Брэйнтри","0 : 1"]
["05.11.16",null,"Брэйнтри","Истборн Боро","7 : 0"]
["29.10.16",null,"Брэйнтри","Солихалл","0 : 1"]
["25.10.16",null,"Уокинг","Брэйнтри","2 : 3"]
[]
["Последние игры: Бромли"]
["19.11.16",null,"Честер","Бромли","1 : 1"]
["12.11.16",null,"Бромли","Борхэм Вуд","1 : 0"]
["29.10.16",null,"Норт Ферриби","Бромли","1 : 2"]
["25.10.16",null,"Бромли","Довер","0 : 2"]
["22.10.16",null,"Рексхем","Бромли","2 : 1"]
[]
[]
["15.10.16",null,"Брэйнтри","Бромли","4 : 2"]
["25.03.16",null,"Брэйнтри","Бромли","1 : 0"]
["22.12.15",null,"Брэйнтри","Бромли","1 : 0"]
["18.08.15",null,"Бромли","Брэйнтри","1 : 2"]
["09.04.11",null,"Бромли","Брэйнтри","0 : 3"]
["Последние игры: Гейтсхэд"]
["19.11.16",null,"Гейтсхэд","Истли","2 : 2"]
["12.11.16",null,"Дагенхэм энд Редбридж","Гейтсхэд","0 : 5"]
["29.10.16",null,"Гейтсхэд","Рексхем","2 : 2"]
["25.10.16",null,"Гуисли","Гейтсхэд","1 : 1"]
["22.10.16",null,"Мэйдстоун","Гейтсхэд","0 : 2"]
[]
["Последние игры: Маклсфилд"]
["19.11.16",null,"Алдершот Таун","Маклсфилд","1 : 2"]
["12.11.16",null,"Маклсфилд","Форест Грин","0 : 1"]
["05.11.16",null,"Уоллсол","Маклсфилд","0 : 1"]
["29.10.16",null,"Мэйдстоун","Маклсфилд","2 : 1"]
["25.10.16",null,"Маклсфилд","Честер","0 : 0"]
[]
[]
["25.03.16",null,"Гейтсхэд","Маклсфилд","0 : 3"]
["13.10.15",null,"Маклсфилд","Гейтсхэд","1 : 0"]
["14.03.15",null,"Гейтсхэд","Маклсфилд","2 : 1"]
["16.09.14",null,"Маклсфилд","Гейтсхэд","1 : 1"]
["21.04.14",null,"Маклсфилд","Гейтсхэд","0 : 2"]
["Последние игры: Довер"]
["19.11.16",null,"Довер","Гуисли","2 : 0"]
["17.11.16",null,"Довер","Кембридж Юнайтед","2 : 4"]
["12.11.16",null,"Солихалл","Довер","2 : 3"]
["05.11.16",null,"Кембридж Юнайтед","Довер","1 : 1"]
["29.10.16",null,"Довер","Транмер Роверс","1 : 4"]
[]
["Последние игры: Уокинг"]
["19.11.16",null,"Мэйдстоун","Уокинг","0 : 3"]
["12.11.16",null,"Уокинг","Норт Ферриби","1 : 1"]
["05.11.16",null,"Стокпорт Каунти","Уокинг","2 : 4"]
["29.10.16",null,"Борхэм Вуд","Уокинг","2 : 1"]
["25.10.16",null,"Уокинг","Брэйнтри","2 : 3"]
[]
[]
["05.03.16",null,"Уокинг","Довер","0 : 1"]
["25.09.15",null,"Довер","Уокинг","2 : 0"]
["06.04.15",null,"Довер","Уокинг","2 : 1"]
["27.01.15",null,"Довер","Уокинг","1 : 0"]
["24.01.15",null,"Уокинг","Довер","3 : 3"]
["Последние игры: Йорк Сити"]
["19.11.16",null,"Йорк Сити","Дагенхэм энд Редбридж","0 : 2"]
["12.11.16",null,"Истли","Йорк Сити","1 : 1"]
["29.10.16",null,"Йорк Сити","Саттон Юнайтед","2 : 2"]
["25.10.16",null,"Саутпорт","Йорк Сити","2 : 0"]
["22.10.16",null,"Йорк Сити","Честер","1 : 1"]
[]
["Последние игры: Линкольн Сити"]
["19.11.16",null,"Форест Грин","Линкольн Сити","2 : 3"]
["12.11.16",null,"Линкольн Сити","Алдершот Таун","3 : 3"]
["05.11.16",null,"Линкольн Сити","Алтринчем","2 : 1"]
["29.10.16",null,"Честер","Линкольн Сити","2 : 5"]
["25.10.16",null,"Линкольн Сити","Борхэм Вуд","2 : 0"]
[]
[]
["07.01.12",null,"Линкольн Сити","Йорк Сити","0 : 2"]
["29.11.11",null,"Йорк Сити","Линкольн Сити","2 : 0"]
["17.02.04",null,"Йорк Сити","Линкольн Сити","1 : 4"]
["30.08.03",null,"Линкольн Сити","Йорк Сити","3 : 0"]
["19.04.03",null,"Линкольн Сити","Йорк Сити","1 : 0"]
["Последние игры: Честер"]
["19.11.16",null,"Честер","Бромли","1 : 1"]
["12.11.16",null,"Транмер Роверс","Честер","2 : 2"]
["29.10.16",null,"Честер","Линкольн Сити","2 : 5"]
["25.10.16",null,"Маклсфилд","Честер","0 : 0"]
["22.10.16",null,"Йорк Сити","Честер","1 : 1"]
[]
["Последние игры: Саутпорт"]
["19.11.16",null,"Борхэм Вуд","Саутпорт","2 : 0"]
["15.11.16",null,"Флитвуд","Саутпорт","4 : 1"]
["12.11.16",null,"Саутпорт","Мэйдстоун","3 : 2"]
["07.11.16",null,"Саутпорт","Флитвуд","0 : 0"]
["29.10.16",null,"Торки Юнайтед","Саутпорт","1 : 2"]
[]
[]
["15.10.16",null,"Саутпорт","Честер","1 : 0"]
["23.01.16",null,"Честер","Саутпорт","0 : 0"]
["13.10.15",null,"Саутпорт","Честер","1 : 2"]
["17.01.15",null,"Саутпорт","Честер","0 : 0"]
["16.09.14",null,"Честер","Саутпорт","2 : 0"]
["Последние игры: Тэмворс"]
["19.11.16",null,"Тэмворс","Сталибридж","2 : 1"]
["12.11.16",null,"Харрогейт","Тэмворс","3 : 4"]
["05.11.16",null,"Тэмворс","Дарлингтон","2 : 1"]
["29.10.16",null,"Тэмворс","Файлд","1 : 0"]
["22.10.16",null,"Солфорд","Тэмворс","1 : 2"]
[]
["Последние игры: Стокпорт Каунти"]
["19.11.16",null,"Стокпорт Каунти","Брэдфорд Парк Авеню","1 : 2"]
["15.11.16",null,"Стокпорт Каунти","Гейнсборо","1 : 0"]
["12.11.16",null,"Нюнеатон","Стокпорт Каунти","1 : 1"]
["05.11.16",null,"Стокпорт Каунти","Уокинг","2 : 4"]
["29.10.16",null,"Стокпорт Каунти","Киддерминстер","0 : 1"]
[]
[]
["05.03.16",null,"Тэмворс","Стокпорт Каунти","1 : 1"]
["14.11.15",null,"Стокпорт Каунти","Тэмворс","1 : 1"]
["04.01.15",null,"Стокпорт Каунти","Тэмворс","0 : 2"]
["16.08.14",null,"Тэмворс","Стокпорт Каунти","0 : 1"]
["19.02.13",null,"Стокпорт Каунти","Тэмворс","0 : 1"]
["Последние игры: Олимпо"]
["05.11.16",null,"Темперлей","Олимпо","0 : 0"]
["29.10.16",null,"Олимпо","Атлетико Тукуман","2 : 1"]
["22.10.16",null,"Сармьенто Жунин","Олимпо","1 : 1"]
["16.10.16",null,"Олимпо","Тигре","1 : 4"]
["01.10.16",null,"Кильмес","Олимпо","2 : 1"]
[]
["Последние игры: Химнасия и Эсгрима"]
["18.11.16",null,"Химнасия и Эсгрима","Сан-Лоренсо","3 : 2"]
["07.11.16",null,"Химнасия и Эсгрима","Бока Хуниорс","0 : 3"]
["30.10.16",null,"Индепендьенте","Химнасия и Эсгрима","0 : 0"]
["23.10.16",null,"Химнасия и Эсгрима","Атлетико Хуракан","1 : 0"]
["20.10.16",null,"Расинг","Химнасия и Эсгрима","0 : 1"]
[]
[]
["21.02.16",null,"Химнасия и Эсгрима","Олимпо","1 : 0"]
["04.10.15",null,"Химнасия и Эсгрима","Олимпо","2 : 2"]
["18.10.14",null,"Химнасия и Эсгрима","Олимпо","0 : 0"]
["09.04.14",null,"Олимпо","Химнасия и Эсгрима","0 : 2"]
["20.10.13",null,"Химнасия и Эсгрима","Олимпо","2 : 2"]
["Последние игры: Сан-Тельмо"]
["18.11.16",null,"Сан-Тельмо","Тальерес Эскалада","2 : 1"]
["13.11.16",null,"Колехиалес","Сан-Тельмо","2 : 4"]
["04.11.16",null,"Сан-Тельмо","Акасусо","3 : 0"]
["30.10.16",null,"Комуникасьонес","Сан-Тельмо","0 : 1"]
["26.10.16",null,"Сан-Тельмо","Атлетико Атланта","2 : 3"]
[]
["Последние игры: Дефенсорес де Бельграно"]
["20.11.16",null,"Дефенсорес де Бельграно","Акасусо","1 : 0"]
["12.11.16",null,"Комуникасьонес","Дефенсорес де Бельграно","1 : 0"]
["09.11.16",null,"Дефенсорес де Бельграно","Атлетико Атланта","0 : 0"]
["01.11.16",null,"Эстудиантес","Дефенсорес де Бельграно","0 : 1"]
["25.10.16",null,"Дефенсорес де Бельграно","Тристан Суарес","1 : 0"]
[]
[]
["22.05.16",null,"Дефенсорес де Бельграно","Сан-Тельмо","0 : 1"]
["04.03.13",null,"Сан-Тельмо","Дефенсорес де Бельграно","0 : 0"]
["15.09.12",null,"Дефенсорес де Бельграно","Сан-Тельмо","1 : 2"]
["07.04.12",null,"Дефенсорес де Бельграно","Сан-Тельмо","3 : 0"]
["29.10.11",null,"Сан-Тельмо","Дефенсорес де Бельграно","0 : 0"]
["Последние игры: Феникс"]
["18.11.16",null,"Феникс","Экскурсионистас","3 : 1"]
["15.11.16",null,"Депортиво Морон","Феникс","0 : 0"]
["07.11.16",null,"Феникс","Тальерес Эскалада","3 : 1"]
["29.10.16",null,"Колехиалес","Феникс","1 : 1"]
["25.10.16",null,"Феникс","Акасусо","1 : 1"]
[]
["Последние игры: Тристан Суарес"]
["19.11.16",null,"Тристан Суарес","Атлетико Атланта","2 : 2"]
["12.11.16",null,"Эстудиантес","Тристан Суарес","0 : 0"]
["31.10.16",null,"Тристан Суарес","Депортиво Риестра","0 : 2"]
["25.10.16",null,"Дефенсорес де Бельграно","Тристан Суарес","1 : 0"]
["21.10.16",null,"Тристан Суарес","Альмиранте Браун","0 : 0"]
[]
[]
["27.02.16",null,"Тристан Суарес","Феникс","0 : 1"]
["14.09.15",null,"Феникс","Тристан Суарес","2 : 0"]
["25.04.15",null,"Тристан Суарес","Феникс","1 : 0"]
["01.10.14",null,"Феникс","Тристан Суарес","0 : 3"]
["12.08.14",null,"Тристан Суарес","Феникс","1 : 0"]
["Последние игры: Пюник"]
["19.11.16",null,"Арарат","Пюник","1 : 2"]
["05.11.16",null,"Пюник","Гандзасар","0 : 0"]
["30.10.16",null,"Пюник","Алашкерт","2 : 1"]
["26.10.16",null,"Ширак","Пюник","0 : 1"]
["23.10.16",null,"Бананц","Пюник","0 : 1"]
[]
["Последние игры: Бананц"]
["19.11.16",null,"Бананц","Гандзасар","1 : 1"]
["12.11.16",null,"Алашкерт","Бананц","1 : 1"]
["05.11.16",null,"Алашкерт","Бананц","4 : 1"]
["29.10.16",null,"Бананц","Ширак","1 : 2"]
["26.10.16",null,"Бананц","Арарат","0 : 0"]
[]
[]
["23.10.16",null,"Бананц","Пюник","0 : 1"]
["11.09.16",null,"Пюник","Бананц","2 : 1"]
["23.04.16",null,"Бананц","Пюник","1 : 1"]
["02.03.16",null,"Пюник","Бананц","1 : 2"]
["03.10.15",null,"Бананц","Пюник","0 : 1"]
["Последние игры: Коринтианс"]
["17.11.16",null,"Фигейренсе","Коринтианс","1 : 1"]
["06.11.16",null,"Сан-Паулу","Коринтианс","4 : 0"]
["29.10.16",null,"Коринтианс","Шапекоэнсе","1 : 1"]
["23.10.16",null,"Фламенго","Коринтианс","2 : 2"]
["20.10.16",null,"Крузейро","Коринтианс","4 : 2"]
[]
["Последние игры: Интернасьонал"]
["18.11.16",null,"Интернасьонал","Понте-Прета","1 : 1"]
["06.11.16",null,"Палмейрас","Интернасьонал","1 : 0"]
["03.11.16",null,"Атлетико Минейро","Интернасьонал","2 : 2"]
["29.10.16",null,"Интернасьонал","Санта Круз","1 : 1"]
["27.10.16",null,"Интернасьонал","Атлетико Минейро","1 : 2"]
[]
[]
["31.07.16",null,"Интернасьонал","Коринтианс","0 : 1"]
["17.09.15",null,"Интернасьонал","Коринтианс","2 : 1"]
["13.06.15",null,"Коринтианс","Интернасьонал","2 : 1"]
["19.10.14",null,"Интернасьонал","Коринтианс","1 : 2"]
["18.07.14",null,"Коринтианс","Интернасьонал","2 : 1"]
["Последние игры: Мерани Мартвили"]
["02.11.16",null,"Мерани Мартвили","Сачхере","3 : 0"]
["19.10.16",null,"Мерани Мартвили","Колхети","1 : 0"]
["21.09.16",null,"Мерани Мартвили","Дила","2 : 1"]
["23.08.16",null,"Мерани Мартвили","Динамо Батуми","2 : 0"]
["01.08.16",null,"Дила","Мерани Мартвили","2 : 1"]
[]
["Последние игры: Кутаиси"]
["18.11.16",null,"Спартаки","Кутаиси","1 : 2"]
["06.11.16",null,"Кутаиси","Гурия","5 : 0"]
["02.11.16",null,"Динамо Тбилиси","Кутаиси","2 : 3"]
["29.10.16",null,"Сачхере","Кутаиси","2 : 1"]
["19.10.16",null,"Сулори Вани","Кутаиси","0 : 1"]
[]
[]
["19.02.16",null,"Мерани Мартвили","Кутаиси","2 : 1"]
["14.08.15",null,"Кутаиси","Мерани Мартвили","4 : 0"]
["05.03.15",null,"Кутаиси","Мерани Мартвили","1 : 1"]
["26.11.14",null,"Кутаиси","Мерани Мартвили","3 : 4"]
["17.11.14",null,"Мерани Мартвили","Кутаиси","0 : 3"]
["Последние игры: Вади Дегла"]
["17.11.16",null,"Смуха","Вади Дегла","1 : 1"]
["03.11.16",null,"Вади Дегла","Миср ел Макаса","2 : 4"]
["30.10.16",null,"El-Sharqeya","Вади Дегла","1 : 2"]
["25.10.16",null,"Вади Дегла","Nasr Taadeen","1 : 0"]
["21.10.16",null,"Тала Эль-Джаиш","Вади Дегла","1 : 1"]
[]
["Последние игры: Энппи"]
["17.11.16",null,"Энппи","Араб Контракторс","1 : 2"]
["04.11.16",null,"Исмаили","Энппи","2 : 1"]
["31.10.16",null,"Энппи","Замалек","1 : 2"]
["27.10.16",null,"Эль-Масри","Энппи","1 : 3"]
["22.10.16",null,"Энппи","Tanta","3 : 1"]
[]
[]
["27.04.16",null,"Вади Дегла","Энппи","0 : 2"]
["02.04.16",null,"Энппи","Вади Дегла","0 : 2"]
["21.02.16",null,"Вади Дегла","Энппи","2 : 3"]
["27.05.15",null,"Вади Дегла","Энппи","1 : 1"]
["24.09.14",null,"Энппи","Вади Дегла","1 : 0"]
["Последние игры: Эль-Дахлие"]
["16.11.16",null,"Миср ел Макаса","Эль-Дахлие","1 : 0"]
["03.11.16",null,"Эль-Дахлие","El-Sharqeya","1 : 0"]
["29.10.16",null,"Nasr Taadeen","Эль-Дахлие","2 : 2"]
["25.10.16",null,"Эль-Дахлие","Тала Эль-Джаиш","2 : 3"]
["21.10.16",null,"Эль-Энтаг Эль-Харби","Эль-Дахлие","0 : 0"]
[]
["Последние игры: Смуха"]
["17.11.16",null,"Смуха","Вади Дегла","1 : 1"]
["03.11.16",null,"Араб Контракторс","Смуха","1 : 1"]
["31.10.16",null,"Смуха","Исмаили","2 : 1"]
["27.10.16",null,"Замалек","Смуха","0 : 0"]
["20.10.16",null,"Смуха","Эль-Масри","1 : 2"]
[]
[]
["23.05.16",null,"Эль-Дахлие","Смуха","0 : 1"]
["11.01.16",null,"Смуха","Эль-Дахлие","1 : 1"]
["09.04.15",null,"Эль-Дахлие","Смуха","1 : 0"]
["20.10.14",null,"Смуха","Эль-Дахлие","0 : 1"]
["19.04.14",null,"Эль-Дахлие","Смуха","0 : 3"]
["Последние игры: Араб Контракторс"]
["17.11.16",null,"Энппи","Араб Контракторс","1 : 2"]
["03.11.16",null,"Араб Контракторс","Смуха","1 : 1"]
["30.10.16",null,"Миср ел Макаса","Араб Контракторс","2 : 0"]
["26.10.16",null,"Араб Контракторс","El-Sharqeya","2 : 1"]
["21.10.16",null,"Nasr Taadeen","Араб Контракторс","0 : 2"]
[]
["Последние игры: Эль-Масри"]
["17.11.16",null,"Эль-Масри","Исмаили","1 : 1"]
["04.11.16",null,"Замалек","Эль-Масри","1 : 0"]
["31.10.16",null,"Эль-Масри","Tanta","4 : 0"]
["27.10.16",null,"Эль-Масри","Энппи","1 : 3"]
["20.10.16",null,"Смуха","Эль-Масри","1 : 2"]
[]
[]
["12.05.16",null,"Араб Контракторс","Эль-Масри","2 : 1"]
["30.12.15",null,"Эль-Масри","Араб Контракторс","3 : 2"]
["30.03.15",null,"Эль-Масри","Араб Контракторс","0 : 1"]
["30.09.14",null,"Араб Контракторс","Эль-Масри","1 : 0"]
["07.11.11",null,"Эль-Масри","Араб Контракторс","1 : 0"]
["Последние игры: Исмаили"]
["17.11.16",null,"Эль-Масри","Исмаили","1 : 1"]
["04.11.16",null,"Исмаили","Энппи","2 : 1"]
["31.10.16",null,"Смуха","Исмаили","2 : 1"]
["27.10.16",null,"Исмаили","Миср ел Макаса","1 : 2"]
["22.10.16",null,"El-Sharqeya","Исмаили","0 : 1"]
[]
["Последние игры: Замалек"]
["18.11.16",null,"Замалек","Tanta","1 : 0"]
["04.11.16",null,"Замалек","Эль-Масри","1 : 0"]
["31.10.16",null,"Энппи","Замалек","1 : 2"]
["27.10.16",null,"Замалек","Смуха","0 : 0"]
["23.10.16",null,"Замалек","Мамелоди Сандаунс","1 : 0"]
[]
[]
["03.08.16",null,"Замалек","Исмаили","4 : 0"]
["04.04.16",null,"Замалек","Исмаили","0 : 1"]
["03.02.16",null,"Исмаили","Замалек","1 : 0"]
["06.07.15",null,"Замалек","Исмаили","3 : 0"]
["04.12.14",null,"Исмаили","Замалек","0 : 0"]
["Последние игры: Норт-Ист Юнайтед"]
["17.11.16",null,"Атлетико Калькутта","Норт-Ист Юнайтед","1 : 1"]
["11.11.16",null,"Гоа","Норт-Ист Юнайтед","2 : 1"]
["05.11.16",null,"Норт-Ист Юнайтед","Мумбаи Сити","0 : 1"]
["28.10.16",null,"Норт-Ист Юнайтед","Атлетико Калькутта","1 : 2"]
["20.10.16",null,"Норт-Ист Юнайтед","Ченнай","0 : 1"]
[]
["Последние игры: Пуна Сити"]
["18.11.16",null,"Пуна Сити","Дели Динамос","4 : 3"]
["15.11.16",null,"Ченнай","Пуна Сити","2 : 0"]
["10.11.16",null,"Мумбаи Сити","Пуна Сити","0 : 1"]
["06.11.16",null,"Пуна Сити","Атлетико Калькутта","2 : 1"]
["03.11.16",null,"Пуна Сити","Гоа","0 : 1"]
[]
[]
["12.10.16",null,"Пуна Сити","Норт-Ист Юнайтед","0 : 1"]
["02.12.15",null,"Норт-Ист Юнайтед","Пуна Сити","3 : 2"]
["09.10.15",null,"Пуна Сити","Норт-Ист Юнайтед","1 : 0"]
["15.11.14",null,"Норт-Ист Юнайтед","Пуна Сити","0 : 0"]
["03.11.14",null,"Пуна Сити","Норт-Ист Юнайтед","1 : 0"]
["Последние игры: Анкона"]
["19.11.16",null,"Терамо","Анкона","3 : 2"]
["12.11.16",null,"Анкона","Лумеззане","0 : 1"]
["08.11.16",null,"Анкона","Фано","1 : 0"]
["05.11.16",null,"Судтироль","Анкона","1 : 1"]
["29.10.16",null,"Порденоне","Анкона","0 : 0"]
[]
["Последние игры: Мачератезе"]
["19.11.16",null,"Бассано Виртус","Мачератезе","0 : 2"]
["12.11.16",null,"Мачератезе","Парма","0 : 0"]
["09.11.16",null,"Мачератезе","Казертана","2 : 1"]
["05.11.16",null,"Фералписало","Мачератезе","2 : 0"]
["22.10.16",null,"Реджана","Мачератезе","1 : 0"]
[]
[]
["13.09.16",null,"Мачератезе","Анкона","0 : 0"]
["21.02.16",null,"Мачератезе","Анкона","1 : 1"]
["10.10.15",null,"Анкона","Мачератезе","1 : 1"]
["23.03.14",null,"Мачератезе","Анкона","1 : 4"]
["10.11.13",null,"Анкона","Мачератезе","0 : 0"]
["Последние игры: Венеция"]
["19.11.16",null,"Фералписало","Венеция","0 : 1"]
["12.11.16",null,"Венеция","Судтироль","2 : 0"]
["08.11.16",null,"Судтироль","Венеция","0 : 4"]
["05.11.16",null,"Сантарканджело","Венеция","1 : 1"]
["29.10.16",null,"Венеция","Бассано Виртус","1 : 1"]
[]
["Последние игры: Реджана"]
["19.11.16",null,"Реджана","Альбинолеффе","2 : 0"]
["12.11.16",null,"Порденоне","Реджана","2 : 0"]
["07.11.16",null,"Реджана","Самбенедеттезе","2 : 0"]
["01.11.16",null,"Модена","Реджана","0 : 3"]
["29.10.16",null,"Мантова","Реджана","2 : 3"]
[]
[]
["10.09.16",null,"Венеция","Реджана","1 : 1"]
["09.03.14",null,"Реджана","Венеция","1 : 0"]
["03.11.13",null,"Венеция","Реджана","2 : 1"]
["08.02.09",null,"Венеция","Реджана","1 : 1"]
["21.09.08",null,"Реджана","Венеция","2 : 1"]
["Последние игры: Аль-Нахда"]
["04.11.16",null,"Аль-Сувэйк","Аль-Нахда","2 : 1"]
["31.10.16",null,"Аль-Нахда","Oman FC","3 : 0"]
["27.10.16",null,"Мускат","Аль-Нахда","2 : 0"]
["23.10.16",null,"Аль-Нахда","Аль-Шабаб","1 : 1"]
["19.10.16",null,"Сохар","Аль-Нахда","4 : 2"]
[]
["Последние игры: Дофар"]
["04.11.16",null,"Дофар","Аль-Оруба","1 : 1"]
["31.10.16",null,"Jaalan","Дофар","1 : 1"]
["27.10.16",null,"Дофар","Al-Rustaq","1 : 0"]
["22.10.16",null,"Аль-Хабура","Дофар","0 : 2"]
["18.10.16",null,"Дофар","Сахам","4 : 1"]
[]
[]
["24.04.16",null,"Аль-Нахда","Дофар","1 : 1"]
["26.12.15",null,"Дофар","Аль-Нахда","3 : 2"]
["28.05.15",null,"Дофар","Аль-Нахда","2 : 3"]
["21.05.15",null,"Аль-Нахда","Дофар","1 : 1"]
["15.03.14",null,"Дофар","Аль-Нахда","0 : 2"]
["Последние игры: Аль-Оруба"]
["04.11.16",null,"Дофар","Аль-Оруба","1 : 1"]
["31.10.16",null,"Аль-Оруба","Аль-Сувэйк","2 : 1"]
["27.10.16",null,"Oman FC","Аль-Оруба","1 : 3"]
["23.10.16",null,"Аль-Оруба","Мускат","3 : 1"]
["19.10.16",null,"Аль-Шабаб","Аль-Оруба","2 : 1"]
[]
["Последние игры: Аль-Наср"]
["04.11.16",null,"Аль-Наср","Jaalan","2 : 2"]
["31.10.16",null,"Al-Rustaq","Аль-Наср","2 : 2"]
["27.10.16",null,"Аль-Наср","Аль-Хабура","1 : 0"]
["22.10.16",null,"Сахам","Аль-Наср","1 : 0"]
["18.10.16",null,"Аль-Наср","Фанджа","2 : 0"]
[]
[]
["31.01.16",null,"Аль-Оруба","Аль-Наср","1 : 0"]
["18.10.15",null,"Аль-Наср","Аль-Оруба","1 : 3"]
["03.05.15",null,"Аль-Наср","Аль-Оруба","1 : 2"]
["05.12.14",null,"Аль-Оруба","Аль-Наср","1 : 0"]
["12.04.14",null,"Аль-Наср","Аль-Оруба","2 : 1"]
["Последние игры: Мельгар"]
["18.11.16",null,"Дефенсор Ла Бокана","Мельгар","1 : 3"]
["03.11.16",null,"Мельгар","Гарсиласо","0 : 0"]
["29.10.16",null,"Депортиво Мунисипаль","Мельгар","0 : 0"]
["24.10.16",null,"Мельгар","Унион Комерсио","1 : 0"]
["20.10.16",null,"Сесар Вальехо","Мельгар","2 : 3"]
[]
["Последние игры: Хуан Аурич"]
["20.11.16",null,"Хуан Аурич","Спортинг Кристалл","0 : 0"]
["03.11.16",null,"Хуан Аурич","Унион Комерсио","2 : 1"]
["31.10.16",null,"Дефенсор Ла Бокана","Хуан Аурич","0 : 3"]
["23.10.16",null,"Хуан Аурич","Депортиво Мунисипаль","0 : 2"]
["18.10.16",null,"Гарсиласо","Хуан Аурич","1 : 1"]
[]
[]
["28.09.16",null,"Хуан Аурич","Мельгар","1 : 1"]
["28.05.16",null,"Хуан Аурич","Мельгар","1 : 1"]
["21.02.16",null,"Мельгар","Хуан Аурич","2 : 3"]
["29.11.15",null,"Мельгар","Хуан Аурич","4 : 1"]
["23.08.15",null,"Хуан Аурич","Мельгар","2 : 3"]
["Последние игры: Михайловце"]
["19.11.16",null,"Михайловце","Подбрезова","1 : 3"]
["05.11.16",null,"Михайловце","Злате Моравце","5 : 1"]
["29.10.16",null,"Михайловце","Сеница","0 : 0"]
["22.10.16",null,"Михайловце","Татран Прешов","2 : 2"]
["15.10.16",null,"Михайловце","Тренчин","2 : 0"]
[]
["Последние игры: Нитра"]
["19.11.16",null,"Нитра","Серед","2 : 1"]
["12.11.16",null,"Жилина (Б)","Нитра","4 : 1"]
["05.11.16",null,"Свети-Юр","Нитра","0 : 1"]
["29.10.16",null,"Нитра","Погронье","0 : 0"]
["22.10.16",null,"Скалица","Нитра","4 : 2"]
[]
[]
["30.05.15",null,"Нитра","Михайловце","0 : 0"]
["25.04.15",null,"Михайловце","Нитра","1 : 1"]
["20.02.13",null,"Нитра","Михайловце","2 : 3"]
["19.03.05",null,"Нитра","Михайловце","3 : 1"]
["01.08.04",null,"Михайловце","Нитра","1 : 0"]
["Последние игры: Андижан"]
["16.11.16",null,"Обод","Андижан","0 : 0"]
["03.11.16",null,"Андижан","Бунедкор","0 : 0"]
["29.10.16",null,"Алмалык","Андижан","0 : 0"]
["22.10.16",null,"Андижан","Металлург Бекабад","0 : 0"]
["15.10.16",null,"Шуртан","Андижан","2 : 0"]
[]
["Последние игры: Навбахор"]
["17.11.16",null,"Бунедкор","Навбахор","1 : 1"]
["04.11.16",null,"Металлург Бекабад","Навбахор","5 : 1"]
["29.10.16",null,"Навбахор","Кызылкум","0 : 2"]
["22.10.16",null,"Насаф","Навбахор","6 : 0"]
["14.10.16",null,"Навбахор","Бухара","1 : 2"]
[]
[]
["01.07.16",null,"Навбахор","Андижан","2 : 0"]
["01.10.15",null,"Навбахор","Андижан","1 : 0"]
["16.05.15",null,"Андижан","Навбахор","3 : 2"]
["26.09.14",null,"Андижан","Навбахор","3 : 1"]
["16.05.14",null,"Навбахор","Андижан","3 : 0"]
["Последние игры: Кызылкум"]
["17.11.16",null,"Нефтчи","Кызылкум","0 : 1"]
["03.11.16",null,"Кызылкум","Локомотив Ташкент","0 : 1"]
["29.10.16",null,"Навбахор","Кызылкум","0 : 2"]
["22.10.16",null,"Кызылкум","Бунедкор","0 : 0"]
["14.10.16",null,"Металлург Бекабад","Кызылкум","1 : 0"]
[]
["Последние игры: Согдиана"]
["19.11.16",null,"Согдиана","Насаф","0 : 3"]
["05.11.16",null,"Бухара","Согдиана","3 : 0"]
["29.10.16",null,"Согдиана","Коканд 1912","1 : 1"]
["22.10.16",null,"Пахтакор","Согдиана","3 : 0"]
["14.10.16",null,"Согдиана","Обод","2 : 1"]
[]
[]
["01.07.16",null,"Согдиана","Кызылкум","1 : 1"]
["02.08.15",null,"Согдиана","Кызылкум","4 : 1"]
["14.03.15",null,"Кызылкум","Согдиана","4 : 1"]
["07.11.14",null,"Согдиана","Кызылкум","1 : 0"]
["21.06.14",null,"Кызылкум","Согдиана","1 : 0"]
["Последние игры: Металлург Бекабад"]
["18.11.16",null,"Локомотив Ташкент","Металлург Бекабад","4 : 1"]
["04.11.16",null,"Металлург Бекабад","Навбахор","5 : 1"]
["28.10.16",null,"Бунедкор","Металлург Бекабад","1 : 0"]
["22.10.16",null,"Андижан","Металлург Бекабад","0 : 0"]
["14.10.16",null,"Металлург Бекабад","Кызылкум","1 : 0"]
[]
["Последние игры: Нефтчи"]
["17.11.16",null,"Нефтчи","Кызылкум","0 : 1"]
["04.11.16",null,"Насаф","Нефтчи","3 : 1"]
["29.10.16",null,"Нефтчи","Бухара","0 : 1"]
["22.10.16",null,"Коканд 1912","Нефтчи","2 : 1"]
["15.10.16",null,"Нефтчи","Пахтакор","1 : 0"]
[]
[]
["01.07.16",null,"Нефтчи","Металлург Бекабад","1 : 0"]
["22.08.15",null,"Нефтчи","Металлург Бекабад","2 : 1"]
["11.04.15",null,"Металлург Бекабад","Нефтчи","0 : 1"]
["20.09.14",null,"Нефтчи","Металлург Бекабад","2 : 1"]
["03.05.14",null,"Металлург Бекабад","Нефтчи","2 : 1"]
["Последние игры: Конна Квей"]
["19.11.16",null,"Ньютаун","Конна Квей","2 : 1"]
["13.11.16",null,"Лландудно","Конна Квей","0 : 2"]
["05.11.16",null,"Эберистуит Таун","Конна Квей","1 : 3"]
["30.10.16",null,"Нью-Сейнтс","Конна Квей","3 : 0"]
["25.10.16",null,"Конна Квей","Рил","2 : 1"]
[]
["Последние игры: Нью-Сейнтс"]
["18.11.16",null,"Кармартен Таун","Нью-Сейнтс","2 : 4"]
["13.11.16",null,"Ливингстон","Нью-Сейнтс","0 : 3"]
["05.11.16",null,"Бангор Сити","Нью-Сейнтс","1 : 2"]
["30.10.16",null,"Нью-Сейнтс","Конна Квей","3 : 0"]
["25.10.16",null,"Бангор Сити","Нью-Сейнтс","0 : 2"]
[]
[]
["30.10.16",null,"Нью-Сейнтс","Конна Квей","3 : 0"]
["02.04.16",null,"Нью-Сейнтс","Конна Квей","5 : 0"]
["19.03.16",null,"Конна Квей","Нью-Сейнтс","2 : 1"]
["29.01.16",null,"Нью-Сейнтс","Конна Квей","0 : 0"]
["16.01.16",null,"Конна Квей","Нью-Сейнтс","2 : 0"]
["Последние игры: Райт Роверс"]
["19.11.16",null,"Дамбартон","Райт Роверс","0 : 0"]
["05.11.16",null,"Данфермлайн","Райт Роверс","0 : 0"]
["29.10.16",null,"Райт Роверс","Куин-оф-Саут","1 : 0"]
["22.10.16",null,"Фолкирк","Райт Роверс","2 : 4"]
["15.10.16",null,"Райт Роверс","Хиберниан","0 : 0"]
[]
["Последние игры: Эйр"]
["19.11.16",null,"Эйр","Фолкирк","0 : 1"]
["13.11.16",null,"Сент-Миррен","Эйр","2 : 1"]
["05.11.16",null,"Эйр","Хиберниан","0 : 3"]
["29.10.16",null,"Мортон","Эйр","2 : 1"]
["22.10.16",null,"Эйр","Куин-оф-Саут","1 : 0"]
[]
[]
["06.08.16",null,"Эйр","Райт Роверс","0 : 2"]
["17.03.12",null,"Райт Роверс","Эйр","2 : 2"]
["26.12.11",null,"Эйр","Райт Роверс","1 : 1"]
["12.11.11",null,"Райт Роверс","Эйр","0 : 1"]
["27.08.11",null,"Эйр","Райт Роверс","2 : 1"]
["Последние игры: Cape Town City"]
["19.11.16",null,"Чиппа Юнайтед","Cape Town City","1 : 2"]
["05.11.16",null,"Барока","Cape Town City","3 : 4"]
["02.11.16",null,"Cape Town City","Блумфонтейн Селтик","1 : 0"]
["30.10.16",null,"Мамелоди Сандаунс","Cape Town City","1 : 2"]
["19.10.16",null,"Cape Town City","Блумфонтейн Селтик","2 : 0"]
[]
["Последние игры: Марицбург Юнайтед"]
["19.11.16",null,"Аякс Кейп Таун","Марицбург Юнайтед","1 : 2"]
["02.11.16",null,"Марицбург Юнайтед","Хайлендс","1 : 1"]
["28.10.16",null,"Марицбург Юнайтед","Голден Арроус","2 : 2"]
["22.10.16",null,"Кайзер Чифс","Марицбург Юнайтед","1 : 0"]
["15.10.16",null,"Фри Стейт Старс","Марицбург Юнайтед","1 : 1"]
[]
[]
["15.04.16",null,"Марицбург Юнайтед","Cape Town City","0 : 2"]
["02.04.16",null,"Cape Town City","Марицбург Юнайтед","2 : 0"]
["27.09.15",null,"Cape Town City","Марицбург Юнайтед","4 : 1"]
["15.04.15",null,"Cape Town City","Марицбург Юнайтед","1 : 0"]
["18.02.15",null,"Cape Town City","Марицбург Юнайтед","2 : 1"]
["Последние игры: Платинум Старс"]
["19.11.16",null,"Платинум Старс","Бидвест Витс","0 : 1"]
["02.11.16",null,"Голден Арроус","Платинум Старс","0 : 1"]
["28.10.16",null,"Чиппа Юнайтед","Платинум Старс","1 : 1"]
["23.10.16",null,"Барока","Платинум Старс","3 : 1"]
["15.10.16",null,"Платинум Старс","Блумфонтейн Селтик","0 : 1"]
[]
["Последние игры: Аякс Кейп Таун"]
["19.11.16",null,"Аякс Кейп Таун","Марицбург Юнайтед","1 : 2"]
["02.11.16",null,"Фри Стейт Старс","Аякс Кейп Таун","1 : 1"]
["29.10.16",null,"Аякс Кейп Таун","Суперспорт Юнайтед","0 : 2"]
["26.10.16",null,"Аякс Кейп Таун","Бидвест Витс","1 : 2"]
["22.10.16",null,"Суперспорт Юнайтед","Аякс Кейп Таун","1 : 0"]
[]
[]
["13.04.16",null,"Аякс Кейп Таун","Платинум Старс","1 : 1"]
["13.03.16",null,"Платинум Старс","Аякс Кейп Таун","3 : 0"]
["04.04.15",null,"Платинум Старс","Аякс Кейп Таун","2 : 1"]
["22.10.14",null,"Аякс Кейп Таун","Платинум Старс","2 : 1"]
["10.05.14",null,"Платинум Старс","Аякс Кейп Таун","3 : 0"]
["Последние игры: Чиппа Юнайтед"]
["19.11.16",null,"Чиппа Юнайтед","Cape Town City","1 : 2"]
["01.11.16",null,"Бидвест Витс","Чиппа Юнайтед","1 : 0"]
["28.10.16",null,"Чиппа Юнайтед","Платинум Старс","1 : 1"]
["25.10.16",null,"Чиппа Юнайтед","Блумфонтейн Селтик","0 : 0"]
["21.10.16",null,"Хайлендс","Чиппа Юнайтед","2 : 0"]
[]
["Последние игры: Орландо Пайратс"]
["19.11.16",null,"Орландо Пайратс","Фри Стейт Старс","1 : 0"]
["05.11.16",null,"Орландо Пайратс","Хайлендс","2 : 1"]
["01.11.16",null,"Суперспорт Юнайтед","Орландо Пайратс","6 : 1"]
["29.10.16",null,"Орландо Пайратс","Кайзер Чифс","0 : 0"]
["23.10.16",null,"Орландо Пайратс","Голден Арроус","2 : 1"]
[]
[]
["11.05.16",null,"Чиппа Юнайтед","Орландо Пайратс","2 : 0"]
["18.08.15",null,"Орландо Пайратс","Чиппа Юнайтед","4 : 1"]
["10.03.15",null,"Орландо Пайратс","Чиппа Юнайтед","2 : 0"]
["27.09.14",null,"Чиппа Юнайтед","Орландо Пайратс","1 : 0"]
["30.04.13",null,"Орландо Пайратс","Чиппа Юнайтед","0 : 1"]

{"sheet":"settings","index":4,"n_rows":15,"n_cols":6,"rows_kept":15,"cut":false,"hidden":true,"merged":[]}
["GMT +0",4,{"$f":"TODAY()-7","v":"2019-08-30"},8,"soccerstand.com",1]
["GMT +1",null,{"$f":"TODAY()-6","v":"2019-08-31"},null,"flashscore.com"]
["GMT +2",null,{"$f":"TODAY()-5","v":"2019-09-01"},null,"myscore.ru"]
["GMT +3",null,{"$f":"TODAY()-4","v":"2019-09-02"},null,"myscore.com.ua"]
["GMT +4",null,{"$f":"TODAY()-3","v":"2019-09-03"}]
["GMT +5",null,{"$f":"TODAY()-2","v":"2019-09-04"}]
["GMT +6",null,"Вчера"]
["GMT +7",null,"Сегодня"]
["GMT +8",null,"Завтра"]
["GMT +9",null,{"$f":"TODAY()+2","v":"2019-09-08"}]
["GMT +10",null,{"$f":"TODAY()+3","v":"2019-09-09"}]
["GMT +11",null,{"$f":"TODAY()+4","v":"2019-09-10"}]
["GMT +12",null,{"$f":"TODAY()+5","v":"2019-09-11"}]
["GMT +13",null,{"$f":"TODAY()+6","v":"2019-09-12"}]
[null,null,{"$f":"TODAY()+7","v":"2019-09-13"}]

{"sheet":"Прогноз","index":5,"n_rows":27,"n_cols":15,"rows_kept":27,"cut":false,"hidden":true,"merged":[[24,0,25,0],[24,1,25,1],[24,2,25,2],[24,3,25,3],[26,0,27,0],[26,1,27,1],[26,2,27,2],[26,3,27,3],[20,0,20,8],[21,0,21,3],[22,0,23,0],[22,1,23,1],[22,2,23,2],[22,3,23,3],[22,5,23,5],[22,7,23,7],[15,13,15,14],[16,11,16,12],[16,13,16,14],[17,11,17,12],[17,13,17,14],[18,4,18,5],[11,10,11,11],[14,0,15,0],[14,1,15,2],[14,4,14,5],[14,7,14,8],[15,11,15,12],[7,13,7,14],[8,0,10,0],[8,2,10,2],[8,11,8,12],[8,13,8,14],[9,11,9,12],[9,13,9,14],[10,7,12,7],[11,0,12,0],[11,2,12,2],[4,11,4,12],[5,0,6,0],[5,2,6,2],[5,11,5,12],[6,7,8,7],[7,11,7,12],[1,15,1,16],[2,0,4,0],[2,2,4,2],[2,4,2,5],[2,7,2,8],[2,10,3,10],[2,11,2,12],[3,4,3,5],[3,7,3,8],[3,11,3,12],[0,0,1,2],[0,3,0,5],[0,8,0,9],[0,11,0,12],[1,3,1,8],[1,9,1,14]]}
[null,null,null,"Прогнозируемые команды:",null,null,{"$f":"($F9+$F13)/2","v":0.31175355816182482},"(Хозяева)",{"$f":"'Команда 1'!A3","v":"Линчеппинг"},null,"VS",{"$f":"'Команда 2'!A3","v":"Фрелунда"},null,"(Гости)",{"$f":"($G9+$G13)/2","v":0.68824644183817507}]
[null,null,null,"ПРОГНОЗЫ",null,null,null,null,null,"СТАТИСТИКА"]
["Результат из ТС (риск)",null,"Рисковый точный счет (редко)",null,"Обе забьют",null,null,"Сколько могут забить",null,null,"Команды","Статистика голов в среднем"]
[null,null,null,null,{"$f":"IF(С5!C25=\"ДА\",\"ДА\",IF(B19>=1,IF(B20>=1,\"ДА\",\"НЕТ\"),\"НЕТ\"))","v":"ДА"},null,null,{"$f":"С1!Q11","v":5.1023809523809529},null,null,null,"Забили/Пропустили"]
[null,null,null,null,null,null,null,null,null,null,{"$f":"I1","v":"Линчеппинг"},{"$f":"CONCATENATE(ROUND(С1!I6,2),\"/ \",ROUND(С1!E6,2))","v":"2,86/ 2,8"}]
[{"$f":"IF(С1!T25+С1!T26+С1!T27=6,\"П1\",IF(С1!T25+С1!T26+С1!T27=5,\"Ф1(0)\",IF(С1!T25+С1!T26+С1!T27=4,\"1Х\",IF(С1!T25+С1!T26+С1!T27=3,\"Х\",IF(С1!T25+С1!T26+С1!T27=2,\"Х2\",IF(С1!T25+С1!T26+С1!T27=1,\"Ф2(0)\",\"П2\"))))))","v":"П2"},null,{"$f":"CONCATENATE(С1!X24,\" : \",С1!Y24)","v":"- : -"},null,"Сила по голам",{"$f":"K5","v":"Линчеппинг"},{"$f":"K6","v":"Фрелунда"},"Исход по голам",null,null,{"$f":"L1","v":"Фрелунда"},{"$f":"CONCATENATE(ROUND(С1!B7,2),\"/\",ROUND(С1!E7,2))","v":"3,5/1,7"}]
[null,null,null,null,"Общая",{"$f":"(С1!$B6/С1!$E6)*100","v":75.000000000000014},{"$f":"(С1!$B7/С1!$E7)*100","v":205.88235294117649},{"$f":"IF(G9>=85%,\"П2\",IF(G9>=65%,\"Ф2(0)\",IF(G9>=51%,\"X2\",IF(F9>=85%,\"П1\",IF(F9>=65%,\"Ф1(0)\",IF(F9>=51%,\"1Х\",\"Х\"))))))","v":"Ф2(0)"}]
[null,null,null,null,"Дома/В гостях",{"$f":"(С1!I6/С1!L6)*100","v":125},{"$f":"(С1!O7/С1!R7)*100","v":210},null,null,null,"Команды","Общий проход ТБ 2,5",null,"Серия 5 последних игр"]
["Уверенный исход",null,"Уверенный тотал",null,"Успех",{"$f":"($F7+$F8)/($F$7+$F$8+$G$7+$G$8)","v":0.32473734479465138},{"$f":"($G7+$G8)/($F$7+$F$8+$G$7+$G$8)","v":0.67526265520534856},null,null,null,{"$f":"I1","v":"Линчеппинг"},{"$f":"С6!E29","v":"-  +  +  +  +"},null,{"$f":"С1!H21","v":"Н В П В В"}]
[null,null,null,null,"Сила по очкам",null,null,"Исход по очкам",null,null,{"$f":"L1","v":"Фрелунда"},{"$f":"С6!E30","v":"+  +  +  +  +"},null,{"$f":"С1!I21","v":"В П В В В"}]
[null,null,null,null,"Общая",{"$f":"(С1!H3/С1!B3)*100","v":100},{"$f":"(С1!H4/С1!B4)*100","v":270},{"$f":"IF(G13>=85%,\"П2\",IF(G13>=65%,\"Ф2(0)\",IF(G13>=51%,\"X2\",IF(F13>=85%,\"П1\",IF(F13>=65%,\"Ф1(0)\",IF(F13>=51%,\"1Х\",\"Х\"))))))","v":"Ф2(0)"}]
[{"$f":"IF(O1>=81%,\"П2\",IF(O1>=65%,\"Ф2(0)\",IF(O1>=51%,\"X2\",IF(G1>=81%,\"П1\",IF(G1>=65%,\"Ф1(0)\",IF(G1>=51%,\"1Х\",\"Х\"))))))","v":"Ф2(0)"},null,{"$f":"IF(С1!S31<1.95,\"ТМ5,5\",IF(С1!S31<=2.39,\"ТМ6\",IF(С1!S31>=2.8,\"ТБ4\",IF(С1!S31>=3.15,\"ТБ4,5)\",\"ТБ3,5\"))))","v":"ТБ4"},null,"Дома/В гостях",{"$f":"(С1!$O3/С1!$I3)*100","v":142.85714285714286},{"$f":"(С1!V4/С1!P4)*100","v":300},null,null,null,"Статистика:",null,"W/D/L","Заб/Проп"]
[null,null,null,null,"Успех",{"$f":"($F11+$F12)/($F$11+$F$12+$G$11+$G$12)","v":0.29876977152899825},{"$f":"($G11+$G12)/($F$11+$F$12+$G$11+$G$12)","v":0.70123022847100169},null,null,null,{"$f":"I1","v":"Линчеппинг"},"Дома",{"$f":"С1!AE19","v":"3/1/3"},{"$f":"С1!AF19","v":"20/16"}]
[null,null,null,null,null,null,null,null,null,null,{"$f":"L1","v":"Фрелунда"},"В гостях",{"$f":"С1!AG20","v":"6/0/0"},{"$f":"С1!AH20","v":"21/10"}]
["Первым забьет",{"$f":"С1!F25","v":"Фрелунда"},null,null,"Общий тотал",null,null,"Тоталы в процентах"]
[null,null,null,null,"ТОТАЛ БОЛЬШЕ","ТОТАЛ МЕНЬШЕ",null,"ТБ 2,5      %",{"$f":"IF(С1!S31<1.95,1.95-H4*(25/0.7),IF(С1!S31<=2.55,25+(2.55-H4)*(35/0.7),IF(С1!S31>=2.8,60+(H4-2.8)*(15/0.3),IF(С1!S31>=3.15,75+(H4-3.15)*(25/0.7),50+(H4-2.65)*(10/0.2)))))","v":175.11904761904765},null,"Команды","Все матчи W/D/L",null,"Все голы Заб/Проп"]
[null,null,null,null,{"$f":"С1!A30","v":3.5},{"$f":"С1!C30","v":6.5},null,"ТМ 2,5     %",{"$f":"100-I16","v":-75.119047619047649},null,{"$f":"I1","v":"Линчеппинг"},{"$f":"С1!AC19","v":"3/1/6"},null,{"$f":"С1!AD19","v":"21/28"}]
["ИНД.ТОТАЛ","ТОТАЛ БОЛЬШЕ","ТОТАЛ МЕНЬШЕ",null,null,null,null,null,null,null,{"$f":"L1","v":"Фрелунда"},{"$f":"С1!AC20","v":"9/0/1"},null,{"$f":"С1!AD20","v":"35/17"}]
[{"$f":"I1","v":"Линчеппинг"},{"$f":"С1!A34","v":1},{"$f":"С1!C34","v":2.5},null,"Средний точный счет(риск)"]
[{"$f":"L1","v":"Фрелунда"},{"$f":"С1!A38","v":3},{"$f":"С1!C38","v":4.5},null,{"$f":"AVERAGE(B23,B25,B27)","v":2.3333333333333335},{"$f":"AVERAGE(Прогноз!C23,Прогноз!C25,Прогноз!C27)","v":3.6666666666666665}]
["РИСК"]
["Возможные точные счета по разным методам"]
["№1",{"$f":"IF(С1!Q16<=0,0,С1!Q16)","v":2},{"$f":"IF(С1!R16<=0,0,С1!R16)","v":3},"МЕТОД\nСТАТИСТИКИ",null,"Метод Таблицы (Опасно)",null,"Т. Синдиката и Altadar(Опасно)"]
[]
["№2",{"$f":"IF(С2!B7<=0,0,С2!B7)","v":2},{"$f":"IF(С2!C7<=0,0,С2!C7)","v":3},"МЕТОД\nПРОРОК",null,{"$f":"С1!P21","v":"П2"},null,{"$f":"С7!T12","v":"П2"}]
[]
["№3",{"$f":"IF(С3!K4<=0,0,С3!K4)","v":3},{"$f":"IF(С3!K8<=0,0,С3!K8)","v":5},"МЕТОД\nМИЛЛЕРА"]

{"sheet":"Команда 1","index":6,"n_rows":21,"n_cols":58,"rows_kept":21,"cut":false,"hidden":true,"merged":[[2,0,2,4],[2,56,2,57],[3,57,12,57],[0,0,0,4],[1,21,1,27],[1,28,1,34],[1,35,1,41],[1,42,1,45],[1,46,1,49]]}
["Команда 1 (ХОЗЯЕВА)"]
["Дата","Лига","Хозяева","Гости","Счёт",null,null,null,null,null,null,null,null,null,null,null,null,null,null,null,null,"Всего",null,null,null,null,null,null,"Дома",null,null,null,null,null,null,"В гостях",null,null,null,null,null,null,"Забивают дома",null,null,null,"Забивают в гостях"]
[{"$f":"F3","v":"Линчеппинг"},null,null,null,null,{"$f":"IF(COUNTIF(C4:D13,C4)>COUNTIF(C4:D13,D4),C4,D4)","v":"Линчеппинг"},"Заб","Проп","Рез","Турнир","Дом","Гость","Счёт","Команда1","Команда2","Голы1","Голы2","Где играла","Результат","Забито","Пропущено","Игр","В","Н","П","Забито","Пропущено","Очки","Игр","В","Н","П","Забито","Пропущено","Очки","Игр","В","Н","П","Забито","Пропущено","Очки",0,1,2,"3+",0,1,2,"3+","Забивают","Пропускают","Рейтинг","тотал",null,null,{"$f":"A3","v":"Линчеппинг"}]
[{"$f":"обработка!A2","v":"21.10.18"},{"$f":"обработка!B2","v":"SHL"},{"$f":"обработка!C2","v":"Линчеппинг"},{"$f":"обработка!D2","v":"Шеллефтео"},{"$f":"обработка!I2","v":"1 : 1"},null,{"$f":"IF(R4=\"Дома\",K4,L4)","v":1},{"$f":"IF(R4=\"Дома\",L4,K4)","v":1},{"$f":"IF(R4=\"Дома\",IF(K4>L4,\"В\",IF(K4=L4,\"Н\",\"П\")),IF(L4>K4,\"В\",IF(K4=L4,\"Н\",\"П\")))","v":"Н"},{"$f":"B4","v":"SHL"},{"$f":"VALUE(LEFT(M4,FIND(\":\",M4,1)-1))","v":1},{"$f":"VALUE(LEFT(RIGHT(M4,LEN(M4)-FIND(\":\",M4,1)),1))","v":1},{"$f":"SUBSTITUTE(E4,\" : \",\":\")","v":"1:1"},{"$f":"C4","v":"Линчеппинг"},"Шеллефтео",{"$f":"VALUE(LEFT(M4,FIND(\":\",M4,1)-1))","v":1},{"$f":"VALUE(LEFT(RIGHT(M4,LEN(M4)-FIND(\":\",M4,1)),1))","v":1},{"$f":"IF(C4=A$3,\"Дома\",\"В гостях\")","v":"Дома"},{"$f":"I4","v":"Н"},{"$f":"G4","v":1},1,1,{"$f":"IF(S4=\"В\",1,0)","v":0},{"$f":"IF(S4=\"Н\",1,0)","v":1},{"$f":"IF(S4=\"П\",1,0)","v":0},{"$f":"T4","v":1},{"$f":"U4","v":1},{"$f":"W4*3+X4","v":1},{"$f":"IF(R4=\"Дома\",1,0)","v":1},{"$f":"IF(R4=\"Дома\",IF(S4=\"В\",1,0),0)","v":0},{"$f":"IF(R4=\"Дома\",IF(S4=\"Н\",1,0),0)","v":1},{"$f":"IF(R4=\"Дома\",IF(S4=\"П\",1,0),0)","v":0},{"$f":"IF(R4=\"Дома\",T4,0)","v":1},{"$f":"IF(R4=\"Дома\",U4,0)","v":1},{"$f":"AD4*3+AE4","v":1},{"$f":"IF(R4<>\"Дома\",1,0)","v":0},{"$f":"IF(R4<>\"Дома\",IF(S4=\"В\",1,0),0)","v":0},{"$f":"IF(R4<>\"Дома\",IF(S4=\"Н\",1,0),0)","v":0},{"$f":"IF(R4<>\"Дома\",IF(S4=\"П\",1,0),0)","v":0},{"$f":"IF(R4<>\"Дома\",T4,0)","v":0},{"$f":"IF(R4<>\"Дома\",U4,0)","v":0},{"$f":"AK4*3+AL4","v":0},{"$f":"IF(R4=\"Дома\",IF(T4=0,1,0),0)","v":0},{"$f":"IF(R4=\"Дома\",IF(T4=1,1,0),0)","v":1},{"$f":"IF(R4=\"Дома\",IF(T4=2,1,0),0)","v":0},{"$f":"IF(R4=\"Дома\",IF(T4>=3,1,0),0)","v":0},{"$f":"IF(R4<>\"Дома\",IF(X4=0,1,0),0)","v":0},{"$f":"IF(R4<>\"Дома\",IF(X4=1,1,0),0)","v":0},{"$f":"IF(R4<>\"Дома\",IF(X4=2,1,0),0)","v":0},{"$f":"IF(R4<>\"Дома\",IF(X4>=3,1,0),0)","v":0},{"$f":"V4/Z4","v":1},{"$f":"V4/AA4","v":1},{"$f":"(AI4/IF(AC4<1,1,AC4)+AP4/IF(AJ4<1,1,AJ4)*1.5+AG4/IF(AC4<1,1,AC4)+AN4/IF(AJ4<1,1,AJ4)*1.5-AH4/IF(AC4<1,1,AC4)*1.5-AO4/IF(AJ4<1,1,AJ4))/15","v":3.3333333333333333E-2},{"$f":"IF(R4=\"Дома\",T4+U4,\"\")","v":2},null,{"$f":"IF(R4=\"Дома\",IF(K4>L4,\"В\",IF(K4=L4,\"Н\",\"П\")),IF(L4>K4,\"В\",IF(K4=L4,\"Н\",\"П\")))","v":"Н"},{"$f":"IF(R4=\"Дома\",IF(K4>L4,3,IF(K4=L4,1,0)),IF(L4>K4,3,IF(K4=L4,1,0)))","v":1},"НАБРАННЫЕ ОЧКИ"]
[{"$f":"обработка!A3","v":"11.10.18"},{"$f":"обработка!B3","v":"SHL"},{"$f":"обработка!C3","v":"Линчеппинг"},{"$f":"обработка!D3","v":"Тимре"},{"$f":"обработка!I3","v":"4 : 2"},null,{"$f":"IF(R5=\"Дома\",K5,L5)","v":4},{"$f":"IF(R5=\"Дома\",L5,K5)","v":2},{"$f":"IF(R5=\"Дома\",IF(K5>L5,\"В\",IF(K5=L5,\"Н\",\"П\")),IF(L5>K5,\"В\",IF(K5=L5,\"Н\",\"П\")))","v":"В"},"SHL",{"$f":"VALUE(LEFT(M5,FIND(\":\",M5,1)-1))","v":4},{"$f":"VALUE(LEFT(RIGHT(M5,LEN(M5)-FIND(\":\",M5,1)),1))","v":2},"4:2","Линчеппинг","Тимре",{"$f":"VALUE(LEFT(M5,FIND(\":\",M5,1)-1))","v":4},{"$f":"VALUE(LEFT(RIGHT(M5,LEN(M5)-FIND(\":\",M5,1)),1))","v":2},{"$f":"IF(C5=A$3,\"Дома\",\"В гостях\")","v":"Дома"},"В",4,2,{"$f":"V4+1","v":2},{"$f":"IF(S5=\"В\",W4+1,W4+0)","v":1},{"$f":"IF(S5=\"Н\",X4+1,X4+0)","v":1},{"$f":"IF(S5=\"П\",Y4+1,Y4+0)","v":0},{"$f":"T5+Z4","v":5},3,{"$f":"W5*3+X5","v":4},{"$f":"IF(R5=\"Дома\",AC4+1,AC4+0)","v":2},{"$f":"IF(R5=\"Дома\",IF(S5=\"В\",AD4+1,AD4+0),AD4+0)","v":1},{"$f":"IF(R5=\"Дома\",IF(S5=\"Н\",AE4+1,AE4+0),AE4+0)","v":1},{"$f":"IF(R5=\"Дома\",IF(S5=\"П\",AF4+1,AF4+0),AF4+0)","v":0},{"$f":"IF(R5=\"Дома\",AG4+T5,AG4+0)","v":5},{"$f":"IF(R5=\"Дома\",AH4+U5,AH4+0)","v":3},{"$f":"AD5*3+AE5","v":4},{"$f":"IF(R5<>\"Дома\",AJ4+1,AJ4+0)","v":0},{"$f":"IF(R5<>\"Дома\",IF(S5=\"В\",AK4+1,AK4+0),AK4+0)","v":0},{"$f":"IF(R5<>\"Дома\",IF(S5=\"Н\",AL4+1,AL4+0),AL4+0)","v":0},{"$f":"IF(R5<>\"Дома\",IF(S5=\"П\",AM4+1,AM4+0),AM4+0)","v":0},{"$f":"IF(R5<>\"Дома\",AN4+T5,AN4+0)","v":0},{"$f":"IF(R5<>\"Дома\",AO4+U5,AO4+0)","v":0},{"$f":"AK5*3+AL5","v":0},{"$f":"IF(R5=\"Дома\",IF(T5=0,AQ4+1,AQ4),AQ4)","v":0},{"$f":"IF(R5=\"Дома\",IF(T5=1,AR4+1,AR4),AR4)","v":1},{"$f":"IF(R5=\"Дома\",IF(T5=2,AS4+1,AS4),AS4)","v":0},{"$f":"IF(R5=\"Дома\",IF(T5>=3,AT4+1,AT4),AT4)","v":1},{"$f":"IF(R5<>\"Дома\",IF(T5=0,AU4+1,AU4),AU4)","v":0},{"$f":"IF(R5<>\"Дома\",IF(T5=1,AV4+1,AV4),AV4)","v":0},{"$f":"IF(R5<>\"Дома\",IF(T5=2,AW4+1,AW4),AW4)","v":0},{"$f":"IF(R5<>\"Дома\",IF(T5>=3,AX4+1,AX4),AX4)","v":0},{"$f":"V5/Z5","v":0.4},{"$f":"V5/AA5","v":0.66666666666666663},{"$f":"(AI5/IF(AC5<1,1,AC5)+AP5/IF(AJ5<1,1,AJ5)*1.5+AG5/IF(AC5<1,1,AC5)+AN5/IF(AJ5<1,1,AJ5)*1.5-AH5/IF(AC5<1,1,AC5)*1.5-AO5/IF(AJ5<1,1,AJ5))/15","v":0.15},{"$f":"IF(R5=\"Дома\",T5+U5,\"\")","v":6},null,"В",{"$f":"IF(R5=\"Дома\",IF(K5>L5,3,IF(K5=L5,1,0)),IF(L5>K5,3,IF(K5=L5,1,0)))","v":3}]
[{"$f":"обработка!A4","v":"06.10.18"},{"$f":"обработка!B4","v":"SHL"},{"$f":"обработка!C4","v":"Ферьестад"},{"$f":"обработка!D4","v":"Линчеппинг"},{"$f":"обработка!I4","v":"3 : 0"},null,0,3,"П","SHL",3,0,"3:0","Ферьестад","Линчеппинг",3,0,"В гостях","П",0,3,3,{"$f":"IF(S6=\"В\",W5+1,W5+0)","v":1},1,1,5,6,4,2,1,1,0,5,3,4,{"$f":"IF(R6<>\"Дома\",AJ5+1,AJ5+0)","v":1},0,0,1,0,3,0,{"$f":"IF(R6=\"Дома\",IF(T6=0,AQ5+1,AQ5),AQ5)","v":0},1,0,1,1,0,0,0,0.6,0.5,-0.05,"",null,"П",0]
[{"$f":"обработка!A5","v":"04.10.18"},{"$f":"обработка!B5","v":"SHL"},{"$f":"обработка!C5","v":"Линчеппинг"},{"$f":"обработка!D5","v":"Мора"},{"$f":"обработка!I5","v":"7 : 4"},null,7,4,"В","SHL",7,4,"7:4","Линчеппинг","Мора",7,4,"Дома","В",7,4,4,2,1,1,12,10,7,3,2,1,0,12,7,7,1,0,0,1,0,3,0,0,1,0,2,1,0,0,0,0.33333333333333331,0.4,-1.1111111111111072E-2,11,null,"В",3]
[{"$f":"обработка!A6","v":"02.10.18"},{"$f":"обработка!B6","v":"SHL"},{"$f":"обработка!C6","v":"Линчеппинг"},{"$f":"обработка!D6","v":"Брюнес"},{"$f":"обработка!I6","v":"4 : 0"},null,4,0,"В","SHL",4,0,"4:0","Линчеппинг","Брюнес",4,0,"Дома","В",4,0,5,3,1,1,16,10,10,4,3,1,0,16,7,10,1,0,0,1,{"$f":"IF(R8<>\"Дома\",AN7+T8,AN7+0)","v":0},3,0,0,1,0,3,1,0,0,0,0.3125,0.5,5.8333333333333334E-2,4,null,"В",3]
[{"$f":"обработка!A16","v":"19.12.17"},{"$f":"обработка!B16","v":"SHL"},{"$f":"обработка!C16","v":"Линчеппинг"},{"$f":"обработка!D16","v":"Фрелунда"},{"$f":"обработка!I16","v":"0 : 2"},null,0,2,"П","SHL",0,2,"0:2","Линчеппинг","Фрелунда",0,2,"Дома","П",0,2,6,3,1,2,16,12,10,5,3,1,1,16,9,10,1,0,0,1,0,3,0,1,1,0,3,1,0,0,0,0.375,0.5,-3.3333333333333333E-2,2,null,"П",0]
[{"$f":"обработка!A17","v":"25.11.17"},{"$f":"обработка!B17","v":"SHL"},{"$f":"обработка!C17","v":"Фрелунда"},{"$f":"обработка!D17","v":"Линчеппинг"},{"$f":"обработка!I17","v":"5 : 1"},null,1,5,"П","SHL",5,1,"5:1","Фрелунда","Линчеппинг",5,1,"В гостях","П",1,5,7,3,1,3,17,17,10,5,3,1,1,16,9,10,2,0,0,2,1,8,0,1,1,0,3,1,1,0,0,0.41176470588235292,0.41176470588235292,-0.05,"",null,"П",0]
[{"$f":"обработка!A18","v":"28.10.17"},{"$f":"обработка!B18","v":"SHL"},{"$f":"обработка!C18","v":"Фрелунда"},{"$f":"обработка!D18","v":"Линчеппинг"},{"$f":"обработка!I18","v":"4 : 0"},null,0,4,"П","SHL",4,0,"4:0","Фрелунда","Линчеппинг",4,0,"В гостях","П",0,4,8,3,1,4,17,21,10,5,3,1,1,{"$f":"IF(R11=\"Дома\",AG10+T11,AG10+0)","v":16},9,10,3,0,0,3,1,12,0,1,1,0,3,2,1,0,0,0.47058823529411764,0.38095238095238093,-6.6666666666666666E-2,"",null,"П",0]
[{"$f":"обработка!A19","v":"14.10.17"},{"$f":"обработка!B19","v":"SHL"},{"$f":"обработка!C19","v":"Линчеппинг"},{"$f":"обработка!D19","v":"Фрелунда"},{"$f":"обработка!I19","v":"2 : 3"},null,2,3,"П","SHL",2,3,"2:3","Линчеппинг","Фрелунда",2,3,"Дома","П",2,3,9,3,1,5,19,24,10,6,3,1,2,18,12,10,3,0,0,3,1,12,0,1,1,1,3,2,1,0,0,0.47368421052631576,0.375,-0.1222222222222222,5,null,"П",0]
[{"$f":"обработка!A20","v":"09.03.17"},{"$f":"обработка!B20","v":"SHL"},{"$f":"обработка!C20","v":"Линчеппинг"},{"$f":"обработка!D20","v":"Фрелунда"},{"$f":"обработка!I20","v":"2 : 4"},null,2,4,"П","SHL",2,4,"2:4","Линчеппинг","Фрелунда",2,4,"Дома","П",2,4,10,3,1,6,21,28,10,7,3,1,3,20,16,10,3,0,0,3,1,12,0,1,1,2,3,2,1,0,0,0.47619047619047616,0.35714285714285715,-0.17619047619047618,6,null,"П",0]
["2015-05-23","VYS","Витебск","Динамо Минск","0 : 0",null,1,{"$f":"IF(S4=\"В\",IF(T4-U4>1.5,\"EW\",\"W\"),\"ЛОЛ\")","v":"ЛОЛ"},{"$f":"IF(H14=\"ЛОЛ\",J14,H14)","v":"D"},{"$f":"IF(S4=\"П\",IF(((T4-U4)*(-1))<1.5,\"L\",\"HL\"),\"D\")","v":"D"}]
["2015-05-16","VYS","Славия Мозырь","Витебск","4 : 0",null,2,{"$f":"IF(S5=\"В\",IF(T5-U5>1.5,\"EW\",\"W\"),\"ЛОЛ\")","v":"EW"},{"$f":"IF(H15=\"ЛОЛ\",J15,H15)","v":"EW"},{"$f":"IF(S5=\"П\",IF(((T5-U5)*(-1))<1.5,\"L\",\"HL\"),\"D\")","v":"D"}]
["2015-05-11","VYS","Витебск","Слуцк","1 : 0",null,3,{"$f":"IF(S6=\"В\",IF(T6-U6>1.5,\"EW\",\"W\"),\"ЛОЛ\")","v":"ЛОЛ"},{"$f":"IF(H16=\"ЛОЛ\",J16,H16)","v":"HL"},{"$f":"IF(S6=\"П\",IF(((T6-U6)*(-1))<1.5,\"L\",\"HL\"),\"D\")","v":"HL"}]
["2015-05-03","VYS","Динамо-Брест","Витебск","3 : 2",null,4,{"$f":"IF(S7=\"В\",IF(T7-U7>1.5,\"EW\",\"W\"),\"ЛОЛ\")","v":"EW"},{"$f":"IF(H17=\"ЛОЛ\",J17,H17)","v":"EW"},{"$f":"IF(S7=\"П\",IF(((T7-U7)*(-1))<1.5,\"L\",\"HL\"),\"D\")","v":"D"}]
["2015-04-26","VYS","Витебск","Нафтан","1 : 3",null,5,{"$f":"IF(S8=\"В\",IF(T8-U8>1.5,\"EW\",\"W\"),\"ЛОЛ\")","v":"EW"},{"$f":"IF(H18=\"ЛОЛ\",J18,H18)","v":"EW"},{"$f":"IF(S8=\"П\",IF(((T8-U8)*(-1))<1.5,\"L\",\"HL\"),\"D\")","v":"D"}]
["2015-04-19","VYS","Белшина","Витебск","1 : 1"]
["2015-04-11","VYS","Гранит Микашевичи","Витебск","1 : 1"]
["2015-04-04","BEL","Витебск","Динамо Минск","1 : 3"]

{"sheet":"Команда 2","index":7,"n_rows":18,"n_cols":58,"rows_kept":18,"cut":false,"hidden":true,"merged":[[2,0,2,4],[2,56,2,57],[3,57,12,57],[24,0,28,4],[0,0,0,4],[1,21,1,27],[1,28,1,34],[1,35,1,41],[1,42,1,45],[1,46,1,49]]}
["Команда 2 (ГОСТИ)"]
["Дата","Лига","Хозяева","Гости","Счёт",null,null,null,null,null,null,null,null,null,null,null,null,null,null,null,null,"Всего",null,null,null,null,null,null,"Дома",null,null,null,null,null,null,"В гостях",null,null,null,null,null,null,"Забивают дома",null,null,null,"Забивают в гостях"]
[{"$f":"F3","v":"Фрелунда"},null,null,null,null,{"$f":"IF(COUNTIF(C4:D13,C4)>COUNTIF(C4:D13,D4),C4,D4)","v":"Фрелунда"},"Заб","Проп","Рез","Турнир","Дом","Гость","Счёт","Команда1","Команда2","Голы1","Голы2","Где играла","Результат","Забито","Пропущено","Игр","В","Н","П","Забито","Пропущено","Очки","Игр","В","Н","П","Забито","Пропущено","Очки","Игр","В","Н","П","Забито","Пропущено","Очки",0,1,2,"3+",0,1,2,"3+","Забивают","Пропускают","Рейтинг","тотал",null,null,{"$f":"A3","v":"Фрелунда"}]
[{"$f":"обработка!A9","v":"20.10.18"},{"$f":"обработка!B9","v":"SHL"},{"$f":"обработка!C9","v":"Фрелунда"},{"$f":"обработка!D9","v":"ХВ-71"},{"$f":"обработка!I9","v":"4 : 1"},null,{"$f":"IF(R4=\"Дома\",K4,L4)","v":4},{"$f":"IF(R4=\"Дома\",L4,K4)","v":1},{"$f":"IF(R4=\"Дома\",IF(K4>L4,\"В\",IF(K4=L4,\"Н\",\"П\")),IF(L4>K4,\"В\",IF(K4=L4,\"Н\",\"П\")))","v":"В"},{"$f":"B4","v":"SHL"},{"$f":"VALUE(LEFT(M4,FIND(\":\",M4,1)-1))","v":4},{"$f":"VALUE(LEFT(RIGHT(M4,LEN(M4)-FIND(\":\",M4,1)),1))","v":1},{"$f":"SUBSTITUTE(E4,\" : \",\":\")","v":"4:1"},{"$f":"C4","v":"Фрелунда"},"ХВ-71",{"$f":"VALUE(LEFT(M4,FIND(\":\",M4,1)-1))","v":4},{"$f":"VALUE(LEFT(RIGHT(M4,LEN(M4)-FIND(\":\",M4,1)),1))","v":1},{"$f":"IF(C4=A$3,\"Дома\",\"В гостях\")","v":"Дома"},{"$f":"I4","v":"В"},{"$f":"G4","v":4},1,1,{"$f":"IF(S4=\"В\",1,0)","v":1},{"$f":"IF(S4=\"Н\",1,0)","v":0},{"$f":"IF(S4=\"П\",1,0)","v":0},{"$f":"T4","v":4},{"$f":"U4","v":1},{"$f":"W4*3+X4","v":3},{"$f":"IF(R4=\"Дома\",1,0)","v":1},{"$f":"IF(R4=\"Дома\",IF(S4=\"В\",1,0),0)","v":1},{"$f":"IF(R4=\"Дома\",IF(S4=\"Н\",1,0),0)","v":0},{"$f":"IF(R4=\"Дома\",IF(S4=\"П\",1,0),0)","v":0},{"$f":"IF(R4=\"Дома\",T4,0)","v":4},{"$f":"IF(R4=\"Дома\",U4,0)","v":1},{"$f":"AD4*3+AE4","v":3},{"$f":"IF(R4<>\"Дома\",1,0)","v":0},{"$f":"IF(R4<>\"Дома\",IF(S4=\"В\",1,0),0)","v":0},{"$f":"IF(R4<>\"Дома\",IF(S4=\"Н\",1,0),0)","v":0},{"$f":"IF(R4<>\"Дома\",IF(S4=\"П\",1,0),0)","v":0},{"$f":"IF(R4<>\"Дома\",T4,0)","v":0},{"$f":"IF(R4<>\"Дома\",U4,0)","v":0},{"$f":"AK4*3+AL4","v":0},{"$f":"IF(R4=\"Дома\",IF(T4=0,1,0),0)","v":0},{"$f":"IF(R4=\"Дома\",IF(T4=1,1,0),0)","v":0},{"$f":"IF(R4=\"Дома\",IF(T4=2,1,0),0)","v":0},{"$f":"IF(R4=\"Дома\",IF(T4>=3,1,0),0)","v":1},{"$f":"IF(R4<>\"Дома\",IF(X4=0,1,0),0)","v":0},{"$f":"IF(R4<>\"Дома\",IF(X4=1,1,0),0)","v":0},{"$f":"IF(R4<>\"Дома\",IF(X4=2,1,0),0)","v":0},{"$f":"IF(R4<>\"Дома\",IF(X4>=3,1,0),0)","v":0},{"$f":"V4/Z4","v":0.25},{"$f":"V4/AA4","v":1},{"$f":"(AI4/IF(AC4<1,1,AC4)+AP4/IF(AJ4<1,1,AJ4)*1.5+AG4/IF(AC4<1,1,AC4)+AN4/IF(AJ4<1,1,AJ4)*1.5-AH4/IF(AC4<1,1,AC4)*1.5-AO4/IF(AJ4<1,1,AJ4))/15","v":0.36666666666666664},{"$f":"IF(R4=\"Дома\",T4+U4,\"\")","v":5},null,{"$f":"IF(R4=\"Дома\",IF(K4>L4,\"В\",IF(K4=L4,\"Н\",\"П\")),IF(L4>K4,\"В\",IF(K4=L4,\"Н\",\"П\")))","v":"В"},{"$f":"IF(R4=\"Дома\",IF(K4>L4,3,IF(K4=L4,1,0)),IF(L4>K4,3,IF(K4=L4,1,0)))","v":3},"НАБРАННЫЕ ОЧКИ"]
[{"$f":"обработка!A10","v":"18.10.18"},{"$f":"обработка!B10","v":"SHL"},{"$f":"обработка!C10","v":"Фрелунда"},{"$f":"обработка!D10","v":"Лулео"},{"$f":"обработка!I10","v":"1 : 5"},null,{"$f":"IF(R5=\"Дома\",K5,L5)","v":1},{"$f":"IF(R5=\"Дома\",L5,K5)","v":5},{"$f":"IF(R5=\"Дома\",IF(K5>L5,\"В\",IF(K5=L5,\"Н\",\"П\")),IF(L5>K5,\"В\",IF(K5=L5,\"Н\",\"П\")))","v":"П"},"SHL",{"$f":"VALUE(LEFT(M5,FIND(\":\",M5,1)-1))","v":1},{"$f":"VALUE(LEFT(RIGHT(M5,LEN(M5)-FIND(\":\",M5,1)),1))","v":5},"1:5","Фрелунда","Лулео",{"$f":"VALUE(LEFT(M5,FIND(\":\",M5,1)-1))","v":1},{"$f":"VALUE(LEFT(RIGHT(M5,LEN(M5)-FIND(\":\",M5,1)),1))","v":5},{"$f":"IF(C5=A$3,\"Дома\",\"В гостях\")","v":"Дома"},"П",1,5,{"$f":"V4+1","v":2},{"$f":"IF(S5=\"В\",W4+1,W4+0)","v":1},{"$f":"IF(S5=\"Н\",X4+1,X4+0)","v":0},{"$f":"IF(S5=\"П\",Y4+1,Y4+0)","v":1},{"$f":"T5+Z4","v":5},6,{"$f":"W5*3+X5","v":3},{"$f":"IF(R5=\"Дома\",AC4+1,AC4+0)","v":2},{"$f":"IF(R5=\"Дома\",IF(S5=\"В\",AD4+1,AD4+0),AD4+0)","v":1},{"$f":"IF(R5=\"Дома\",IF(S5=\"Н\",AE4+1,AE4+0),AE4+0)","v":0},{"$f":"IF(R5=\"Дома\",IF(S5=\"П\",AF4+1,AF4+0),AF4+0)","v":1},{"$f":"IF(R5=\"Дома\",AG4+T5,AG4+0)","v":5},{"$f":"IF(R5=\"Дома\",AH4+U5,AH4+0)","v":6},{"$f":"AD5*3+AE5","v":3},{"$f":"IF(R5<>\"Дома\",AJ4+1,AJ4+0)","v":0},{"$f":"IF(R5<>\"Дома\",IF(S5=\"В\",AK4+1,AK4+0),AK4+0)","v":0},{"$f":"IF(R5<>\"Дома\",IF(S5=\"Н\",AL4+1,AL4+0),AL4+0)","v":0},{"$f":"IF(R5<>\"Дома\",IF(S5=\"П\",AM4+1,AM4+0),AM4+0)","v":0},{"$f":"IF(R5<>\"Дома\",AN4+T5,AN4+0)","v":0},{"$f":"IF(R5<>\"Дома\",AO4+U5,AO4+0)","v":0},{"$f":"AK5*3+AL5","v":0},{"$f":"IF(R5=\"Дома\",IF(T5=0,AQ4+1,AQ4),AQ4)","v":0},{"$f":"IF(R5=\"Дома\",IF(T5=1,AR4+1,AR4),AR4)","v":1},{"$f":"IF(R5=\"Дома\",IF(T5=2,AS4+1,AS4),AS4)","v":0},{"$f":"IF(R5=\"Дома\",IF(T5>=3,AT4+1,AT4),AT4)","v":1},{"$f":"IF(R5<>\"Дома\",IF(T5=0,AU4+1,AU4),AU4)","v":0},{"$f":"IF(R5<>\"Дома\",IF(T5=1,AV4+1,AV4),AV4)","v":0},{"$f":"IF(R5<>\"Дома\",IF(T5=2,AW4+1,AW4),AW4)","v":0},{"$f":"IF(R5<>\"Дома\",IF(T5>=3,AX4+1,AX4),AX4)","v":0},{"$f":"V5/Z5","v":0.4},{"$f":"V5/AA5","v":0.33333333333333331},{"$f":"(AI5/IF(AC5<1,1,AC5)+AP5/IF(AJ5<1,1,AJ5)*1.5+AG5/IF(AC5<1,1,AC5)+AN5/IF(AJ5<1,1,AJ5)*1.5-AH5/IF(AC5<1,1,AC5)*1.5-AO5/IF(AJ5<1,1,AJ5))/15","v":-3.3333333333333333E-2},{"$f":"IF(R5=\"Дома\",T5+U5,\"\")","v":6},null,"П",{"$f":"IF(R5=\"Дома\",IF(K5>L5,3,IF(K5=L5,1,0)),IF(L5>K5,3,IF(K5=L5,1,0)))","v":0}]
[{"$f":"обработка!A11","v":"16.10.18"},{"$f":"обработка!B11","v":"ЛЧ"},{"$f":"обработка!C11","v":"Ольборг"},{"$f":"обработка!D11","v":"Фрелунда"},{"$f":"обработка!I11","v":"1 : 5"},null,5,1,"В","ЛЧ",1,5,"1:5","Ольборг","Фрелунда",1,5,"В гостях","В",5,1,3,{"$f":"IF(S6=\"В\",W5+1,W5+0)","v":2},0,1,10,7,6,2,1,0,1,5,6,3,{"$f":"IF(R6<>\"Дома\",AJ5+1,AJ5+0)","v":1},1,0,0,5,1,3,{"$f":"IF(R6=\"Дома\",IF(T6=0,AQ5+1,AQ5),AQ5)","v":0},1,0,1,0,0,0,1,0.3,0.42857142857142855,0.7,"",null,"В",3]
[{"$f":"обработка!A12","v":"13.10.18"},{"$f":"обработка!B12","v":"SHL"},{"$f":"обработка!C12","v":"Ферьестад"},{"$f":"обработка!D12","v":"Фрелунда"},{"$f":"обработка!I12","v":"3 : 4"},null,4,3,"В","SHL",3,4,"3:4","Ферьестад","Фрелунда",3,4,"В гостях","В",4,3,4,3,0,1,14,10,9,2,1,0,1,5,6,3,2,2,0,0,9,4,6,0,1,0,1,0,0,0,2,0.2857142857142857,0.4,0.58333333333333337,"",null,"В",3]
[{"$f":"обработка!A13","v":"11.10.18"},{"$f":"обработка!B13","v":"SHL"},{"$f":"обработка!C13","v":"Лулео"},{"$f":"обработка!D13","v":"Фрелунда"},{"$f":"обработка!I13","v":"2 : 3"},null,3,2,"В","SHL",2,3,"2:3","Лулео","Фрелунда",2,3,"В гостях","В",3,2,5,4,0,1,17,12,12,2,1,0,1,5,6,3,3,3,0,0,{"$f":"IF(R8<>\"Дома\",AN7+T8,AN7+0)","v":12},6,9,0,1,0,1,0,0,0,3,0.29411764705882354,0.41666666666666669,0.53333333333333333,"",null,"В",3]
[{"$f":"обработка!A16","v":"19.12.17"},{"$f":"обработка!B16","v":"SHL"},{"$f":"обработка!C16","v":"Линчеппинг"},{"$f":"обработка!D16","v":"Фрелунда"},{"$f":"обработка!I16","v":"0 : 2"},null,2,0,"В","SHL",0,2,"0:2","Линчеппинг","Фрелунда",0,2,"В гостях","В",2,0,6,5,0,1,19,12,15,2,1,0,1,5,6,3,4,4,0,0,14,6,12,0,1,0,1,0,0,1,3,0.31578947368421051,0.5,0.51666666666666672,"",null,"В",3]
[{"$f":"обработка!A17","v":"25.11.17"},{"$f":"обработка!B17","v":"SHL"},{"$f":"обработка!C17","v":"Фрелунда"},{"$f":"обработка!D17","v":"Линчеппинг"},{"$f":"обработка!I17","v":"5 : 1"},null,5,1,"В","SHL",5,1,"5:1","Фрелунда","Линчеппинг",5,1,"Дома","В",5,1,7,6,0,1,24,13,18,3,2,0,1,10,7,6,4,4,0,0,14,6,12,0,1,0,2,0,0,1,3,0.29166666666666669,0.53846153846153844,0.67222222222222228,6,null,"В",3]
[{"$f":"обработка!A18","v":"28.10.17"},{"$f":"обработка!B18","v":"SHL"},{"$f":"обработка!C18","v":"Фрелунда"},{"$f":"обработка!D18","v":"Линчеппинг"},{"$f":"обработка!I18","v":"4 : 0"},null,4,0,"В","SHL",4,0,"4:0","Фрелунда","Линчеппинг",4,0,"Дома","В",4,0,8,7,0,1,28,13,21,4,3,0,1,{"$f":"IF(R11=\"Дома\",AG10+T11,AG10+0)","v":14},7,9,4,4,0,0,14,6,12,0,1,0,3,0,0,1,3,0.2857142857142857,0.61538461538461542,0.7583333333333333,4,null,"В",3]
[{"$f":"обработка!A19","v":"14.10.17"},{"$f":"обработка!B19","v":"SHL"},{"$f":"обработка!C19","v":"Линчеппинг"},{"$f":"обработка!D19","v":"Фрелунда"},{"$f":"обработка!I19","v":"2 : 3"},null,3,2,"В","SHL",2,3,"2:3","Линчеппинг","Фрелунда",2,3,"В гостях","В",3,2,9,8,0,1,31,15,24,4,3,0,1,14,7,9,5,5,0,0,17,8,15,0,1,0,3,0,0,1,4,0.29032258064516131,0.6,0.7416666666666667,"",null,"В",3]
[{"$f":"обработка!A20","v":"09.03.17"},{"$f":"обработка!B20","v":"SHL"},{"$f":"обработка!C20","v":"Линчеппинг"},{"$f":"обработка!D20","v":"Фрелунда"},{"$f":"обработка!I20","v":"2 : 4"},null,4,2,"В","SHL",2,4,"2:4","Линчеппинг","Фрелунда",2,4,"В гостях","В",4,2,10,9,0,1,35,17,27,4,3,0,1,14,7,9,6,6,0,0,21,10,18,0,1,0,3,0,0,1,5,0.2857142857142857,0.58823529411764708,0.74722222222222223,"",null,"В",3]
["2015-03-03","POK","Аален","Хоффенхайм","0 : 2",null,1,{"$f":"IF(S4=\"В\",IF(T4-U4>1.5,\"EW\",\"W\"),\"ЛОЛ\")","v":"EW"},{"$f":"IF(H14=\"ЛОЛ\",J14,H14)","v":"EW"},{"$f":"IF(S4=\"П\",IF(((T4-U4)*(-1))<1.5,\"L\",\"HL\"),\"D\")","v":"D"}]
["2015-01-25","PRI","Депортиво Петаре","Депортиво Ансоатеги","0 : 0",null,2,{"$f":"IF(S5=\"В\",IF(T5-U5>1.5,\"EW\",\"W\"),\"ЛОЛ\")","v":"ЛОЛ"},{"$f":"IF(H15=\"ЛОЛ\",J15,H15)","v":"HL"},{"$f":"IF(S5=\"П\",IF(((T5-U5)*(-1))<1.5,\"L\",\"HL\"),\"D\")","v":"HL"}]
["2014-12-27","PRE","Итхад Аль Шортах","Харас Эль-Ходуд","0 : 0",null,3,{"$f":"IF(S6=\"В\",IF(T6-U6>1.5,\"EW\",\"W\"),\"ЛОЛ\")","v":"EW"},{"$f":"IF(H16=\"ЛОЛ\",J16,H16)","v":"EW"},{"$f":"IF(S6=\"П\",IF(((T6-U6)*(-1))<1.5,\"L\",\"HL\"),\"D\")","v":"D"}]
["2014-12-21","PRE","Смуха","Итхад Аль Шортах","1 : 0",null,4,{"$f":"IF(S7=\"В\",IF(T7-U7>1.5,\"EW\",\"W\"),\"ЛОЛ\")","v":"W"},{"$f":"IF(H17=\"ЛОЛ\",J17,H17)","v":"W"},{"$f":"IF(S7=\"П\",IF(((T7-U7)*(-1))<1.5,\"L\",\"HL\"),\"D\")","v":"D"}]
[null,null,null,null,null,null,5,{"$f":"IF(S8=\"В\",IF(T8-U8>1.5,\"EW\",\"W\"),\"ЛОЛ\")","v":"W"},{"$f":"IF(H18=\"ЛОЛ\",J18,H18)","v":"W"},{"$f":"IF(S8=\"П\",IF(((T8-U8)*(-1))<1.5,\"L\",\"HL\"),\"D\")","v":"D"}]

{"sheet":"С1","index":8,"n_rows":38,"n_cols":34,"rows_kept":38,"cut":false,"hidden":true,"merged":[[37,0,38,1],[37,2,38,3],[32,0,32,1],[32,2,32,3],[33,0,34,1],[33,2,34,3],[36,0,36,1],[36,2,36,3],[20,0,20,1],[20,2,20,3],[29,0,30,1],[29,2,30,3],[21,13,21,17],[23,0,23,4],[24,0,25,3],[24,5,25,6],[24,8,24,10],[24,13,24,15],[26,0,26,1],[26,2,26,3],[28,0,28,1],[28,2,28,3],[28,11,28,12],[16,32,16,33],[19,0,19,1],[19,2,19,3],[19,7,19,8],[19,9,19,11],[18,0,18,20],[12,15,13,18],[12,19,13,22],[13,0,13,2],[16,28,16,29],[16,30,16,31],[14,4,14,5],[14,6,14,8],[14,16,14,17],[14,20,14,21],[15,16,16,16],[15,17,16,17],[8,12,8,13],[9,1,9,2],[9,3,9,4],[9,5,9,6],[9,16,9,18],[10,1,10,2],[10,3,10,7],[10,8,10,11],[10,16,11,18],[11,3,11,4],[11,5,11,7],[11,8,11,9],[7,1,7,2],[7,3,7,4],[7,5,7,6],[8,1,8,2],[8,3,8,4],[8,5,8,6],[6,17,6,19],[5,1,5,3],[5,4,5,7],[5,8,5,10],[5,11,5,13],[5,14,5,16],[5,17,5,19],[6,1,6,3],[6,4,6,7],[6,8,6,10],[6,11,6,13],[6,14,6,16],[0,1,0,7],[0,8,0,14],[0,15,0,21],[4,1,4,3],[4,4,4,7],[4,8,4,10],[4,11,4,13],[4,14,4,16],[4,17,4,19]]}
[null,"Всего",null,null,null,null,null,null,"Дома",null,null,null,null,null,null,"На выезде"]
[null,"Игр","В","Н","П","Забито","Пропущено","Очки","Игр","В","Н","П","Забито","Пропущено","Очки","Игр","В","Н","П","Забито","Пропущено","Очки"]
["Хозяева",{"$f":"'Команда 1'!V13","v":10},{"$f":"'Команда 1'!W13","v":3},{"$f":"'Команда 1'!X13","v":1},{"$f":"'Команда 1'!Y13","v":6},{"$f":"'Команда 1'!Z13","v":21},{"$f":"'Команда 1'!AA13","v":28},{"$f":"'Команда 1'!AB13","v":10},{"$f":"'Команда 1'!AC13","v":7},{"$f":"'Команда 1'!AD13","v":3},{"$f":"'Команда 1'!AE13","v":1},{"$f":"'Команда 1'!AF13","v":3},{"$f":"'Команда 1'!AG13","v":20},{"$f":"'Команда 1'!AH13","v":16},{"$f":"'Команда 1'!AI13","v":10},{"$f":"'Команда 1'!AJ13","v":3},{"$f":"'Команда 1'!AK13","v":0},{"$f":"'Команда 1'!AL13","v":0},{"$f":"'Команда 1'!AM13","v":3},{"$f":"'Команда 1'!AN13","v":1},{"$f":"'Команда 1'!AO13","v":12},{"$f":"'Команда 1'!AP13","v":0}]
["Гости",{"$f":"'Команда 2'!V13","v":10},{"$f":"'Команда 2'!W13","v":9},{"$f":"'Команда 2'!X13","v":0},{"$f":"'Команда 2'!Y13","v":1},{"$f":"'Команда 2'!Z13","v":35},{"$f":"'Команда 2'!AA13","v":17},{"$f":"'Команда 2'!AB13","v":27},{"$f":"'Команда 2'!AC13","v":4},{"$f":"'Команда 2'!AD13","v":3},{"$f":"'Команда 2'!AE13","v":0},{"$f":"'Команда 2'!AF13","v":1},{"$f":"'Команда 2'!AG13","v":14},{"$f":"'Команда 2'!AH13","v":7},{"$f":"'Команда 2'!AI13","v":9},{"$f":"'Команда 2'!AJ13","v":6},{"$f":"'Команда 2'!AK13","v":6},{"$f":"'Команда 2'!AL13","v":0},{"$f":"'Команда 2'!AM13","v":0},{"$f":"'Команда 2'!AN13","v":21},{"$f":"'Команда 2'!AO13","v":10},{"$f":"'Команда 2'!AP13","v":18}]
[null,"Забивают",null,null,"Пропускают",null,null,null,"Забивают",null,null,"Пропускают",null,null,"Забивают",null,null,"Пропускают",null,null,1,{"$f":"J3/I3/(J3/I3+K3/I3+Q4/P4+R4/P4)","v":0.27272727272727271},{"$f":"C3/B3/(C3/B3+D3/B3+D4/B4+C4/B4)","v":0.23076923076923075},null,{"$f":"I6/L6*O6/R6*B6/E6*N16","v":0.19363839285714285},{"$f":"I7/L7*O7/R7*B7/E7*O16","v":30.264705882352946}]
["Хозяева",{"$f":"F3/B3","v":2.1},null,null,{"$f":"G3/B3","v":2.8},null,null,null,{"$f":"M3/I3","v":2.8571428571428572},null,null,{"$f":"N3/I3","v":2.2857142857142856},null,null,{"$f":"T3/P3","v":0.33333333333333331},null,null,{"$f":"U3/P3","v":4},null,null,"X",{"$f":"(K3/I3+R4/P4)/(J3/I3+K3/I3+Q4/P4+R4/P4)","v":9.0909090909090912E-2},{"$f":"(D3/B3+D4/B4)/(C3/B3+D3/B3+D4/B4+C4/B4)","v":7.6923076923076927E-2},null,{"$f":"Y5-N16","v":-2.2849330357142859},{"$f":"O16","v":3.5}]
["Гости",{"$f":"F4/B4","v":3.5},null,null,{"$f":"G4/B4","v":1.7},null,null,null,{"$f":"M4/I4","v":3.5},null,null,{"$f":"N4/I4","v":1.75},null,null,{"$f":"T4/P4","v":3.5},null,null,{"$f":"U4/P4","v":1.6666666666666667},null,null,2,{"$f":"Q4/P4/(J3/I3+K3/I3+Q4/P4+R4/P4)","v":0.63636363636363635},{"$f":"C4/B4/(C3/B3+D3/B3+D4/B4+C4/B4)","v":0.69230769230769229},null,{"$f":"IF(Y6=0,\"NO BET\",IF(Y6<0,\"П1 \",\"П2 \"))","v":"П1 "},{"$f":"IF(Z6=0,\"NO BET\",IF(Z6<0,\"П2 \",\"П1 \"))","v":"П1 "}]
["Тоталы","Ср. тотал",null,"Мощь",null,"Рейтинг",null,"Счет","Забит","Проп","Набр","Потер"]
["Хозяева",{"$f":"AVERAGE(I6,B6)+AVERAGE(R7,E7)-AVERAGE(O9)","v":1.1726190476190479},null,{"$f":"(I6-L6+B6-E6)/2","v":-6.4285714285714057E-2},null,{"$f":"(O3/I3+V3/P3*1.1+I6-L6*1.1+O6*1.1-R6)/12.6","v":-0.14777021919879063},null,{"$f":"B9","v":1.1726190476190479},{"$f":"'Команда 1'!AG8*1.5+'Команда 1'!AN8*2","v":24},{"$f":"'Команда 1'!AH8*1.5+'Команда 1'!AO8","v":13.5},{"$f":"I9/5","v":4.8},{"$f":"J9/5","v":2.7},"Ср. заб.",null,{"$f":"AVERAGE(B6,B7,I6,O7)","v":2.9892857142857143}]
["Гости",{"$f":"AVERAGE(O7,B7)+AVERAGE(L6,E6)-AVERAGE(O9)","v":3.0535714285714284},null,{"$f":"(O7-R7+B7-E7)/2","v":1.8166666666666664},null,{"$f":"(O4/I4+V4/P4*1.1+I7-L7*1.1+O7*1.1-R7)/12.6","v":0.73875661375661394},null,{"$f":"B10","v":3.0535714285714284},{"$f":"'Команда 2'!AG8*1.5+'Команда 2'!AN8*2","v":31.5},{"$f":"'Команда 2'!AH8*1.5+'Команда 2'!AO8","v":15},{"$f":"I10/5","v":6.3},{"$f":"J10/5","v":3},null,null,null,null,"ТОТАЛЫ",null,null,null,null,{"$f":"(3*J3/I3)+(K3/I3)+(3*S3/P3)","v":4.4285714285714288},{"$f":"$V10/(($V$10+$V$11+$V$12)/100)","v":48.4375}]
["Общий",{"$f":"B9+B10","v":4.2261904761904763},null,null,null,null,null,null,{"$f":"((K9+L10)/2+(K10+L9)/2)/2","v":4.2},null,null,null,null,null,null,null,{"$f":"(AVERAGE($B$6+$E$6,$B$7+$E$7)/2)+(AVERAGE($I$6+$L$6,$O$7+$R$7)/2)","v":5.1023809523809529},null,null,null,null,{"$f":"(3*K3/I3)+(3*R4/P4)","v":0.42857142857142855},{"$f":"$V11/(($V$10+$V$11+$V$12)/100)","v":4.6875}]
["Т(2.5)","Т1","Т2","Мощь",null,"1-Х-2",null,null,"Рейтинг",null,null,null,null,null,null,null,null,null,null,null,null,{"$f":"(3*L3/I3)+(3*Q4/P4)+(R4/P4)","v":4.2857142857142856},{"$f":"$V12/(($V$10+$V$11+$V$12)/100)","v":46.875}]
[{"$f":"B11","v":4.2261904761904763},{"$f":"B9","v":1.1726190476190479},{"$f":"B10","v":3.0535714285714284},{"$f":"D9","v":-6.4285714285714057E-2},{"$f":"D10","v":1.8166666666666664},{"$f":"AVERAGE(V5,W5)","v":0.25174825174825172},{"$f":"AVERAGE(V6,W6)","v":8.3916083916083919E-2},{"$f":"AVERAGE(V7,W7)","v":0.66433566433566438},{"$f":"F9","v":-0.14777021919879063},{"$f":"F10","v":0.73875661375661394},null,null,null,null,null,"Прогноз \"Точный счёт 1\"",null,null,null,"Прогноз \"Вероятность забитого гола\""]
["Прогноз \"Могут забить\""]
["Итоги","Т(2.5)","Т1","Т2","Серия",null,"1-Х-2",null,null,"Рейтинг",null,"Фора","1Х","Заб1","Заб2",null,"Счет",null,null,null,"Забьет гол "]
["10 игр",{"$f":"A13","v":4.2261904761904763},{"$f":"B13","v":1.1726190476190479},3.0535714285714284,null,null,{"$f":"F13","v":0.25174825174825172},8.3916083916083919E-2,{"$f":"H13","v":0.66433566433566438},{"$f":"I13","v":-0.14777021919879063},0.73875661375661394,{"$f":"C16-D16","v":-1.8809523809523805},{"$f":"IF(G16-I16>0.23,\"П1\",IF(G16>I16,\"1X\",IF(I16-G16>0.24,\"П2\",IF(I16>G16,\"Х2\",\"\"))))","v":"П2"},{"$f":"AVERAGE(I6,B6)","v":2.4785714285714286},{"$f":"AVERAGE(O7,B7)","v":3.5},null,{"$f":"ROUND(AVERAGE(F21,N16),0)","v":2},{"$f":"ROUND(AVERAGE(G21,O16),0)","v":3},null,null,{"$f":"IF(N16>0.6,\"Yes\",\"No\")","v":"Yes"},{"$f":"IF(O16>0.6,\"Yes\",\"No\")","v":"Yes"}]
[null,null,null,null,null,null,null,null,null,null,null,null,null,null,null,null,null,null,null,null,null,null,null,null,null,null,null,null,"ВСЕГО",null,"ДОМА",null,"ВЫЕЗД"]
[null,null,null,null,null,null,null,null,null,null,null,null,null,null,null,null,null,null,null,null,null,null,null,null,null,null,null,null,"WDL","Заб/Проп","WDL","Заб/Проп","WDL","Заб/Проп"]
["Среднее",null,null,null,null,null,null,null,null,null,null,null,null,null,null,null,null,null,null,null,null,null,null,null,null,null,null,null,{"$f":"CONCATENATE(C3,\"/\",D3,\"/\",E3)","v":"3/1/6"},{"$f":"CONCATENATE(F3,\"/\",G3)","v":"21/28"},{"$f":"CONCATENATE(J3,\"/\",K3,\"/\",L3)","v":"3/1/3"},{"$f":"CONCATENATE(M3,\"/\",N3)","v":"20/16"},{"$f":"CONCATENATE(Q3,\"/\",R3,\"/\",S3)","v":"0/0/3"},{"$f":"CONCATENATE(T3,\"/\",U3)","v":"1/12"}]
["Команда 1",null,"Команда 2",null,"Т","Т1","Т2","Серия",null,"1-Х-2",null,null,"1Х","Х2","Фора","1Х2","Заб 1","Заб 2","Тотал","Счет","ТБ(2.5)",null,null,null,null,null,null,null,{"$f":"CONCATENATE(C4,\"/\",D4,\"/\",E4)","v":"9/0/1"},{"$f":"CONCATENATE(F4,\"/\",G4)","v":"35/17"},{"$f":"CONCATENATE(J4,\"/\",K4,\"/\",L4)","v":"3/0/1"},{"$f":"CONCATENATE(M4,\"/\",N4)","v":"14/7"},{"$f":"CONCATENATE(Q4,\"/\",R4,\"/\",S4)","v":"6/0/0"},{"$f":"CONCATENATE(T4,\"/\",U4)","v":"21/10"}]
[{"$f":"'Команда 1'!A3","v":"Линчеппинг"},null,{"$f":"'Команда 2'!A3","v":"Фрелунда"},null,{"$f":"B16","v":4.2261904761904763},{"$f":"C16","v":1.1726190476190479},3.0535714285714284,{"$f":"CONCATENATE('Команда 1'!S4,\" \",'Команда 1'!S5,\" \",'Команда 1'!S6,\" \",'Команда 1'!S7,\" \",'Команда 1'!S8)","v":"Н В П В В"},{"$f":"CONCATENATE('Команда 2'!S4,\" \",'Команда 2'!S5,\" \",'Команда 2'!S6,\" \",'Команда 2'!S7,\" \",'Команда 2'!S8)","v":"В П В В В"},0.25174825174825172,8.3916083916083919E-2,0.66433566433566438,{"$f":"V5+V6/2","v":0.31818181818181818},{"$f":"V7+V6/2","v":0.68181818181818177},{"$f":"F21-G21","v":-1.8809523809523805},{"$f":"IF(AND(J21-L21>0.27,Q16>R16),\"П1\",IF(AND(J21>L21,Q16>=R16),\"1X\",IF(AND(L21-J21>0.12,R16>0),\"П2\",IF(AND(L21>J21,R16>=Q16),\"Х2\",\"\"))))","v":"П2"},{"$f":"'Команда 1'!AQ13*1000+'Команда 1'!AR13*100+'Команда 1'!AS13*10+'Команда 1'!AT13","v":1123},{"$f":"'Команда 2'!AQ13*1000+'Команда 1'!AR13*100+'Команда 1'!AS13*10+'Команда 1'!AT13","v":123},{"$f":"IF(E21>2.85,IF(Q16+R16>2,\"ТБ(2)\",\" \"),IF(E21<2.2,IF(Q16+R16<3,\"ТМ(3)\",\" \"),\" \"))","v":"ТБ(2)"},{"$f":"CONCATENATE(Q16,\":\",R16)","v":"2:3"},{"$f":"(COUNTIF('Команда 2'!BB4:BB13,\">2.5\")+COUNTIF('Команда 1'!BB4:BB13,\">2.5\"))/COUNT('Команда 1'!BB4:BB13,'Команда 2'!BB4:BB13)","v":0}]
[null,null,null,null,null,null,null,null,null,null,null,null,null,"Прогноз \"ИСХОД МАТЧА № 1\""]
[]
["Прогноз Тоталов  ИТБ / ТБ / ТМ",null,null,null,null,null,null,null,null,null,null,null,null,null,null,null,null,null,null,null,null,null,"Авантюрный ТС",{"$f":"IF(X25=X26,X25,\"-\")","v":"-"},{"$f":"IF(Y25=Y26,Y25,\"-\")","v":"-"}]
["Анализ Целиком",null,null,null,null,{"$f":"IF(F28>=G28,Прогноз!I1,Прогноз!L1)","v":"Фрелунда"},null,null,"1 вариант",null,null,null,null,"2 вариант",null,null,null,null,null,{"$f":"IF(Прогноз!B23>Прогноз!C23,2,IF(Прогноз!B23=Прогноз!C23,1,0))","v":0},null,null,null,{"$f":"IF(Прогноз!B23-Прогноз!B25+Прогноз!B27=Прогноз!B23,Прогноз!B23,\"-\")","v":"-"},{"$f":"IF(Прогноз!C23-Прогноз!C25+Прогноз!C27=Прогноз!C23,Прогноз!C23,\"-\")","v":"-"}]
[null,null,null,null,null,null,null,null,{"$f":"AVERAGE(B6+E6,B7+E7)/2","v":2.5250000000000004},{"$f":"AVERAGE(I6+L6,O7+R7)/2","v":2.5773809523809526},{"$f":"AVERAGE(I26,J26)","v":2.5511904761904765},null,null,{"$f":"(F3+G3+F4+G4+M3+N3+T4+U4)/10/AVERAGE(I3,P4)","v":2.5846153846153848},null,null,null,null,null,{"$f":"IF(Прогноз!B25>Прогноз!C25,2,IF(Прогноз!B25=Прогноз!C25,1,0))","v":0},null,null,null,{"$f":"IF(Прогноз!B25-Прогноз!B23+Прогноз!B27=Прогноз!B25,Прогноз!B25,\"-\")","v":"-"},{"$f":"IF(Прогноз!C25-Прогноз!C23+Прогноз!C27=Прогноз!C25,Прогноз!C25,\"-\")","v":"-"}]
[null,null,null,null,null,null,null,null,null,null,null,null,null,null,null,null,null,null,null,{"$f":"IF(Прогноз!B27>Прогноз!C27,2,IF(Прогноз!B27=Прогноз!C27,1,0))","v":0}]
[null,null,null,null,null,{"$f":"(I6+R7)/2","v":2.2619047619047619},{"$f":"(L6+O7)/2","v":2.8928571428571428}]
["ТБ",null,"ТМ",null,null,null,null,null,null,null,null,{"$f":"K26+N26","v":5.1358058608058617}]
[{"$f":"A34+A38-0.5","v":3.5},null,{"$f":"C34+C38-0.5","v":6.5},null,null,{"$f":"F28-G28","v":-0.63095238095238093},{"$f":"G28-F28","v":0.63095238095238093}]
[null,null,null,null,null,null,null,null,null,null,{"$f":"IF((L29/2)>=1.65,\"ТБ(4)\",\"ТМ(6)\")","v":"ТБ(4)"},{"$f":"IF(L29>1.85,\"ТБ(4)\",\"ТМ(6)\")","v":"ТБ(4)"},{"$f":"IF(N26>=2.05,\"ТБ(4,5)\",IF(N26>=1.76,\"ТБ(4)\",IF(N26>=1.46,\"ТБ(3,5)\",IF(N26<=1.45,\"ТМ(6)\",\"ТМ(5,5)\"))))","v":"ТБ(4,5)"},{"$f":"IF(L29>=3.5,\"ТБ(4,5)\",IF(L29>=3.15,\"ТБ(4)\",IF(L29>=2.8,\"ТБ(3,5)\",IF(L29>=2.5,\"ТМ(6)\",\"ТМ(5,5)\"))))","v":"ТБ(4,5)"},{"$f":"IF(S31<2.15,\"ТМ(5,5)\",IF(S31<=2.64,\"ТМ(6)\",IF(S31>=2.8,\"ТБ(4)\",IF(S31>=3.15,\"ТБ(4,5)\",\"ТБ(3,5)\"))))","v":"ТБ(4)"},null,null,null,{"$f":"I26+J26","v":5.1023809523809529}]
[]
["ТБ1",null,"ТМ1",null,null,null,{"$error":"#REF!"},{"$error":"#REF!"}]
[{"$f":"FLOOR(F21,1)","v":1},null,{"$f":"ROUNDUP((A34+1.5),1)","v":2.5}]
[]
[]
["ТБ2",null,"ТМ2"]
[{"$f":"FLOOR(G21,1)","v":3},null,{"$f":"ROUNDUP((A38+1.5),1)","v":4.5}]

{"sheet":"С2","index":9,"n_rows":12,"n_cols":7,"rows_kept":12,"cut":false,"hidden":true,"merged":[[8,0,8,1],[8,3,8,4],[0,0,0,1],[0,3,0,4],[0,6,0,11],[1,6,1,11],[5,0,6,0],[5,3,6,3]]}
["Количество голов забитых командой А",null,null,"Сколько голов забьёт команда Б в гостях",null,null,"Расчёт прогноза \"Точный счёт 2\"  по методу \"Пророк\""]
["Среднее количество голов, которые команда\n А забила у себя в домашних матчах","АЗД",{"$f":"B10/B12","v":2.8571428571428572},"Среднее количество голов, которые забивает команда Б на выезде","БЗВ",{"$f":"E10/E12","v":3.5},"http://vprognoze.ru/bet/strategy/3096-sistema-prorok.html"]
["Среднее количество голов, пропущенное\n командой Б на выезде","БПВ",{"$f":"E11/E12","v":1.6666666666666667},"Среднее количество голов, которые команда А пропускает в домашних матчах","АПД",{"$f":"B11/B12","v":2.2857142857142856}]
["Ожидаемое колличество голов, забитых \nкомандой А дома против гостевого соперника Б","А забьет",{"$f":"(C2+C3)/2","v":2.2619047619047619},"Сколько голов сможет забить команда Б\n на выезде команде А","Б забьет",{"$f":"(F2+F3)/2","v":2.8928571428571428}]
[]
["Примерный счет c округлением:","А забьет","Б забьет","Точный счет","А","Б"]
[null,{"$f":"ROUND(C4,0)","v":2},{"$f":"ROUND(F4,0)","v":3},null,{"$f":"ROUNDUP(C4,1)","v":2.3000000000000003},{"$f":"ROUNDUP(F4,1)","v":2.9}]
[]
[{"$f":"'Команда 1'!A3","v":"Линчеппинг"},null,null,{"$f":"'Команда 2'!A3","v":"Фрелунда"}]
["Забито в домашних матчах",{"$f":"С5!D4","v":20},null,"Забито в гостевых матчах",{"$f":"С5!E7","v":21}]
["Пропущено в домашних матчах",{"$f":"С5!F4","v":16},null,"Пропущено в гостевых матчах",{"$f":"С5!G7","v":10}]
["Домашних игр из последних 10 матчей",{"$f":"С5!B4","v":7},null,"Гостевых игр из последних 10 матчей",{"$f":"С5!C7","v":6}]

{"sheet":"С3","index":10,"n_rows":9,"n_cols":11,"rows_kept":9,"cut":false,"hidden":true,"merged":[[5,0,5,9],[7,0,7,1],[7,10,8,11],[8,0,8,1],[0,0,0,9],[0,12,0,17],[1,0,1,9],[2,12,2,17],[3,0,3,1],[3,10,4,11],[4,0,4,1]]}
["Силы Команд"]
[{"$f":"'Команда 1'!A3","v":"Линчеппинг"}]
[null,null,1,2,3,4,"Макс","Мин"]
["Сила Атаки",null,{"$f":"'Команда 1'!T4","v":1},{"$f":"'Команда 1'!T5","v":4},{"$f":"'Команда 1'!T6","v":0},{"$f":"'Команда 1'!T7","v":7},{"$f":"MAX(C4:F4)","v":7},{"$f":"MIN(C4:F4)","v":0},{"$f":"C4+D4+E4+F4-G4-H4","v":5},{"$f":"I4/2","v":2.5},{"$f":"ROUND(J4+J9-1.5,0)","v":3}]
["Сила Обороны",null,{"$f":"'Команда 1'!U4","v":1},{"$f":"'Команда 1'!U5","v":2},{"$f":"'Команда 1'!U6","v":3},{"$f":"'Команда 1'!U7","v":4},{"$f":"MAX(C5:F5)","v":4},{"$f":"MIN(C5:F5)","v":1},{"$f":"C5+D5+E5+F5-G5-H5","v":5},{"$f":"I5/2","v":2.5}]
[{"$f":"'Команда 2'!A3","v":"Фрелунда"}]
[null,null,1,2,3,4,"Макс","Мин"]
["Сила Атаки",null,{"$f":"'Команда 2'!T4","v":4},{"$f":"'Команда 2'!T5","v":1},{"$f":"'Команда 2'!T6","v":5},{"$f":"'Команда 2'!T7","v":4},{"$f":"MAX(C8:F8)","v":5},{"$f":"MIN(C8:F8)","v":1},{"$f":"C8+D8+E8+F8-G8-H8","v":8},{"$f":"I8/2","v":4},{"$f":"ROUND(J8+J5-1.5,0)","v":5}]
["Сила Обороны",null,{"$f":"'Команда 2'!U4","v":1},{"$f":"'Команда 2'!U5","v":5},{"$f":"'Команда 2'!U6","v":1},{"$f":"'Команда 2'!U7","v":3},{"$f":"MAX(C9:F9)","v":5},{"$f":"MIN(C9:F9)","v":1},{"$f":"C9+D9+E9+F9-G9-H9","v":4},{"$f":"I9/2","v":2}]

{"sheet":"С4","index":11,"n_rows":15,"n_cols":4,"rows_kept":15,"cut":false,"hidden":true,"merged":[[7,0,7,3],[0,4,0,8],[1,4,1,8]]}
[null,"Команда 1",null,"Команда 2"]
["Голов забито дома",{"$f":"С5!D12","v":16},null,{"$f":"С5!D15","v":5}]
["Голов забито в гостях",{"$f":"С5!E12","v":0},null,{"$f":"С5!E15","v":12}]
[]
["Голов пропущенно дома",{"$f":"С5!F12","v":7},null,{"$f":"С5!F15","v":6}]
["Голов пропущенно в гостях",{"$f":"С5!G12","v":3},null,{"$f":"С5!G15","v":6}]
[]
["Расчёт"]
[]
["Расчёт кефа забитых",{"$f":"((B2*1.5)+(B3*2))/5","v":4.8},null,{"$f":"((D2*1.5)+(D3*2))/5","v":6.3}]
["Расчёт кефа пропущенных",{"$f":"((B5*1.5)+B6)/5","v":2.7},null,{"$f":"((D5*1.5)+D6)/5","v":3}]
[]
["Кф. По каждой команде",{"$f":"(B10+D11)/2","v":3.9},null,{"$f":"(D10+B11)/2","v":4.5}]
[]
["Кеф на тб2.5",null,{"$f":"(B13+D13)/2","v":4.2}]

{"sheet":"С5","index":12,"n_rows":25,"n_cols":7,"rows_kept":25,"cut":false,"hidden":true,"merged":[[1,8,7,8],[8,0,8,6],[24,0,24,1],[0,0,0,6],[1,1,1,2],[1,3,1,4],[1,5,1,6],[9,1,9,2],[9,3,9,4],[9,5,9,6],[16,0,16,3],[23,0,23,3]]}
["10 матчей"]
["Кто играет :","Из них",null,"Забито",null,"Пропущено"]
["Дома","Матчей Дома","Матчей в Гостях","Голы Дома","Голы в Гостях","Голы Дома","Голы в Гостях"]
[{"$f":"'Команда 1'!A3","v":"Линчеппинг"},{"$f":"'Команда 1'!AC13","v":7},{"$f":"'Команда 1'!AJ13","v":3},{"$f":"'Команда 1'!AG13","v":20},{"$f":"'Команда 1'!AN13","v":1},{"$f":"'Команда 1'!AH13","v":16},{"$f":"'Команда 1'!AO13","v":12}]
[]
["В гостях"]
[{"$f":"'Команда 2'!A3","v":"Фрелунда"},{"$f":"'Команда 2'!AC13","v":4},{"$f":"'Команда 2'!AJ13","v":6},{"$f":"'Команда 2'!AG13","v":14},{"$f":"'Команда 2'!AN13","v":21},{"$f":"'Команда 2'!AH13","v":7},{"$f":"'Команда 2'!AO13","v":10}]
[]
["5 матчей"]
["Кто играет :","Из них",null,"Забито",null,"Пропущено"]
["Дома","Матчей Дома","Матчей в Гостях","Голы Дома","Голы в Гостях","Голы Дома","Голы в Гостях"]
[{"$f":"'Команда 1'!A3","v":"Линчеппинг"},{"$f":"'Команда 1'!AC8","v":4},{"$f":"'Команда 1'!AJ8","v":1},{"$f":"'Команда 1'!AG8","v":16},{"$f":"'Команда 1'!AN8","v":0},{"$f":"'Команда 1'!AH8","v":7},{"$f":"'Команда 1'!AO8","v":3}]
[]
["В гостях"]
[{"$f":"'Команда 2'!A3","v":"Фрелунда"},{"$f":"'Команда 2'!AC8","v":2},{"$f":"'Команда 2'!AJ8","v":3},{"$f":"'Команда 2'!AG8","v":5},{"$f":"'Команда 2'!AN8","v":12},{"$f":"'Команда 2'!AH8","v":6},{"$f":"'Команда 2'!AO8","v":6}]
[]
["Прогноз \"Первый Гол Забьёт\"  и  \"Обе Забьют?\""]
[null,"забито","проп","итог"]
["1к",{"$f":"D4+E4","v":21},{"$f":"F4+G4","v":28},{"$f":"B19/C19","v":0.75}]
["2к",{"$f":"E7+D7","v":35},{"$f":"F7+G7","v":17},{"$f":"B20/C20","v":2.0588235294117645}]
["Первый гол :",null,null,{"$f":"IF(D19>D20,\"1 команда\",\"2команда\")","v":"2команда"}]
["Точное",{"$f":"IF(С3!K4>С3!K8,\"1 команда\",\"2 команда\")","v":"2 команда"}]
["Забьют обе ? ",{"$f":"IF(С3!K4>0.6,\"1\",\"0\")","v":"1"},{"$f":"IF(С3!K8>0.6,\"1\",\"0\")","v":"1"},{"$f":"B23+C23","v":2}]
["Прогноз \"Обе забьют\""]
["Обе забьют?",null,{"$f":"IF(С5!D23=2,\"ДА\",\"НЕТ\")","v":"ДА"}]

{"sheet":"С6","index":13,"n_rows":30,"n_cols":15,"rows_kept":30,"cut":false,"hidden":true,"merged":[[0,11,2,11],[21,0,21,2],[29,2,31,2],[0,3,2,3],[0,0,1,2],[0,4,1,6],[20,3,20,8]]}
["ТБ",null,null,{"$f":"'Команда 1'!F3","v":"Линчеппинг"},"ТМ",null,null,null,"ТБ",null,null,{"$f":"'Команда 2'!F3","v":"Фрелунда"},"ТМ"]
[]
[{"$f":"'Команда 1'!T3","v":"Забито"},{"$f":"'Команда 1'!U3","v":"Пропущено"},null,null,{"$f":"A3","v":"Забито"},{"$f":"B3","v":"Пропущено"},null,null,{"$f":"'Команда 2'!T3","v":"Забито"},{"$f":"'Команда 2'!U3","v":"Пропущено"},null,null,{"$f":"I3","v":"Забито"},{"$f":"J3","v":"Пропущено"}]
[{"$f":"'Команда 1'!T4","v":1},{"$f":"'Команда 1'!U4","v":1},{"$f":"(A4+B4)-1","v":1},1,1,1,{"$f":"(E4+F4)+1","v":3},null,{"$f":"'Команда 2'!T4","v":4},{"$f":"'Команда 2'!U4","v":1},{"$f":"(I4+J4)-1","v":4},1,4,1,{"$f":"(M4+N4)+1","v":6}]
[{"$f":"'Команда 1'!T5","v":4},{"$f":"'Команда 1'!U5","v":2},5,2,4,2,7,null,{"$f":"'Команда 2'!T5","v":1},{"$f":"'Команда 2'!U5","v":5},5,2,1,5,7]
[{"$f":"'Команда 1'!T6","v":0},{"$f":"'Команда 1'!U6","v":3},2,3,0,3,4,null,{"$f":"'Команда 2'!T6","v":5},{"$f":"'Команда 2'!U6","v":1},5,3,5,1,7]
[{"$f":"'Команда 1'!T7","v":7},{"$f":"'Команда 1'!U7","v":4},10,4,7,4,12,null,{"$f":"'Команда 2'!T7","v":4},{"$f":"'Команда 2'!U7","v":3},6,4,4,3,8]
[{"$f":"'Команда 1'!T8","v":4},{"$f":"'Команда 1'!U8","v":0},3,5,4,0,5,null,{"$f":"'Команда 2'!T8","v":3},{"$f":"'Команда 2'!U8","v":2},4,5,3,2,6]
[{"$f":"'Команда 1'!T9","v":0},{"$f":"'Команда 1'!U9","v":2},1,6,0,2,3,null,{"$f":"'Команда 2'!T9","v":2},{"$f":"'Команда 2'!U9","v":0},1,6,2,0,3]
[{"$f":"'Команда 1'!T10","v":1},{"$f":"'Команда 1'!U10","v":5},5,7,1,5,7,null,{"$f":"'Команда 2'!T10","v":5},{"$f":"'Команда 2'!U10","v":1},5,7,5,1,7]
[{"$f":"'Команда 1'!T11","v":0},{"$f":"'Команда 1'!U11","v":4},3,8,0,4,5,null,{"$f":"'Команда 2'!T11","v":4},{"$f":"'Команда 2'!U11","v":0},3,8,4,0,5]
[{"$f":"'Команда 1'!T12","v":2},{"$f":"'Команда 1'!U12","v":3},4,9,2,3,6,null,{"$f":"'Команда 2'!T12","v":3},{"$f":"'Команда 2'!U12","v":2},4,9,3,2,6]
[{"$f":"'Команда 1'!T13","v":2},{"$f":"'Команда 1'!U13","v":4},5,10,2,4,7,null,{"$f":"'Команда 2'!T13","v":4},{"$f":"'Команда 2'!U13","v":2},5,10,4,2,7]
[]
[]
[{"$f":"SUM(A4:A13)","v":21},{"$f":"SUM(B4:B13)","v":28},{"$f":"A16+B16","v":49},{"$f":"C16/10","v":4.9000000000000004},null,null,null,null,{"$f":"SUM(I4:I13)","v":35},{"$f":"SUM(J4:J13)","v":17},{"$f":"I16+J16","v":52},{"$f":"K16/10","v":5.2}]
[]
[{"$f":"SUM(A4:A8)","v":16},{"$f":"SUM(B4:B8)","v":10},{"$f":"A18+B18","v":26},{"$f":"C18/5","v":5.2},null,null,null,null,{"$f":"SUM(I4:I8)","v":17},{"$f":"SUM(J4:J8)","v":12},{"$f":"I18+J18","v":29},{"$f":"K18/5","v":5.8}]
[]
[]
[null,null,null,"Серия матчей ТБ2.5 (Пробитие Тотала 2.5 в общем)"]
[null,null,null,null,1,2,3,4,5]
[null,null,null,"1к",{"$f":"A4+B4","v":2},{"$f":"A5+B5","v":6},{"$f":"A6+B6","v":3},{"$f":"A7+B7","v":11},{"$f":"A8+B8","v":4}]
[null,null,null,"2к",{"$f":"I4+J4","v":5},{"$f":"I5+J5","v":6},{"$f":"I6+J6","v":6},{"$f":"I7+J7","v":7},{"$f":"I8+J8","v":5}]
[]
[null,null,null,"1к",{"$f":"IF(E23>2,\"+\",\"-\")","v":"-"},"+","+","+","+"]
[null,null,null,"2к","+","+","+","+","+"]
[]
[null,null,null,"1к",{"$f":"CONCATENATE(E26,\"  \",F26,\"  \",G26,\"  \",H26,\"  \",I26)","v":"-  +  +  +  +"}]
[null,null,null,"2к",{"$f":"CONCATENATE(E27,\"  \",F27,\"  \",G27,\"  \",H27,\"  \",I27)","v":"+  +  +  +  +"}]

{"sheet":"С7","index":14,"n_rows":45,"n_cols":51,"rows_kept":45,"cut":false,"hidden":true,"merged":[[33,6,33,8],[18,12,18,13],[18,14,18,16],[18,17,18,18],[24,50,24,53],[28,30,28,32],[28,36,28,37],[30,0,30,8],[31,6,31,8],[32,6,32,8],[25,0,25,2],[25,3,25,8],[17,10,17,17],[6,9,6,10],[6,11,6,12],[8,0,8,8],[9,10,9,17],[10,9,10,10],[10,11,10,12],[10,13,10,14],[11,9,11,10],[11,11,11,12],[11,13,11,14],[12,14,12,15],[12,17,12,21],[3,50,3,53],[4,0,4,3],[4,5,4,8],[4,44,4,45],[5,5,5,8],[5,9,5,10],[5,11,5,12],[5,16,5,17],[5,18,5,20],[3,5,3,8],[0,38,0,41],[1,5,1,8],[2,0,2,3],[2,5,2,8],[2,12,2,19],[0,0,0,3],[0,4,0,8],[0,13,0,14],[0,15,0,17],[0,18,0,19],[0,24,0,25]]}
["Теория лиги",null,null,null,"4  теста",null,null,null,null,"Итоги","Т(2.5)","Т1","Т2","Серия",null,"1-Х-2",null,null,"Рейтинг",null,"1Х2","Заб1","Заб2",null,"Счет",null,null,null,null,null,null,1,"Х",2,null,{"$f":"IF(AK1=B2,\"1\",IF(D2=AK1,\"2\",\"Х\"))","v":{"$error":"#REF!"}},{"$f":"MAX(B2,D2,C4)","v":{"$error":"#REF!"}},null,"Тоталы"]
[{"$f":"A10","v":"Линчеппинг"},{"$f":"(#REF!/#REF!)*100","v":{"$error":"#REF!"}},{"$f":"C10","v":"Фрелунда"},{"$f":"(#REF!/#REF!)*100","v":{"$error":"#REF!"}},"№ ТЕСТА","ПРОГНОЗ",null,null,null,"10 игр",{"$f":"J20","v":4.2261904761904763},{"$f":"K20","v":1},{"$f":"L20","v":3},null,null,{"$f":"O20","v":0.25174825174825172},{"$f":"P20","v":8.3916083916083919E-2},{"$f":"Q20","v":0.66433566433566438},{"$f":"R20","v":-0.14777021919879063},{"$f":"S20","v":0.73875661375661394},{"$f":"IF(P2-R2>0.23,\"П1\",IF(P2>R2,\"1X\",IF(R2-P2>0.24,\"П2\",IF(R2>P2,\"Х2\",\"\"))))","v":"П2"},{"$f":"AVERAGE(С1!I6,С1!B6)","v":2.4785714285714286},{"$f":"AVERAGE(С1!O7,С1!B7)","v":3.5},null,{"$f":"ROUND(AVERAGE(O7,V2),0)","v":2},{"$f":"ROUND(AVERAGE(P7,W2),0)","v":3},null,null,null,null,"Лига",{"$f":"IF(AJ1=1,1,0)","v":{"$error":"#REF!"}},{"$f":"IF(AJ1=\"Х\",1,0)","v":{"$error":"#REF!"}},{"$f":"IF(AF2+AG2=0,1,0)","v":{"$error":"#REF!"}},null,{"$f":"IF(AK2=A11,\"1\",IF(C11=AK2,\"2\",\"Х\"))","v":{"$error":"#REF!"}},{"$f":"MAX(A11:C11)","v":{"$error":"#REF!"}},null,"Лига",{"$f":"IF(B6>D6,\"ТМ\",\"ТБ\")","v":{"$error":"#REF!"}},{"$f":"COUNTIF(AN2:AN7,\"ТБ\")","v":4},"ТБ"]
[null,null,null,null,"Тест №1",{"$f":"IF(#REF!>#REF!,#REF!,IF(#REF!<#REF!,#REF!,\"Ничья\"))","v":{"$error":"#REF!"}},null,null,null,null,null,null,"ВСЕ",null,null,null,null,null,null,null,null,null,null,null,null,null,null,null,null,null,"Альтадар",{"$f":"IF(AJ2=1,1,0)","v":{"$error":"#REF!"}},{"$f":"IF(AJ2=\"Х\",1,0)","v":{"$error":"#REF!"}},{"$error":"#REF!"},null,{"$f":"IF(AK3=P2,\"1\",IF(R2=AK3,\"2\",\"Х\"))","v":"2"},{"$f":"MAX(P2:R2)","v":0.66433566433566438},null,"Альтад",{"$f":"IF(SUM(D8:E8)>2.5,\"ТБ\",\"ТМ\")","v":{"$error":"#REF!"}},{"$f":"COUNTIF(AN2:AN7,\"ТМ\")","v":0},"ТМ"]
[null,"Ничья",{"$f":"100-(B2+D2)","v":{"$error":"#REF!"}},null,"Тест № 2",{"$f":"#REF!","v":{"$error":"#REF!"}},null,null,null,null,null,null,null,null,null,null,null,null,null,null,null,null,null,null,null,null,null,null,null,null,"Тест1",{"$f":"IF(F3=\"П1\",1,IF(F3=\"1Х\",1,IF(F3=\"Х1\",1,IF(F3=\"Ф1(+1)\",1,0))))","v":{"$error":"#REF!"}},{"$f":"IF(F3=\"Х\",1,IF(F3=\"1Х\",1,IF(F3=\"Х1\",1,IF(F3=\"Х2\",1,IF(F3=\"2Х\",1,0)))))","v":{"$error":"#REF!"}},{"$f":"IF(AF4+AG4=0,1,0)","v":{"$error":"#REF!"}},null,null,null,null,"Total. ИТ",{"$f":"IF(L2+M2>2.5,\"ТБ\",\"ТМ\")","v":"ТБ"},null,{"$f":"IF(AO2>3,\"ТБ\",IF(AO3=3,\"Неизв.\",\"ТМ\"))","v":"ТБ"},null,null,null,null,null,null,null,null,"ВСЕ"]
[null,null,null,null,"Тест № 3",{"$f":"IF(#REF!>#REF!,#REF!,IF(#REF!>#REF!,#REF!,#REF!))","v":{"$error":"#REF!"}},null,null,null,"Среднее",null,null,null,null,null,null,null,null,null,null,null,null,null,null,null,null,null,null,null,null,"Тест2",{"$f":"IF(F4=\"П1\",1,IF(F4=\"1Х\",1,IF(F4=\"Х1\",1,IF(F4=\"Ф1(+1)\",1,0))))","v":{"$error":"#REF!"}},{"$f":"IF(F4=\"Х\",1,IF(F4=\"1Х\",1,IF(F4=\"Х1\",1,IF(F4=\"Х2\",1,IF(F4=\"2Х\",1,0)))))","v":{"$error":"#REF!"}},{"$error":"#REF!"},null,null,null,null,"Total. ",{"$f":"IF(K2>=2.5,\"ТБ\",\"ТМ\")","v":"ТБ"},null,{"$f":"AO2/6*100","v":66.666666666666657}]
["ТМ 2,5",{"$f":"100-D6","v":{"$error":"#REF!"}},"ТБ2,5",{"$f":"(#REF!/#REF!)*100-10","v":{"$error":"#REF!"}},"Динамика",{"$f":"#REF!","v":{"$error":"#REF!"}},null,null,null,"Команда 1",null,"Команда 2",null,"Т","Т1","Т2","Серия",null,"1-Х-2",null,null,"1Х","Х2","Фора",null,null,null,"Тотал","Счет","ТБ(2.5)","Тест3",{"$f":"IF(F5=\"П1\",1,IF(F5=\"1Х\",1,IF(F5=\"Х1\",1,IF(F5=\"Ф1(+1)\",1,0))))","v":{"$error":"#REF!"}},{"$f":"IF(F5=\"Х\",1,IF(F5=\"1Х\",1,IF(F5=\"Х1\",1,IF(F5=\"Х2\",1,IF(F5=\"2Х\",1,0)))))","v":{"$error":"#REF!"}},{"$error":"#REF!"},null,null,null,null,"Total. Заб",{"$f":"IF(V2+W2>2.5,\"ТБ\",\"ТМ\")","v":"ТБ"},null,{"$f":"AO3/6*100","v":0}]
[null,"Ф1","Ф2","ИТБ1","ИТБ2","ИТМ1","ИТМ2",12,null,{"$f":"A10","v":"Линчеппинг"},null,{"$f":"C10","v":"Фрелунда"},null,{"$f":"K2","v":4.2261904761904763},{"$f":"L2","v":1},{"$f":"M2","v":3},null,null,{"$f":"P2","v":0.25174825174825172},{"$f":"Q2","v":8.3916083916083919E-2},{"$f":"R2","v":0.66433566433566438},{"$f":"С1!V5+С1!V6/2","v":0.31818181818181818},{"$f":"С1!V7+С1!V6/2","v":0.68181818181818177},{"$f":"O7-P7","v":-2},null,null,null,{"$f":"IF(N7>2.85,IF(Y2+Z2>2,\"ТБ(2)\",\" \"),IF(N7<2.2,IF(Y2+Z2<3,\"ТМ(3)\",\" \"),\" \"))","v":"ТБ(2)"},{"$f":"CONCATENATE(Y2,\":\",Z2)","v":"2:3"},{"$f":"С1!U21","v":0},"Динамика",{"$f":"IF(F6=\"П1\",1,IF(F6=\"1Х\",1,IF(F6=\"Х1\",1,IF(F6=\"Ф1(+1)\",1,0))))","v":{"$error":"#REF!"}},{"$f":"IF(F6=\"Х\",1,IF(F6=\"1Х\",1,IF(F6=\"Х1\",1,IF(F6=\"Х2\",1,IF(F6=\"2Х\",1,0)))))","v":{"$error":"#REF!"}},{"$error":"#REF!"},null,null,null,null,"Total. Счет",{"$f":"IF(Y2+Z2>2.5,\"ТБ\",\"ТМ\")","v":"ТБ"}]
[null,{"$f":"(#REF!+#REF!)/4","v":{"$error":"#REF!"}},{"$f":"(#REF!+#REF!)/4","v":{"$error":"#REF!"}},{"$f":"(#REF!+#REF!)/20","v":{"$error":"#REF!"}},{"$f":"(#REF!+#REF!)/20","v":{"$error":"#REF!"}},{"$f":"(#REF!+#REF!)/20","v":{"$error":"#REF!"}},{"$f":"(#REF!+#REF!)/20","v":{"$error":"#REF!"}},{"$f":"AVERAGE(A11,C11)","v":{"$error":"#REF!"}},null,null,null,null,null,null,null,null,null,null,null,null,null,null,null,null,null,null,null,null,null,null,"Альт. ИТ",{"$f":"IF(D8>E8,1,0)","v":{"$error":"#REF!"}},{"$f":"IF(D8=E8,1,0)","v":{"$error":"#REF!"}},{"$error":"#REF!"}]
["АЛЬТА",null,null,null,null,null,null,null,null,null,null,null,null,null,null,null,null,null,null,null,null,null,null,null,null,null,null,null,null,null,"Total. ИТ",{"$f":"IF(L2>M2,1,0)","v":0},{"$f":"IF(L2=M2,1,0)","v":0},1]
[{"$f":"'Команда 1'!A3","v":"Линчеппинг"},"Х",{"$f":"'Команда 2'!A3","v":"Фрелунда"},"1Х","Х2","ТБ","ТМ","ОЗ: Да","ОЗ: Нет",null,"ХЗ",null,null,null,null,null,null,null,null,null,null,null,null,null,null,null,null,null,null,null,"Total.",{"$f":"IF(AJ3=\"1\",1,0)","v":0},{"$f":"IF(AJ3=\"х\",1,0)","v":0},1]
[{"$f":"(#REF!-#REF!-#REF!+#REF!-#REF!+#REF!-#REF!-#REF!+#REF!-#REF!+#REF!-#REF!-#REF!+#REF!-#REF!-#REF!)%","v":{"$error":"#REF!"}},{"$f":"(#REF!+#REF!+#REF!+#REF!+#REF!+#REF!+#REF!+#REF!+#REF!+#REF!+#REF!+#REF!+#REF!+#REF!+#REF!+#REF!)%","v":{"$error":"#REF!"}},{"$f":"(#REF!-#REF!-#REF!+#REF!-#REF!+#REF!-#REF!-#REF!+#REF!-#REF!+#REF!-#REF!-#REF!+#REF!-#REF!-#REF!)%","v":{"$error":"#REF!"}},{"$f":"AVERAGE(A11,B11)","v":{"$error":"#REF!"}},{"$f":"AVERAGE(C11,B11)","v":{"$error":"#REF!"}},{"$f":"(#REF!+#REF!)/10","v":{"$error":"#REF!"}},{"$f":"(#REF!+#REF!)/10","v":{"$error":"#REF!"}},{"$f":"(#REF!+#REF!+#REF!+#REF!)%","v":{"$error":"#REF!"}},{"$f":"(#REF!+#REF!+#REF!+#REF!)%","v":{"$error":"#REF!"}},{"$f":"A10","v":"Линчеппинг"},null,"Х",null,{"$f":"C10","v":"Фрелунда"},null,"ТБ(2.5)","ТМ(2.5)","Обе забьют","Чёт/Нечет","1х2",null,null,null,null,null,null,null,null,null,null,"Total. Рейтинг",{"$f":"IF(S2>T2,1,0)","v":0},{"$f":"IF(S2=T2,1,0)","v":0},1]
[null,null,null,null,null,null,null,null,null,{"$f":"ROUND(AF16,0)&\"%\"","v":"0%"},null,{"$f":"ROUND(AG16,0)&\"%\"","v":"0%"},null,{"$f":"ROUND(AH16,0)&\"%\"","v":"38%"},null,{"$f":"ROUND(AP5,0)","v":67},{"$f":"ROUND(AP6,0)","v":0},{"$f":"AN18","v":"Нет"},{"$f":"IF(#REF!=4,\"Нечёт(!)\",IF(#REF!=6,\"Чёт(!)\",IF(#REF!>=7,\"Чёт\",IF(#REF!<=3,\"Нечет\",\"Неизв.\"))))","v":{"$error":"#REF!"}},{"$f":"IF(J12-N12>0.23,\"П1\",IF(J12>N12,\"1X\",IF(N12-J12>0.24,\"П2\",IF(N12>J12,\"Х2\",\"\"))))","v":"П2"},null,null,null,null,null,null,null,null,null,null,"Total. Счет",{"$f":"IF(Y2>Z2,1,0)","v":0},{"$f":"IF(Y2=Z2,1,0)","v":0},1,null,null,null,null,{"$f":"IF(U2=\"П1\",1,IF(U2=\"П2\",2,IF(U2=\"1X\",1,IF(U2=\"Х2\",2))))","v":2}]
[null,null,null,null,null,null,null,null,null,null,null,null,null,null,null,null,null,"Прогноз \"ИСХОД МАТЧА № 2\"",null,null,null,null,null,null,null,null,null,null,null,null,"Total. Заб",{"$f":"IF(V2>W2,1,0)","v":0},{"$f":"IF(V2=W2,1,0)","v":0},1]
["Доп. информация 1-ой команды",null,null,"Доп. информация 2-ой команды",null,null,"ТС1","ТС2",null,null,{"$f":"AH40","v":0},null,null,"ТБ(2.5)1","ТБ(2.5)2","ТМ(2.5)1","ТМ(2.5)2",null,null,null,null,null,null,null,null,null,null,null,null,null,null,{"$f":"IF(AF25=1,1,0)","v":{"$error":"#REF!"}},{"$f":"IF(AF25=\"X\",1,0)","v":{"$error":"#REF!"}},{"$f":"IF(AF25=2,1,0)","v":{"$error":"#REF!"}}]
["Сила нападения:",null,{"$f":"(#REF!+#REF!)/10","v":{"$error":"#REF!"}},"Сила нападения:",null,{"$f":"(#REF!+#REF!)/10","v":{"$error":"#REF!"}},{"$f":"#REF!/10","v":{"$error":"#REF!"}},{"$f":"#REF!/10","v":{"$error":"#REF!"}},null,null,{"$f":"AH41","v":0},null,null,{"$f":"IF(AP23=1,\"Да\",\"Неизв.\")","v":"Неизв."},{"$f":"IF(AQ23=1,\"Да\",\"Неизв.\")","v":"Неизв."},{"$f":"IF(AP24=1,\"Да\",\"Неизв.\")","v":"Неизв."},{"$f":"IF(AQ24=1,\"Да\",\"Неизв.\")","v":"Неизв."},null,null,null,null,null,null,null,null,null,null,null,null,null,"СУММ",{"$f":"COUNTIF(AF2:AF13,1)","v":0},{"$f":"COUNTIF(AG2:AG13,1)","v":0},{"$f":"COUNTIF(AH2:AH13,1)","v":5}]
["Сила защиты:",null,{"$f":"(#REF!+#REF!)/10","v":{"$error":"#REF!"}},"Сила защиты:",null,{"$f":"(#REF!+#REF!)/10","v":{"$error":"#REF!"}},{"$f":"(#REF!/10)+1","v":{"$error":"#REF!"}},{"$f":"(#REF!/10)+1","v":{"$error":"#REF!"}},null,null,{"$f":"AH42","v":33},null,null,null,null,null,null,null,null,null,null,null,null,null,null,null,null,null,null,null,null,{"$f":"AF15/13*100","v":0},{"$f":"AG15/13*100","v":0},{"$f":"AH15/13*100","v":38.461538461538467}]
[null,null,null,null,null,{"$f":"IF(AH27=4,\"Н(!)\",IF(AH27=6,\"Ч(!)\",IF(AH27>=7,\"Ч\",IF(AH27<=3,\"Н\",\"Не.\"))))","v":"Н"},{"$f":"(#REF!)/10","v":{"$error":"#REF!"}},{"$f":"(#REF!/10)-1","v":{"$error":"#REF!"}},null,null,null,null,null,null,null,null,null,null,null,null,null,null,null,null,null,null,null,null,null,null,null,null,null,null,null,null,null,null,null,{"$f":"IF(AK35=1,AN18,\"Неизв.\")","v":{"$error":"#REF!"}}]
[null,null,null,null,null,null,null,null,null,null,"ВСЕ",null,null,null,null,null,null,null,null,null,null,null,null,null,null,null,null,null,null,null,null,null,null,null,null,null,null,null,null,{"$f":"IF(AK43=1,\"Да\",IF(AO37=2,\"Нет\",\"Неизв.\"))","v":"Нет"}]
[null,null,null,null,null,null,null,null,null,"Т(2.5)","Т1","Т2","Мощь",null,"1-Х-2",null,null,"Рейтинг"]
[null,null,null,null,null,null,null,null,null,{"$f":"С1!A13","v":4.2261904761904763},{"$f":"MROUND(С1!B9,0.5)","v":1},{"$f":"MROUND(С1!B10,0.5)","v":3},{"$f":"С1!D9","v":-6.4285714285714057E-2},{"$f":"С1!D10","v":1.8166666666666664},{"$f":"AVERAGE(С1!V5,С1!W5)","v":0.25174825174825172},{"$f":"AVERAGE(С1!V6,С1!W6)","v":8.3916083916083919E-2},{"$f":"AVERAGE(С1!V7,С1!W7)","v":0.66433566433566438},{"$f":"С1!F9","v":-0.14777021919879063},{"$f":"С1!F10","v":0.73875661375661394}]
[null,null,null,null,null,null,null,null,null,null,null,null,null,null,null,null,null,null,null,null,null,null,null,null,null,null,null,null,null,null,null,"заб","проп"]
[null,null,null,null,null,null,null,null,null,null,null,null,null,null,null,null,null,null,null,null,null,null,null,null,null,null,null,null,null,null,"к1",{"$f":"(C15-F16)*100","v":{"$error":"#REF!"}},{"$f":"(F15-C16)*100","v":{"$error":"#REF!"}}]
[]
[]
["Рабочий лист вычислений прогнозов с привлечением методик \"Теории Синдиката\" ",null,null,null,null,null,null,null,null,null,null,null,null,null,null,null,null,null,null,null,null,null,null,null,null,null,null,null,null,null,null,{"$f":"IF(AF22>AG22,1,IF(AF22=AG22,\"X\",2))","v":{"$error":"#REF!"}},null,null,null,null,null,null,null,null,null,null,null,null,null,null,null,null,null,null,"АЛЬТА"]
["и таблиц Altadar"]
["Информация на странице неполная. Сами расчёты отсутствуют."]
["По причине отсутствия необходимой части расчётов Прогноз \"Исход Матча №2\" не  является обоснованным"]
[null,null,null,null,null,null,null,null,null,null,null,null,null,null,null,null,null,null,null,null,null,null,null,null,null,null,null,null,null,null,"оз",null,null,null,null,null,"оз"]
[null,null,null,null,null,null,null,null,null,null,null,null,null,null,null,null,null,null,null,null,null,null,null,null,null,null,null,null,null,null,"Лига",{"$f":"IF(AF2=1,1,IF(AG2=1,0,2))","v":{"$error":"#REF!"}},null,null,null,"альт",{"$f":"IF(H11>=I11,1,0)","v":{"$error":"#REF!"}}]
[null,null,null,null,null,null,null,null,null,null,null,null,null,null,null,null,null,null,null,null,null,null,null,null,null,null,null,null,null,null,1,{"$f":"IF(AF4=1,1,IF(AG4=1,0,2))","v":{"$error":"#REF!"}},null,null,null,"т1т2",{"$f":"IF(L2>=1,IF(M2>=1,1,0),0)","v":1}]
[null,null,null,null,null,null,null,null,null,null,null,null,null,null,null,null,null,null,null,null,null,null,null,null,null,null,null,null,null,null,2,{"$f":"IF(AF5=1,1,IF(AG5=1,0,2))","v":{"$error":"#REF!"}},null,null,null,"заб",{"$f":"IF(V2>=1,IF(W2>=1,1,0),0)","v":1}]
[null,null,null,null,null,null,null,null,null,null,null,null,null,null,null,null,null,null,null,null,null,null,null,null,null,null,null,null,null,null,3,{"$f":"IF(AF6=1,1,IF(AG6=1,0,2))","v":{"$error":"#REF!"}},null,null,null,"счет",{"$f":"IF(Y2>=1,IF(Z2>=1,1,0),0)","v":1}]
[null,null,null,null,null,null,null,null,null,null,null,null,null,null,null,null,null,null,null,null,null,null,null,null,null,null,null,null,null,null,4,{"$f":"IF(AF7=1,1,IF(AG7=1,0,2))","v":{"$error":"#REF!"}},null,null,null,"сумм",{"$f":"SUM(AK30:AK33)","v":{"$error":"#REF!"}}]
[null,null,null,null,null,null,null,null,null,null,null,null,null,null,null,null,null,null,null,null,null,null,null,null,null,null,null,null,null,null,"Альтадар",{"$f":"IF(AJ2=\"Х\",0,AJ2)","v":{"$error":"#REF!"}},null,null,null,"оз",{"$f":"IF(AK34=4,1,0)","v":{"$error":"#REF!"}}]
[null,null,null,null,null,null,null,null,null,null,null,null,null,null,null,null,null,null,null,null,null,null,null,null,null,null,null,null,null,null,"1х2",{"$f":"IF(AJ3=\"Х\",0,AJ3)","v":"2"}]
[null,null,null,null,null,null,null,null,null,null,null,null,null,null,null,null,null,null,null,null,null,null,null,null,null,null,null,null,null,null,"рейтинг",{"$f":"IF(S2>T2,1,IF(S2=T2,0,2))","v":2},null,null,null,null,null,null,null,null,{"$f":"SUM(AO38:AO39)","v":2}]
[null,null,null,null,null,null,null,null,null,null,null,null,null,null,null,null,null,null,null,null,null,null,null,null,null,null,null,null,null,null,"1х2",{"$f":"AM12","v":2},null,null,null,null,null,null,null,null,{"$f":"IF(AH41=0,1,0)","v":1}]
[null,null,null,null,null,null,null,null,null,null,null,null,null,null,null,null,null,null,null,null,null,null,null,null,null,null,null,null,null,null,null,null,null,null,null,null,null,null,null,null,{"$f":"SUM(AO40:AO41)","v":1}]
[null,null,null,null,null,null,null,null,null,null,null,null,null,null,null,null,null,null,null,null,null,null,null,null,null,null,null,null,null,null,1,{"$f":"COUNTIF(AF30:AF38,1)","v":0},null,{"$f":"ROUND(AF40/9*100,0)","v":0},null,1,{"$f":"IF(AH41>=11,1,0)","v":0},null,{"$f":"IF(AH42=0,AH40,AH40/AH42)","v":0},{"$f":"IF(AM40<2,1,0)","v":1},{"$f":"IF(AM40>3,1,0)","v":0}]
[null,null,null,null,null,null,null,null,null,null,null,null,null,null,null,null,null,null,null,null,null,null,null,null,null,null,null,null,null,null,"x",{"$f":"COUNTIF(AF30:AF38,0)","v":0},null,{"$f":"ROUND(AF41/9*100,0)","v":0},null,2,{"$f":"IF(AN42=1,1,0)","v":0},null,{"$f":"IF(AH40=0,AH42,AH42/AH40)","v":33},{"$f":"IF(AM41<2,1,0)","v":0},{"$f":"IF(AM41>3,1,0)","v":1}]
[null,null,null,null,null,null,null,null,null,null,null,null,null,null,null,null,null,null,null,null,null,null,null,null,null,null,null,null,null,null,2,{"$f":"COUNTIF(AF30:AF38,2)","v":3},null,{"$f":"ROUND(AF42/9*100,0)","v":33},null,3,{"$f":"IF(AH45>=59,1,0)","v":0},null,null,{"$f":"IF(AN40+AN41=2,1,0)","v":0}]
[null,null,null,null,null,null,null,null,null,null,null,null,null,null,null,null,null,null,null,null,null,null,null,null,null,null,null,null,null,null,null,null,null,null,null,null,{"$f":"IF(AK40+AK41+AK42=3,1,0)","v":0}]
[]
[null,null,null,null,null,null,null,null,null,null,null,null,null,null,null,null,null,null,null,null,null,null,null,null,null,null,null,null,null,null,null,null,null,{"$f":"MAX(AH40:AH42)","v":33}]

{"sheet":"Лист1 (3)","index":15,"n_rows":223,"n_cols":27,"rows_kept":223,"cut":false,"hidden":true,"merged":[[62,0,62,3],[62,5,62,8],[68,1,75,3],[68,5,68,9],[57,0,57,9],[59,0,59,3],[59,5,59,8],[60,0,60,3],[60,5,60,8],[61,0,61,3],[61,5,61,8],[23,0,24,8],[2,0,2,3],[9,5,9,7],[10,6,10,8],[11,6,11,8],[18,0,18,3]]}
[]
[]
["Тест №1 Анализ 10 последних игр команд дома и в гостях"]
[]
[]
["Последние 10 игр команды 1",null,"Последние 10 игр команды 2"]
["№ игры","Исход","№ игры","Исход"]
[1,{"$f":"#REF!","v":{"$error":"#REF!"}},1,{"$f":"#REF!","v":{"$error":"#REF!"}}]
[2,{"$f":"#REF!","v":{"$error":"#REF!"}},2,{"$f":"#REF!","v":{"$error":"#REF!"}}]
[3,{"$f":"#REF!","v":{"$error":"#REF!"}},3,{"$f":"#REF!","v":{"$error":"#REF!"}},null,"Прогноз"]
[4,{"$f":"#REF!","v":{"$error":"#REF!"}},4,{"$f":"#REF!","v":{"$error":"#REF!"}},null,"№ ТЕСТА","ПРОГНОЗ"]
[5,{"$f":"#REF!","v":{"$error":"#REF!"}},5,{"$f":"#REF!","v":{"$error":"#REF!"}},null,"Тест №1",{"$f":"IF(E21>E22,A21,IF(E21<E22,A22,\"Х\"))","v":{"$error":"#REF!"}}]
[6,{"$f":"#REF!","v":{"$error":"#REF!"}},6,{"$f":"#REF!","v":{"$error":"#REF!"}},null,"Тест № 2",{"$f":"C50","v":{"$error":"#REF!"}}]
[7,{"$f":"#REF!","v":{"$error":"#REF!"}},7,{"$f":"#REF!","v":{"$error":"#REF!"}},null,"Тест № 3",{"$f":"IF(G126>H126,I122,IF(H126>G126,I123,I124))","v":{"$error":"#REF!"}}]
[8,{"$f":"#REF!","v":{"$error":"#REF!"}},8,{"$f":"#REF!","v":{"$error":"#REF!"}}]
[9,{"$f":"#REF!","v":{"$error":"#REF!"}},9,{"$f":"#REF!","v":{"$error":"#REF!"}}]
[10,{"$f":"#REF!","v":{"$error":"#REF!"}},10,{"$f":"#REF!","v":{"$error":"#REF!"}}]
[]
["Итог анализа Теста №1"]
["Команда ","Очки","Значение Теста","Число","ИТОГ"]
["П1",{"$f":"B223","v":{"$error":"#REF!"}},{"$f":"IF(B21>18,4,IF(B21>15,3,IF(B21>10,2,IF(B21>5,1,0))))","v":{"$error":"#REF!"}},{"$f":"IF(D223>=9,3,IF(D223>=6,2,IF(D223>=4,1,0)))","v":{"$error":"#REF!"}},{"$f":"IF(B21>B22,1,0)+IF(C21>C22,1,0)+D21","v":{"$error":"#REF!"}}]
["П2",{"$f":"C223","v":{"$error":"#REF!"}},{"$f":"IF(B22>18,4,IF(B22>15,3,IF(B22>10,2,IF(B22>5,1,0))))","v":{"$error":"#REF!"}},{"$f":"IF(E223>=9,3,IF(E223>=6,2,IF(E223>=4,1,0)))","v":{"$error":"#REF!"}},{"$f":"IF(B22>B21,1,0)+IF(C22>C21,1,0)+D22","v":{"$error":"#REF!"}}]
[]
["Тест № 2 Теория трёх матчей"]
[]
[]
[null,"Домашняя команда -  команда 1",null,null,null,null,"Гостевая команда - команда 2"]
[]
["Последние 3 игры команды 1 ДОМА",null,null,null,null,"Последние 3 игры команды 2 в гостях"]
[]
[null,"КОМАНДА 1","гости","Очки",null,null,"хозяева","КОМАНДА 2","Очки"]
["1 игра",{"$f":"#REF!","v":{"$error":"#REF!"}},{"$f":"#REF!","v":{"$error":"#REF!"}},{"$f":"IF(B32>C32,2+(B32-C32),IF(B32=C32,1,0))","v":{"$error":"#REF!"}},null,"1 игра",{"$f":"#REF!","v":{"$error":"#REF!"}},{"$f":"#REF!","v":{"$error":"#REF!"}},{"$f":"IF(H32>G32,2+(H32-G32),IF(G32=H32,1,0))","v":{"$error":"#REF!"}}]
["2 игра",{"$f":"#REF!","v":{"$error":"#REF!"}},{"$f":"#REF!","v":{"$error":"#REF!"}},{"$f":"IF(B33>C33,2+(B33-C33),IF(B33=C33,1,0))","v":{"$error":"#REF!"}},null,"2 игра",{"$f":"#REF!","v":{"$error":"#REF!"}},{"$f":"#REF!","v":{"$error":"#REF!"}},{"$f":"IF(H33>G33,2+(H33-G33),IF(G33=H33,1,0))","v":{"$error":"#REF!"}}]
["3 игра",{"$f":"#REF!","v":{"$error":"#REF!"}},{"$f":"#REF!","v":{"$error":"#REF!"}},{"$f":"IF(B34>C34,2+(B34-C34),IF(B34=C34,1,0))","v":{"$error":"#REF!"}},null,"3 игра",{"$f":"#REF!","v":{"$error":"#REF!"}},{"$f":"#REF!","v":{"$error":"#REF!"}},{"$f":"IF(H34>G34,2+(H34-G34),IF(G34=H34,1,0))","v":{"$error":"#REF!"}}]
[null,null,"Итого:",{"$f":"SUM(D32,D33,D34) +1","v":{"$error":"#REF!"}},null,null,null,"Итого:",{"$f":"SUM(I32,I33,I34)","v":{"$error":"#REF!"}}]
[]
[]
[]
[null,null,null,"    Последние  три  игры  команд  между  собой"]
[]
[null,"какая команда дома","Счёт","Счёт","Очки","Какая команда победила ","Какая команда в гостях"]
[null,{"$f":"IF(#REF!=\"Дома\",\"1\",IF(#REF!=\"В гостях\",\"2\",\"Победа\"))","v":{"$error":"#REF!"}},{"$f":"#REF!","v":{"$error":"#REF!"}},{"$f":"#REF!","v":{"$error":"#REF!"}},{"$f":"IF(C42>D42,3+(C42-D42),IF(C42=D42,1,IF(D42>C42,3+(D42-C42),0)))","v":{"$error":"#REF!"}},{"$f":"IF(C42>D42,B42,IF(D42>C42,G42,0))","v":{"$error":"#REF!"}},{"$f":"IF(#REF!=\"Дома\",\"2\",IF(#REF!=\"В гостях\",\"1\",\"Победа\"))","v":{"$error":"#REF!"}}]
[null,{"$f":"IF(#REF!=\"Дома\",\"1\",IF(#REF!=\"В гостях\",\"2\",\"Победа\"))","v":{"$error":"#REF!"}},{"$f":"#REF!","v":{"$error":"#REF!"}},{"$f":"#REF!","v":{"$error":"#REF!"}},{"$f":"IF(C43>D43,3+(C43-D43),IF(C43=D43,0,IF(D43>C43,3+(D43-C43),0)))","v":{"$error":"#REF!"}},{"$f":"IF(C43>D43,B43,IF(D43>C43,G43,0))","v":{"$error":"#REF!"}},{"$f":"IF(#REF!=\"Дома\",\"2\",IF(#REF!=\"В гостях\",\"1\",\"Победа\"))","v":{"$error":"#REF!"}}]
[null,{"$f":"IF(#REF!=\"Дома\",\"1\",IF(#REF!=\"В гостях\",\"2\",\"Победа\"))","v":{"$error":"#REF!"}},{"$f":"#REF!","v":{"$error":"#REF!"}},{"$f":"#REF!","v":{"$error":"#REF!"}},{"$f":"IF(C44>D44,3+(C44-D44),IF(C44=D44,0,IF(D44>C44,3+(D44-C44),0)))","v":{"$error":"#REF!"}},{"$error":"#REF!"},{"$f":"IF(#REF!=\"Дома\",\"2\",IF(#REF!=\"В гостях\",\"1\",\"Победа\"))","v":{"$error":"#REF!"}}]
[null,"ИТОГ"]
[]
[null,"Дополнительная информация, НЕОБЯЗАТЕЛЬНО для заполнения: "]
[null,"Кто выше в турнирной таблице?",null,1]
[]
[null,"ИТОГОВЫЙ ВЫВОД:",{"$f":"IF(Q183=1,Q190,IF(Q185=1,Q177,IF(Q185=2,Q178,T190)))","v":{"$error":"#REF!"}}]
[]
[null,null,1,2]
[null,"Очки",{"$f":"D35+IF(F42=1,E42,0)+IF(F43=1,E43,0)+IF(F44=1,E44,0)","v":{"$error":"#REF!"}},{"$f":"I35+IF(F42=2,E42,0)+IF(F43=2,E43,0)+IF(F44=2,E44,0)","v":{"$error":"#REF!"}}]
[null,"Доп. Очки",{"$f":"IF(Q162=1,1,0)","v":{"$error":"#REF!"}}]
[null,"Итоговые:",{"$f":"SUM(C53,C54)","v":{"$error":"#REF!"}},{"$f":"SUM(D53,D54)","v":{"$error":"#REF!"}}]
[]
[]
["Тест №3 Общая теория"]
[]
["Расчёт команды 1",null,null,null,"Число","Расчёт команды 2",null,null,null,"Число"]
["Сколько Побед из 5 последних игр дома",null,null,null,{"$f":"#REF!","v":{"$error":"#REF!"}},"Сколько Побед из 5 последних игр в гостях",null,null,null,{"$f":"#REF!","v":{"$error":"#REF!"}}]
["Сколько Побед из 5 последних игр вообще",null,null,null,{"$f":"#REF!","v":{"$error":"#REF!"}},"Сколько Побед из 5 последних игр вообще",null,null,null,{"$f":"#REF!","v":{"$error":"#REF!"}}]
["Сколько Побед из 3 последних игр между командами",null,null,null,{"$f":"#REF!","v":{"$error":"#REF!"}},"Сколько Побед из 3 последних игр между командами",null,null,null,{"$f":"#REF!","v":{"$error":"#REF!"}}]
[]
[null,"Тесты"]
["№1",{"$f":"IF(C121>E121,\"Победа 1\",IF(E121>C121,\"Победа 2\",0))","v":{"$error":"#REF!"}}]
[]
[]
[null,"Прогноз на \"Тотал\" не является ТОЧНЫМ прогнозом. Стоит рассматривать его как рекомендацию. В случае если данные разных ячеек критически (сильно) противоречат друг другу, верный анализ произвести невозможно.",null,null,null,"ПРОГНОЗЫ НА ТОТАЛЫ"]
[null,null,null,null,null,null,"Шансы =>","Забьёт","Пропустит","примерный счёт "]
[null,null,null,null,null,"Команда 1",null,{"$f":"X170","v":{"$error":"#REF!"}},{"$f":"X169","v":{"$error":"#REF!"}},{"$f":"Y179","v":{"$error":"#REF!"}}]
[null,null,null,null,null,"Команда 2",null,{"$f":"I71","v":{"$error":"#REF!"}},{"$f":"H71","v":{"$error":"#REF!"}},{"$f":"Z179","v":{"$error":"#REF!"}}]
[null,null,null,null,null,"Тотал матча: ",{"$f":"IF(V170>3,\"Больше 3\",IF(V170>2,\"Больше 2\",\"Меньше 2\"))","v":{"$error":"#REF!"}}]
[]
[]
[]
[]
[null,null,null,null,null,"Второй прогноз на Тоталы"]
[null,null,null,null,null,"Второй анализ.","Команда 1","Команда 2"]
[null,null,null,null,null,"Забьёт в абстрактном матче ",{"$f":"(B32+B33+B34+1+G32+G33+G34)/6","v":{"$error":"#REF!"}},{"$f":"(H32+H33+H34+C32+C33+C34+1)/6","v":{"$error":"#REF!"}}]
[null,null,null,null,null,"Забьёт/пропустит в конкретном",{"$f":"(B32+B33+B34)/(C32+C33+C34+1)","v":{"$error":"#REF!"}},{"$f":"(H32+H33+H34)/(G32+G33+G34+1)","v":{"$error":"#REF!"}}]
[null,null,null,null,null,"Забьёт в этом матче",{"$f":"Z158","v":{"$error":"#REF!"}},{"$f":"AA158","v":{"$error":"#REF!"}}]
[]
[]
[]
[]
[]
[]
[]
[]
[]
[]
[]
[]
[]
[]
[]
[]
[]
[]
[]
[]
[]
[]
[]
[]
[]
[]
[]
[]
[]
[]
[]
[]
[]
[]
[null,null,"Победа 1","Ничья","Победа 2"]
[null,null,{"$f":"(E62+E61+E63)/13","v":{"$error":"#REF!"}},null,{"$f":"(J61+J62+J63)/13","v":{"$error":"#REF!"}}]
[null,null,{"$f":"(1+1-1)/3","v":0.33333333333333331},null,{"$f":"(1+1-1)/3","v":0.33333333333333331}]
[null,null,{"$f":"C118/C119","v":{"$error":"#REF!"}},1,{"$f":"E118/E119","v":{"$error":"#REF!"}}]
[null,null,{"$f":"((C125-C120)*C120)/3","v":{"$error":"#REF!"}},{"$f":"(C125-D120)*1/3","v":{"$error":"#REF!"}},{"$f":"((C125-E120)*E120)*1/3","v":{"$error":"#REF!"}}]
[null,null,null,null,null,null,null,null,"П1"]
[null,null,null,null,null,null,null,null,"П2"]
[null,null,null,null,null,null,null,null,"Х"]
[null,null,{"$f":"C120+D120+E120","v":{"$error":"#REF!"}}]
[null,null,null,null,null,null,{"$f":"G80+G81+G82","v":{"$error":"#REF!"}},{"$f":"H80+H81+H82","v":{"$error":"#REF!"}}]
[]
[]
[]
[]
[]
[]
[]
[]
[]
[]
[]
[]
[]
[]
[]
[]
[]
[]
[]
[]
[]
[]
[]
[]
[]
[]
[]
[null,null,null,null,null,null,null,null,null,null,null,null,null,null,null,null,"ИНЖЕНЕРНЫЕ ЯЧЕЙКИ ИНЖЕНЕРНЫЕ ЯЧЕЙКИ ИНЖЕНЕРНЫЕ ЯЧЕЙКИ ИНЖЕНЕРНЫЕ ЯЧЕЙКИ ИНЖЕНЕРНЫЕ ЯЧЕЙКИ ИНЖЕНЕРНЫЕ ЯЧЕЙКИ "]
[]
[null,null,null,null,null,null,null,null,null,null,null,null,null,null,null,null,null,null,null,null,null,null,null,null,null,"Инженерные ячейки"]
[null,null,null,null,null,null,null,null,null,null,null,null,null,null,null,null,null,null,null,null,null,null,null,null,null,{"$f":"G80*G81","v":{"$error":"#REF!"}},{"$f":"H80+H81","v":{"$error":"#REF!"}}]
[null,null,null,null,null,null,null,null,null,null,null,null,null,null,null,null,null,null,null,null,"ИНЖЕНЕРНЫЕ ЯЧЕЙКИ",null,null,null,null,{"$f":"Z157/AA157","v":{"$error":"#REF!"}},{"$f":"AA157/Z157","v":{"$error":"#REF!"}}]
[null,null,null,null,null,null,null,null,null,null,null,null,null,null,null,null,"Инженерные ячейки",null,null,null,{"$f":"(B32+B33+B34)/3+W160/3","v":{"$error":"#REF!"}},{"$f":"(G32+G33+G34)/3","v":{"$error":"#REF!"}}]
[null,null,null,null,null,null,null,null,null,null,null,null,null,null,null,null,{"$f":"IF(F42=0,1,0)","v":{"$error":"#REF!"}},null,null,null,{"$f":"(H32+H33+H34)/3+W161/3","v":{"$error":"#REF!"}},{"$f":"(C32+C33+C34)/3","v":{"$error":"#REF!"}},{"$f":"IF(B42=1,C42,D42)+IF(B43=1,C43,D43)+IF(B44=1,C44,D44)","v":{"$error":"#REF!"}},"команда 1"]
[null,null,null,null,null,null,null,null,null,null,null,null,null,null,null,null,{"$f":"IF(B42=Q166,1,0)","v":{"$error":"#REF!"}},null,null,null,null,null,{"$f":"IF(B42=2,C42,D42)+IF(B43=2,C43,D43)+IF(B44=2,C44,D44)","v":{"$error":"#REF!"}},"команда 2"]
[null,null,null,null,null,null,null,null,null,null,null,null,null,null,null,null,{"$f":"IF(Q161=Q160,1,0)","v":{"$error":"#REF!"}}]
[null,null,null,null,null,null,null,null,null,null,null,null,null,null,null,null,null,null,null,null,null,null,{"$f":"IF(W160>W161,W160/W161,W161/W160)","v":{"$error":"#REF!"}},{"$f":"IF(W160>W161,X160,X161)","v":{"$error":"#REF!"}}]
[null,null,null,null,null,null,null,null,null,null,null,null,null,null,null,null,null,null,null,null,{"$f":"(U159*U160*W163)/3","v":{"$error":"#REF!"}},null,null,null,{"$f":"IF(J71=0,1,J71)","v":{"$error":"#REF!"}}]
[null,null,null,null,null,null,null,null,null,null,null,null,null,null,null,null,null,null,null,null,0.5,null,null,null,{"$f":"IF(J72=0,1,J72)","v":{"$error":"#REF!"}}]
[null,null,null,null,null,null,null,null,null,null,null,null,null,null,null,null,2,null,null,null,1.5]
[null,null,null,null,null,null,null,null,null,null,null,null,null,null,null,null,null,null,null,null,2.5]
[null,null,null,null,null,null,null,null,null,null,null,null,null,null,null,null,null,null,null,null,3.5]
[null,null,null,null,null,null,null,null,null,null,null,null,null,null,null,null,null,null,null,null,null,null,null,{"$f":"IF(U160>=V160,V160,\"0\")","v":{"$error":"#REF!"}},"к2"]
[null,null,null,null,null,null,null,null,null,null,null,null,null,null,null,null,null,null,null,null,null,{"$f":"((X169+X170)*U164)/(U160*V159)+V171","v":{"$error":"#REF!"}},null,{"$f":"IF(U159>=V159,V159,\"0\")","v":{"$error":"#REF!"}},"к1"]
[null,null,null,null,null,null,null,null,null,null,null,null,null,null,null,null,"П1",null,null,null,null,{"$f":"(Y164/Y165)*(Y165/Y164)/2","v":{"$error":"#REF!"}}]
[null,null,null,null,null,null,null,null,null,null,null,null,null,null,null,null,"П2"]
[null,null,null,null,null,null,null,null,null,null,null,null,null,null,null,null,"П1"]
[null,null,null,null,null,null,null,null,null,null,null,null,null,null,null,null,"П2",null,null,null,null,null,null,null,null,"Примерный счёт"]
[null,null,null,null,null,null,null,null,null,null,null,null,null,null,null,null,"1Х",null,null,null,null,"ф 1 (+1)"]
[null,null,null,null,null,null,null,null,null,null,null,null,null,null,null,null,"Х2",null,null,null,null," ф 2 (+1)",null,null,{"$f":"U159*V159*(W160/3)/3","v":{"$error":"#REF!"}},{"$f":"U160*V160*(W161/3)/3","v":{"$error":"#REF!"}}]
[null,null,null,null,null,null,null,null,null,null,null,null,null,null,null,null,"1Х"]
[null,null,null,null,null,null,null,null,null,null,null,null,null,null,null,null,"Х2"]
[null,null,null,null,null,null,null,null,null,null,null,null,null,null,null,"Оценка:",{"$f":"IF(Q183=1,C55-D55,IF(Q183=2,D55-C55,0))","v":{"$error":"#REF!"}},null,null,null,null,null,null,null,{"$f":"IF(Y176>4.55,5,IF(Y176>3.55,4,IF(Y176>2.55,3,IF(Y176>1.55,2,IF(Y176>0.55,1,0)))))","v":{"$error":"#REF!"}},{"$f":"IF(Z176>4.55,5,IF(Z176>3.55,4,IF(Z176>2.55,3,IF(Z176>1.55,2,IF(Z176>0.55,1,0)))))","v":{"$error":"#REF!"}}]
[]
[]
[]
[null,null,null,null,null,null,null,null,null,null,null,null,null,null,null,null,{"$f":"IF(C55>D55,1,IF(C55=D55,0,2))","v":{"$error":"#REF!"}}]
[]
[null,null,null,null,null,null,null,null,null,null,null,null,null,null,null,null,{"$f":"IF(D48=1,1,2)+IF(Q179>0,99,0)","v":{"$error":"#REF!"}},null,null,null,null,null,0.5]
[null,null,null,null,null,null,null,null,null,null,null,null,null,null,null,null,null,null,null,null,null,null,1]
[null,null,null,null,null,null,null,null,null,null,null,null,null,null,null,null,null,null,null,null,null,null,2]
[null,null,null,null,null,null,null,null,null,null,null,null,null,null,null,null,"Для команды 1",null,null,"Для команды 2",null,null,3]
[null,null,null,null,null,null,null,null,null,null,null,null,null,null,null,null,{"$f":"IF(Q183=1,Q179,Q196)","v":{"$error":"#REF!"}},null,null,{"$f":"IF(Q183=2,Q179,U190)","v":{"$error":"#REF!"}}]
[null,null,null,null,null,null,null,null,null,null,null,null,null,null,null,null,{"$f":"IF(Q189>12,Q171,IF(Q189>7,Q173,IF(Q189>4,Q175,IF(Q189>0,V175,Q193))))","v":{"$error":"#REF!"}},null,null,{"$f":"IF(T189>13,Q172,IF(T189>7,Q174,IF(T189>4,Q176,IF(T189>0,V176,T192))))","v":{"$error":"#REF!"}}]
[null,null,null,null,null,null,null,null,null,null,null,null,null,null,null,null,1]
[]
[]
[]
[]
[]
[]
[]
[null,null,null,null,null,null,null,null,null,null,null,null,null,null,null,null,{"$f":"IF(Q179=0,D48,8)","v":{"$error":"#REF!"}}]
[]
[]
[]
[]
[]
[]
[]
[]
[]
[null,"Победа"]
[null,"Ничья"]
[null,"Поражение"]
[null,"к 1","к2","к1","к2"]
[null,{"$f":"IF(B8=\"В\",2,IF(B8=\"Н\",1,0))","v":{"$error":"#REF!"}},{"$f":"IF(D8=\"В\",2,IF(D8=\"Н\",1,0))","v":{"$error":"#REF!"}},{"$f":"IF(B8=\"В\",1,0)","v":{"$error":"#REF!"}},{"$f":"IF(D8=\"В\",1,0)","v":{"$error":"#REF!"}}]
[null,{"$f":"IF(B9=\"В\",2,IF(B9=\"Н\",1,0))","v":{"$error":"#REF!"}},{"$f":"IF(D9=\"В\",2,IF(D9=\"Н\",1,0))","v":{"$error":"#REF!"}},{"$f":"IF(B9=\"В\",1,0)","v":{"$error":"#REF!"}},{"$f":"IF(D9=\"В\",1,0)","v":{"$error":"#REF!"}}]
[null,{"$error":"#REF!"},{"$error":"#REF!"},{"$error":"#REF!"},{"$error":"#REF!"}]
[null,{"$error":"#REF!"},{"$error":"#REF!"},{"$error":"#REF!"},{"$error":"#REF!"}]
[null,{"$error":"#REF!"},{"$error":"#REF!"},{"$error":"#REF!"},{"$error":"#REF!"}]
[null,{"$error":"#REF!"},{"$error":"#REF!"},{"$error":"#REF!"},{"$error":"#REF!"}]
[null,{"$error":"#REF!"},{"$error":"#REF!"},{"$error":"#REF!"},{"$error":"#REF!"}]
[null,{"$error":"#REF!"},{"$error":"#REF!"},{"$error":"#REF!"},{"$error":"#REF!"}]
[null,{"$error":"#REF!"},{"$error":"#REF!"},{"$error":"#REF!"},{"$error":"#REF!"}]
[null,{"$error":"#REF!"},{"$error":"#REF!"},{"$error":"#REF!"},{"$error":"#REF!"}]
[null,{"$f":"SUM(B213:B222)","v":{"$error":"#REF!"}},{"$f":"SUM(C213:C222)","v":{"$error":"#REF!"}},{"$f":"SUM(D213:D222)","v":{"$error":"#REF!"}},{"$f":"SUM(E213:E222)","v":{"$error":"#REF!"}}]