{"text_format":"1","workbook":"xlsx","n_sheets":5,"sheets":["Settings","ПРОГНОЗ","DataPort","V31V34","TEMP"],"not_rendered":{"charts":0,"images":0,"macros":1,"external_links":0,"defined_names":1,"comments":0,"pivot_tables":0},"unopened":[],"bounds":{"document_bytes":16777216,"sheet_cells":100000,"rows_first":2000,"rows_last":500,"rows_between":2000,"halvings":0,"cell_chars":16384,"cell_head_chars":4096},"cells_cut":0,"cells_raw":0,"read":"whole","date_system":"1900"}

{"sheet":"Settings","index":0,"n_rows":15,"n_cols":9,"rows_kept":15,"cut":false,"hidden":true,"merged":[]}
["GMT +0",5,{"$f":"TODAY()-7","v":"2021-09-22"},9,"FLASHSCORE.COM (EN)",3,"No AutoSave",1,{"$f":"IF(H1=1,-1,IF(H1=2,5,IF(H1=3,10,IF(H1=4,20,0))))","v":-1}]
["GMT +1",null,{"$f":"TODAY()-6","v":"2021-09-23"},null,"SOCCERSTAND.COM (EN)",null,"AutoSave 5"]
["GMT +2",null,{"$f":"TODAY()-5","v":"2021-09-24"},null,"SOCCERSTAND.COM (RU)",null,"AutoSave 10"]
["GMT +3",null,{"$f":"TODAY()-4","v":"2021-09-25"},null,"MYSCORE.RU (RU)",null,"AutoSave 20"]
["GMT +4",null,{"$f":"TODAY()-3","v":"2021-09-26"},null,"MYSCORE.COM.UA (RU)"]
["GMT +5",null,{"$f":"TODAY() -2","v":"2021-09-27"}]
["GMT +6",null,"Вчера"]
["GMT +7",null,"Сегодня"]
["GMT +8",null,"Завтра"]
["GMT +9",null,{"$f":"TODAY()+2","v":"2021-10-01"}]
["GMT +10",null,{"$f":"TODAY()+3","v":"2021-10-02"}]
["GMT +11",null,{"$f":"TODAY()+4","v":"2021-10-03"}]
["GMT +12",null,{"$f":"TODAY()+5","v":"2021-10-04"}]
["GMT +13",null,{"$f":"TODAY()+6","v":"2021-10-05"}]
[null,null,{"$f":"TODAY()+7","v":"2021-10-06"}]
{"$rows_left_out":1}
{"sheet":"ПРОГНОЗ","index":1,"n_rows":146,"n_cols":54,"rows_kept":146,"cut":false,"hidden":false,"merged":[[0,0,2,1],[0,2,2,13],[0,14,0,21],[1,14,1,21],[2,14,2,21]]}
["RADARIO BET"]
[]
[]
["Дата / Время","Чемпионат","Команда 1","Команда 2","Вероятность П1","Вероятность П2","ПРОГНОЗ ИСХОД","ПРОГНОЗ ТОТАЛ","Кеф\nП1","Кеф\nX","Кеф\nП2","Кеф\nТБ 2.5","Кеф\nТМ 2.5","СЧЕТ МАТЧА",null,null,null,null,null,null,null,null,null,null,null,null,null,null,null,null,null,null,null,null,null,null,null,null,null,null,null,null,null,null,null,null,null,null,null,null,null,null,null,"id"]
["01.10.2021 00:00","ECUADOR: Serie B","Ind. Juniors","Atl. Porteno",0.66388888888888897,0.33611111111111108,"1Х","ТБ1,5",null,null,null,null,null,null,null,null,null,null,null,null,null,null,null,null,null,null,null,null,null,null,null,null,null,null,null,null,null,null,null,null,null,null,null,null,null,null,null,null,null,null,null,null,null,"tpk2wr0T"]
["01.10.2021 00:00","VENEZUELA: Primera Division - First stage","Mineros","Caracas",0.45331695331695326,0.54668304668304679,"Х2","",null,null,null,null,null,null,null,null,null,null,null,null,null,null,null,null,null,null,null,null,null,null,null,null,null,null,null,null,null,null,null,null,null,null,null,null,null,null,null,null,null,null,null,null,null,"KAS4NVDO"]
["01.10.2021 00:30","PERU: Liga 2 - Clausura","Chavelines","Comerciantes Unidos",0.8999980000079999,0.10000199999200005,"1Х","ТБ1,5",null,null,null,null,null,null,null,null,null,null,null,null,null,null,null,null,null,null,null,null,null,null,null,null,null,null,null,null,null,null,null,null,null,null,null,null,null,null,null,null,null,null,null,null,null,"6yUgkubg"]
["01.10.2021 00:30","PERU: Liga 2 - Clausura","Union Comercio","Juan Aurich",0.67500000000000004,0.32500000000000001,"Ф1(0)","ТБ1,5",null,null,null,null,null,null,null,null,null,null,null,null,null,null,null,null,null,null,null,null,null,null,null,null,null,null,null,null,null,null,null,null,null,null,null,null,null,null,null,null,null,null,null,null,null,"KvYclaDa"]
["01.10.2021 00:30","PERU: Liga 2 - Clausura","Union Huaral","Grau",0.52272727272727271,0.47727272727272729,"Ф2(0)","",null,null,null,null,null,null,null,null,null,null,null,null,null,null,null,null,null,null,null,null,null,null,null,null,null,null,null,null,null,null,null,null,null,null,null,null,null,null,null,null,null,null,null,null,null,"CEUkjLrm"]
["29.09.2021 23:00","ARGENTINA: Torneo Federal","CDJU Gualeguaychu","Gimnasia y Tiro",0.39386401326699833,0.60613598673300162,"Х2","ТМ3,5",null,null,null,null,null,null,null,null,null,null,null,null,null,null,null,null,null,null,null,null,null,null,null,null,null,null,null,null,null,null,null,null,null,null,null,null,null,null,null,null,null,null,null,null,null,"dnIKqKsM"]
["29.09.2021 23:00","ARGENTINA: Torneo Federal","Cipolletti","Sansinena",0.70000000000000007,0.29999999999999993,"Ф1(0)","",null,null,null,null,null,null,null,null,null,null,null,null,null,null,null,null,null,null,null,null,null,null,null,null,null,null,null,null,null,null,null,null,null,null,null,null,null,null,null,null,null,null,null,null,null,"8W6h1V5Q"]
["29.09.2021 23:00","ARGENTINA: Torneo Federal","Club Sportivo Penarol","Huracan Las Heras",0.69791666666666663,0.30208333333333337,"1Х","",null,null,null,null,null,null,null,null,null,null,null,null,null,null,null,null,null,null,null,null,null,null,null,null,null,null,null,null,null,null,null,null,null,null,null,null,null,null,null,null,null,null,null,null,null,"b1P1v8bD"]
["29.09.2021 23:00","ARGENTINA: Torneo Federal","Gimnasia E.R.","Defensores Belgrano VR",0.54761904761904756,0.45238095238095238,"Х2","",null,null,null,null,null,null,null,null,null,null,null,null,null,null,null,null,null,null,null,null,null,null,null,null,null,null,null,null,null,null,null,null,null,null,null,null,null,null,null,null,null,null,null,null,null,"S6Q3m2rc"]
["29.09.2021 23:00","ARGENTINA: Torneo Federal","Independiente Chivilcoy","Juventud Unida Universitario",0.50956937799043067,0.49043062200956933,"1Х","ТМ3,5",null,null,null,null,null,null,null,null,null,null,null,null,null,null,null,null,null,null,null,null,null,null,null,null,null,null,null,null,null,null,null,null,null,null,null,null,null,null,null,null,null,null,null,null,null,"vc2l2BjK"]
["29.09.2021 23:00","CHILE: Primera Division","S. Wanderers","U. De Chile",0.20833333333333334,0.79166666666666663,"Х2","",null,null,null,null,null,null,null,null,null,null,null,null,null,null,null,null,null,null,null,null,null,null,null,null,null,null,null,null,null,null,null,null,null,null,null,null,null,null,null,null,null,null,null,null,null,"vq7r6puj"]
{"$rows_left_out":132}
{"sheet":"DataPort","index":2,"n_rows":48,"n_cols":64,"rows_kept":48,"cut":false,"hidden":true,"merged":[]}
["General",null,"Matches","W","D","L","For","Aga","Pts",{"$f":"LOOKUP(2,1/(ПРОГНОЗ!B:B<>\"\"),ROW(ПРОГНОЗ!B:B))+1","v":147},"Home",null,"Matches","W","D","L","For","Aga","Pts",null,"Away",null,"Matches","W","D","L","For","Aga","Pts",null,"General",null,null,"Matches","Over","Under","Goals For","Goals Aga",null,"Home",null,"Matches","Over","Under","Goals For","Goals Aga",null,"Away",null,"Matches","Over","Under","Goals For","Goals Aga",null,14,"Form","Matches","W","D","L","For","Aga","Pts"]
[1,"Titanes",14,7,5,2,23,11,26,null,1,"Titanes",7,5,2,0,15,4,17,null,1,{"$f":"IF(L2=\"\",\"\",L2)","v":"Titanes"},{"$f":"IFERROR(VLOOKUP(V2,$B$2:$I$35,2,FALSE)-M2,\"\")","v":7},{"$f":"IFERROR(VLOOKUP(V2,$B$2:$I$35,3,FALSE)-N2,\"\")","v":2},{"$f":"IFERROR(VLOOKUP(V2,$B$2:$I$35,4,FALSE)-O2,\"\")","v":3},{"$f":"IFERROR(VLOOKUP(V2,$B$2:$I$35,5,FALSE)-P2,\"\")","v":2},{"$f":"IFERROR(VLOOKUP(V2,$B$2:$I$35,6,FALSE)-Q2,\"\")","v":8},{"$f":"IFERROR(VLOOKUP(V2,$B$2:$I$35,7,FALSE)-R2,\"\")","v":7},{"$f":"IFERROR(VLOOKUP(V2,$B$2:$I$35,8,FALSE)-S2,\"\")","v":9},null,2.5,1,"Llaneros",14,10,4,11,42,2.5,1,"Llaneros",7,5,2,8,20,null,null,{"$f":"IF(AO2=\"\",\"\",AO2)","v":"Llaneros"},{"$f":"IFERROR(VLOOKUP(AW2,$AG$2:$AL$35,2,FALSE)-AP2,\"\")","v":7},{"$f":"IFERROR(VLOOKUP(AW2,$AG$2:$AL$35,3,FALSE)-AQ2,\"\")","v":5},{"$f":"IFERROR(VLOOKUP(AW2,$AG$2:$AL$35,4,FALSE)-AR2,\"\")","v":2},{"$f":"IFERROR(VLOOKUP(AW2,$AG$2:$AL$35,5,FALSE)-AS2,\"\")","v":3},{"$f":"IFERROR(VLOOKUP(AW2,$AG$2:$AL$35,6,FALSE)-AT2,\"\")","v":22},null,1,"Local Andina",5,3,2,0,6,"2","11"]
[2,"Academia Rey",14,7,4,3,21,10,25,null,2,"El Vigia",7,5,2,0,13,2,17,null,2,{"$f":"IF(L3=\"\",\"\",L3)","v":"El Vigia"},{"$f":"IFERROR(VLOOKUP(V3,$B$2:$I$35,2,FALSE)-M3,\"\")","v":7},{"$f":"IFERROR(VLOOKUP(V3,$B$2:$I$35,3,FALSE)-N3,\"\")","v":1},{"$f":"IFERROR(VLOOKUP(V3,$B$2:$I$35,4,FALSE)-O3,\"\")","v":1},{"$f":"IFERROR(VLOOKUP(V3,$B$2:$I$35,5,FALSE)-P3,\"\")","v":5},{"$f":"IFERROR(VLOOKUP(V3,$B$2:$I$35,6,FALSE)-Q3,\"\")","v":7},{"$f":"IFERROR(VLOOKUP(V3,$B$2:$I$35,7,FALSE)-R3,\"\")","v":13},{"$f":"IFERROR(VLOOKUP(V3,$B$2:$I$35,8,FALSE)-S3,\"\")","v":4},null,2.5,2,"Titanes",14,7,7,23,11,2.5,2,"Titanes",7,4,3,15,4,null,null,{"$f":"IF(AO3=\"\",\"\",AO3)","v":"Titanes"},{"$f":"IFERROR(VLOOKUP(AW3,$AG$2:$AL$35,2,FALSE)-AP3,\"\")","v":7},{"$f":"IFERROR(VLOOKUP(AW3,$AG$2:$AL$35,3,FALSE)-AQ3,\"\")","v":3},{"$f":"IFERROR(VLOOKUP(AW3,$AG$2:$AL$35,4,FALSE)-AR3,\"\")","v":4},{"$f":"IFERROR(VLOOKUP(AW3,$AG$2:$AL$35,5,FALSE)-AS3,\"\")","v":8},{"$f":"IFERROR(VLOOKUP(AW3,$AG$2:$AL$35,6,FALSE)-AT3,\"\")","v":7},null,2,"Yaracuy",5,3,2,0,5,"2","11"]
[3,"Urena",14,6,6,2,20,14,24,null,3,"Academia Rey",7,4,3,0,9,2,15,null,3,"Academia Rey",7,3,1,3,12,8,10,null,2.5,3,"Frontera",14,6,8,20,15,2.5,3,"Urena",7,3,4,11,7,null,null,"Urena",7,2,5,9,7,null,3,"Titanes",5,3,1,1,11,"3","10"]
[4,"Frontera",14,6,6,2,20,15,24,null,4,"Yaracuy",6,4,2,0,7,3,14,null,4,"Yaracuy",8,1,3,4,7,11,6,null,2.5,4,"El Vigia",14,5,9,20,15,2.5,4,"Local Andina",7,3,4,11,6,null,null,"Local Andina",7,0,7,2,4,null,4,"Urena",5,2,3,0,7,"4","9"]
[5,"El Vigia",14,6,3,5,20,15,21,null,5,"Urena",7,4,1,2,11,7,13,null,5,"Urena",7,2,5,0,9,7,11,null,2.5,5,"Urena",14,5,9,20,14,2.5,5,"JBL Zulia",8,3,5,5,11,null,null,"JBL Zulia",6,0,6,1,7,null,5,"El Vigia",5,3,0,2,8,"7","9"]
[6,"Yaracuy",14,5,5,4,14,14,20,null,6,"Local Andina",7,3,2,2,11,6,11,null,6,"Local Andina",7,1,4,2,2,4,7,null,2.5,6,"Academia Rey",14,5,9,21,10,2.5,6,"Yaracuy",6,3,3,7,3,null,null,"Yaracuy",8,2,6,7,11,null,6,"Frontera",5,2,2,1,7,"5","8"]
[7,"Local Andina",14,4,6,4,13,10,18,null,7,"Rayo Zuliano",7,2,4,1,4,3,10,null,7,"Rayo Zuliano",7,2,2,3,5,5,8,null,2.5,7,"Yaracuy",14,5,9,14,14,2.5,7,"Frontera",7,2,5,7,9,null,null,{"$f":"IF(AO8=\"\",\"\",AO8)","v":"Frontera"},{"$f":"IFERROR(VLOOKUP(AW8,$AG$2:$AL$35,2,FALSE)-AP8,\"\")","v":7},{"$f":"IFERROR(VLOOKUP(AW8,$AG$2:$AL$35,3,FALSE)-AQ8,\"\")","v":4},{"$f":"IFERROR(VLOOKUP(AW8,$AG$2:$AL$35,4,FALSE)-AR8,\"\")","v":3},{"$f":"IFERROR(VLOOKUP(AW8,$AG$2:$AL$35,5,FALSE)-AS8,\"\")","v":13},{"$f":"IFERROR(VLOOKUP(AW8,$AG$2:$AL$35,6,FALSE)-AT8,\"\")","v":6},null,7,"Academia Rey",5,1,2,2,8,"5","5"]
[8,"Rayo Zuliano",14,4,6,4,9,8,18,null,8,"Frontera",7,1,4,2,7,9,7,null,8,{"$f":"IF(L9=\"\",\"\",L9)","v":"Frontera"},{"$f":"IFERROR(VLOOKUP(V9,$B$2:$I$35,2,FALSE)-M9,\"\")","v":7},{"$f":"IFERROR(VLOOKUP(V9,$B$2:$I$35,3,FALSE)-N9,\"\")","v":5},{"$f":"IFERROR(VLOOKUP(V9,$B$2:$I$35,4,FALSE)-O9,\"\")","v":2},{"$f":"IFERROR(VLOOKUP(V9,$B$2:$I$35,5,FALSE)-P9,\"\")","v":0},{"$f":"IFERROR(VLOOKUP(V9,$B$2:$I$35,6,FALSE)-Q9,\"\")","v":13},{"$f":"IFERROR(VLOOKUP(V9,$B$2:$I$35,7,FALSE)-R9,\"\")","v":6},{"$f":"IFERROR(VLOOKUP(V9,$B$2:$I$35,8,FALSE)-S9,\"\")","v":17},null,2.5,8,"JBL Zulia",14,3,11,6,18,2.5,8,"El Vigia",7,1,6,13,2,null,null,"El Vigia",7,4,3,7,13,null,8,"Rayo Zuliano",5,1,1,3,5,"6","4"]
[9,"JBL Zulia",14,1,4,9,6,18,7,null,9,"JBL Zulia",8,1,2,5,5,11,5,null,9,"JBL Zulia",6,0,2,4,1,7,2,null,2.5,9,"Local Andina",14,3,11,13,10,2.5,9,"Academia Rey",7,1,6,9,2,null,null,"Academia Rey",7,4,3,12,8,null,9,"JBL Zulia",5,0,1,4,2,"9","1"]
[10,"Llaneros",14,1,1,12,11,42,4,null,10,"Llaneros",7,1,1,5,8,20,4,null,10,"Llaneros",7,0,0,7,3,22,0,null,2.5,10,"Rayo Zuliano",14,3,11,9,8,2.5,10,"Rayo Zuliano",7,1,6,4,3,null,null,"Rayo Zuliano",7,2,5,5,5,null,10,"Llaneros",5,0,0,5,3,"19","0"]
[null,null,null,null,null,null,null,null,null,null,null,null,null,null,null,null,null,null,null,null,11,"","","","","","","","",null,null,null,null,null,null,null,null,null,null,null,null,null,null,null,null,null,null,null,"","","","","",""]
[null,null,null,null,null,null,null,null,null,null,null,null,null,null,null,null,null,null,null,null,12,"","","","","","","","",null,null,null,null,null,null,null,null,null,null,null,null,null,null,null,null,null,null,null,"","","","","",""]
[null,null,null,null,null,null,null,null,null,null,null,null,null,null,null,null,null,null,null,null,null,"","","","","","","","",null,null,null,null,null,null,null,null,null,null,null,null,null,null,null,null,null,null,null,"","","","","",""]
[null,null,null,null,null,null,null,null,null,null,null,null,null,null,null,null,null,null,null,null,null,"","","","","","","","",null,null,null,null,null,null,null,null,null,null,null,null,null,null,null,null,null,null,null,"","","","","",""]
{"$rows_left_out":34}
{"sheet":"V31V34","index":3,"n_rows":75,"n_cols":39,"rows_kept":75,"cut":false,"hidden":true,"merged":[[25,0,26,6],[25,7,26,15],[27,14,27,15],[61,15,61,16],[9,33,10,39],[8,15,9,23],[22,21,22,22],[57,15,57,16],[57,30,57,31],[52,32,52,33],[55,32,55,33],[46,15,46,16],[46,30,46,31],[48,15,48,16],[48,30,48,31],[49,15,49,16],[39,32,39,33],[42,15,42,16],[42,17,42,18],[61,30,61,31],[42,30,42,31],[42,32,42,33],[44,15,44,16],[44,30,44,31],[43,15,43,16],[43,17,43,18],[44,17,44,18],[52,15,52,16],[52,17,52,18],[52,30,52,31],[55,15,55,16],[61,17,61,18],[55,17,55,18],[55,30,55,31],[56,15,56,16],[56,17,56,18],[57,17,57,18],[49,30,49,31],[6,15,6,16],[6,30,6,31],[9,30,9,31],[15,22,15,23],[35,15,35,16],[35,30,35,31],[36,15,36,16],[36,30,36,31],[39,15,39,16],[39,17,39,18],[39,30,39,31],[1,15,1,16],[1,30,1,31],[2,15,2,16],[2,30,2,31],[5,15,5,16],[5,30,5,31]]}
[null,null,null,null,null,null,null,null,null,null,null,null,null,null,null,null,"команда","и","в","н","п","з","п",null,null,null,null,null,null,null,null,"команда","и","в","н","п","з","п"]
[null,null,null,null,null,null,null,null,null,null,null,null,null,"Общая Турнирка",null,{"$f":"DataPort!B39","v":0},null,{"$f":"IFERROR(VLOOKUP(P2,DataPort!$B$2:$I$35,2,FALSE),0)","v":0},{"$f":"IF(VLOOKUP(P2,DataPort!$B$2:$I$35,3,FALSE)=0,0.0001,VLOOKUP(P2,DataPort!$B$2:$I$35,3,FALSE))","v":{"$error":"#N/A"}},{"$f":"IF(VLOOKUP(P2,DataPort!$B$2:$I$35,4,FALSE)=0,0.0001,VLOOKUP(P2,DataPort!$B$2:$I$35,4,FALSE))","v":{"$error":"#N/A"}},{"$f":"VLOOKUP(P2,DataPort!$B$2:$I$35,5,FALSE)","v":{"$error":"#N/A"}},{"$f":"VLOOKUP(P2,DataPort!$B$2:$I$35,6,FALSE)","v":{"$error":"#N/A"}},{"$f":"VLOOKUP(P2,DataPort!$B$2:$I$35,7,FALSE)","v":{"$error":"#N/A"}},null,null,null,null,null,null,null,{"$f":"P2","v":0},null,{"$f":"VLOOKUP(AE2,DataPort!$B$2:$I$35,2,FALSE)","v":{"$error":"#N/A"}},{"$f":"IF(VLOOKUP(AE2,DataPort!$B$2:$I$35,3,FALSE)=0,0.0001,VLOOKUP(AE2,DataPort!$B$2:$I$35,3,FALSE))","v":{"$error":"#N/A"}},{"$f":"IF(VLOOKUP(AE2,DataPort!$B$2:$I$35,4,FALSE)=0,0.0001,VLOOKUP(AE2,DataPort!$B$2:$I$35,4,FALSE))","v":{"$error":"#N/A"}},{"$f":"VLOOKUP(AE2,DataPort!$B$2:$I$35,5,FALSE)","v":{"$error":"#N/A"}},{"$f":"VLOOKUP(AE2,DataPort!$B$2:$I$35,6,FALSE)","v":{"$error":"#N/A"}},{"$f":"VLOOKUP(AE2,DataPort!$B$2:$I$35,7,FALSE)","v":{"$error":"#N/A"}}]
[null,null,null,null,null,null,null,null,null,null,null,null,null,null,null,{"$f":"DataPort!B40","v":0},null,{"$f":"IFERROR(VLOOKUP(P3,DataPort!$B$2:$I$35,2,FALSE),0)","v":0},{"$f":"IF(VLOOKUP(P3,DataPort!$B$2:$I$35,3,FALSE)=0,0.0001,VLOOKUP(P3,DataPort!$B$2:$I$35,3,FALSE))","v":{"$error":"#N/A"}},{"$f":"IF(VLOOKUP(P3,DataPort!$B$2:$I$35,4,FALSE)=0,0.0001,VLOOKUP(P3,DataPort!$B$2:$I$35,4,FALSE))","v":{"$error":"#N/A"}},{"$f":"VLOOKUP(P3,DataPort!$B$2:$I$35,5,FALSE)","v":{"$error":"#N/A"}},{"$f":"VLOOKUP(P3,DataPort!$B$2:$I$35,6,FALSE)","v":{"$error":"#N/A"}},{"$f":"VLOOKUP(P3,DataPort!$B$2:$I$35,7,FALSE)","v":{"$error":"#N/A"}},null,null,null,null,null,null,null,{"$f":"P3","v":0},null,{"$f":"VLOOKUP(AE3,DataPort!$B$2:$I$35,2,FALSE)","v":{"$error":"#N/A"}},{"$f":"IF(VLOOKUP(AE3,DataPort!$B$2:$I$35,3,FALSE)=0,0.0001,VLOOKUP(AE3,DataPort!$B$2:$I$35,3,FALSE))","v":{"$error":"#N/A"}},{"$f":"IF(VLOOKUP(AE3,DataPort!$B$2:$I$35,4,FALSE)=0,0.0001,VLOOKUP(AE3,DataPort!$B$2:$I$35,4,FALSE))","v":{"$error":"#N/A"}},{"$f":"VLOOKUP(AE3,DataPort!$B$2:$I$35,5,FALSE)","v":{"$error":"#N/A"}},{"$f":"VLOOKUP(AE3,DataPort!$B$2:$I$35,6,FALSE)","v":{"$error":"#N/A"}},{"$f":"VLOOKUP(AE3,DataPort!$B$2:$I$35,7,FALSE)","v":{"$error":"#N/A"}}]
[]
[null,null,null,null,null,null,null,null,null,null,null,null,null,"Турнирка Дома",null,null,"команда","и","в","н","п","з","п",null,null,null,null,null,null,null,null,"команда","и","в","н","п","з","п"]
[null,null,null,null,null,null,null,null,null,null,null,null,null,null,"дг",{"$f":"P2","v":0},null,{"$f":"VLOOKUP(P6,DataPort!$L$2:$S$35,2,FALSE)","v":{"$error":"#N/A"}},{"$f":"IF(VLOOKUP(P6,DataPort!$L$2:$S$35,3,FALSE)=0,0.0001,VLOOKUP(P6,DataPort!$L$2:$S$35,3,FALSE))","v":{"$error":"#N/A"}},{"$f":"IF(VLOOKUP(P6,DataPort!$L$2:$S$35,4,FALSE)=0,0.0001,VLOOKUP(P6,DataPort!$L$2:$S$35,4,FALSE))","v":{"$error":"#N/A"}},{"$f":"VLOOKUP(P6,DataPort!$L$2:$S$35,5,FALSE)","v":{"$error":"#N/A"}},{"$f":"VLOOKUP(P6,DataPort!$L$2:$S$35,6,FALSE)","v":{"$error":"#N/A"}},{"$f":"VLOOKUP(P6,DataPort!$L$2:$S$35,7,FALSE)","v":{"$error":"#N/A"}},null,null,null,null,null,null,null,{"$f":"AE2","v":0},null,{"$f":"VLOOKUP(AE6,DataPort!$L$2:$S$35,2,FALSE)","v":{"$error":"#N/A"}},{"$f":"IF(VLOOKUP(AE6,DataPort!$L$2:$S$35,3,FALSE)=0,0.0001,VLOOKUP(AE6,DataPort!$L$2:$S$35,3,FALSE))","v":{"$error":"#N/A"}},{"$f":"IF(VLOOKUP(AE6,DataPort!$L$2:$S$35,4,FALSE)=0,0.0001,VLOOKUP(AE6,DataPort!$L$2:$S$35,4,FALSE))","v":{"$error":"#N/A"}},{"$f":"VLOOKUP(AE6,DataPort!$L$2:$S$35,5,FALSE)","v":{"$error":"#N/A"}},{"$f":"VLOOKUP(AE6,DataPort!$L$2:$S$35,6,FALSE)","v":{"$error":"#N/A"}},{"$f":"VLOOKUP(AE6,DataPort!$L$2:$S$35,7,FALSE)","v":{"$error":"#N/A"}}]
[null,null,null,null,null,null,null,null,null,null,null,null,null,null,null,{"$f":"P3","v":0},null,{"$f":"VLOOKUP(P7,DataPort!$V$2:$AC$35,2,FALSE)","v":{"$error":"#N/A"}},{"$f":"IF(VLOOKUP(P7,DataPort!$V$2:$AC$35,3,FALSE)=0,0.00001,VLOOKUP(P7,DataPort!$V$2:$AC$35,3,FALSE))","v":{"$error":"#N/A"}},{"$f":"IF(VLOOKUP(P7,DataPort!$V$2:$AC$35,4,FALSE)=0,0.0001,VLOOKUP(P7,DataPort!$V$2:$AC$35,4,FALSE))","v":{"$error":"#N/A"}},{"$f":"VLOOKUP(P7,DataPort!$V$2:$AC$35,5,FALSE)","v":{"$error":"#N/A"}},{"$f":"VLOOKUP(P7,DataPort!$V$2:$AC$35,6,FALSE)","v":{"$error":"#N/A"}},{"$f":"VLOOKUP(P7,DataPort!$V$2:$AC$35,7,FALSE)","v":{"$error":"#N/A"}},null,null,null,null,null,null,null,{"$f":"AE3","v":0},null,{"$f":"VLOOKUP(AE7,DataPort!$V$2:$AC$35,2,FALSE)","v":{"$error":"#N/A"}},{"$f":"IF(VLOOKUP(AE7,DataPort!$V$2:$AC$35,3,FALSE)=0,0.00001,VLOOKUP(AE7,DataPort!$V$2:$AC$35,3,FALSE))","v":{"$error":"#N/A"}},{"$f":"IF(VLOOKUP(AE7,DataPort!$V$2:$AC$35,4,FALSE)=0,0.0001,VLOOKUP(AE7,DataPort!$V$2:$AC$35,4,FALSE))","v":{"$error":"#N/A"}},{"$f":"VLOOKUP(AE7,DataPort!$V$2:$AC$35,5,FALSE)","v":{"$error":"#N/A"}},{"$f":"VLOOKUP(AE7,DataPort!$V$2:$AC$35,6,FALSE)","v":{"$error":"#N/A"}},{"$f":"VLOOKUP(AE7,DataPort!$V$2:$AC$35,7,FALSE)","v":{"$error":"#N/A"}}]
[]
[null,null,null,null,null,null,null,null,null,null,null,null,null,null,null,"V 3_4_modTotal"]
[null,null,null,null,null,null,null,null,null,null,null,null,null,null,null,null,null,null,null,null,null,null,null,null,null,null,null,null,null,null,null,null,null,"V 3_1"]
[]
[null,null,null,null,null,null,null,null,null,null,null,null,null,null,null,null,null,null,null,"всего",{"$f":"Q16/(Q16+R16)","v":{"$error":"#N/A"}},{"$f":"R16/(R16+Q16)","v":{"$error":"#N/A"}}]
[null,null,null,null,null,null,null,null,null,null,null,null,null,null,null,null,null,null,null,"дома\\гости",{"$f":"Q23/(Q23+R23)","v":{"$error":"#N/A"}},{"$f":"R23/(R23+Q23)","v":{"$error":"#N/A"}}]
[null,null,null,null,null,null,null,null,null,null,null,null,null,null,null,"итого",{"$f":"V2/(R2)","v":{"$error":"#N/A"}},{"$f":"V3/(R3)","v":{"$error":"#N/A"}},null,"%%",{"$f":"(U12+U13)/2","v":{"$error":"#N/A"}},{"$f":"(V12+V13)/2","v":{"$error":"#N/A"}},{"$f":"IF(U14>0,\"+\",IF(U14<0,\"-\",\"\"))","v":{"$error":"#N/A"}},{"$f":"IF(V14>0,\"+\",IF(V14<0,\"-\",\"\"))","v":{"$error":"#N/A"}},null,null,null,null,null,null,"итого",{"$f":"AK2/(AG2)","v":{"$error":"#N/A"}},{"$f":"AK3/(AG3)","v":{"$error":"#N/A"}}]
[null,null,null,null,null,null,null,null,null,null,null,null,null,null,null,null,{"$f":"W2/(R2+U2)","v":{"$error":"#N/A"}},{"$f":"W3/(R3+U3)","v":{"$error":"#N/A"}},null,"всего",{"$f":"(S2+T2)/R2","v":{"$error":"#N/A"}},{"$f":"(S3+T3)/R3","v":{"$error":"#N/A"}},null,null,null,null,null,null,null,null,null,{"$f":"(AL2+AJ2)/AG2","v":{"$error":"#N/A"}},{"$f":"(AL3+AJ3)/AG3","v":{"$error":"#N/A"}},null,null,null,null,{"$f":"AH2/AG2","v":{"$error":"#N/A"}},{"$f":"AH3/AG3","v":{"$error":"#N/A"}}]
{"$rows_left_out":61}
{"sheet":"TEMP","index":4,"n_rows":16,"n_cols":15,"rows_kept":16,"cut":false,"hidden":true,"merged":[]}
[]
[null,null,null,null,null,null,null,null,null,null,null,null,null,null,"AFHZxUPS"]
[null,null,null,null,null,null,null,null,null,null,null,null,null,null,"8G2WKU3p"]
[]
[null,null,null,null,null,null,null,null,null,null,null,null,null,null,"K0HkDtjt"]
[null,null,null,null,null,null,null,null,null,null,null,null,null,null,"ENGgC05n"]
[]
[null,null,null,null,null,null,null,null,null,null,null,null,null,null,"OnJA455O"]
[null,null,null,null,null,null,null,null,null,null,null,null,null,null,"lAOoA9ym"]
[]
[null,null,null,null,null,null,null,null,null,null,null,null,null,null,"nRohobQT"]
[]
[null,null,null,null,null,null,null,null,null,null,null,null,null,null,"n9ATwjJI"]
[null,null,null,null,null,null,null,null,null,null,null,null,null,null,"0CEXxAYO"]
[]
{"$rows_left_out":1}