{"text_format":"1","workbook":"xlsx","n_sheets":19,"sheets":["Старт","Список","Дома","Команда1","Гости","Команда2","ДомаДома","Predict2.5","Прогноз","ГостиГости","Очные","ДомаГости","ГостиДома","Лист1","Data","Arhiv","ОчныеДГ","Коэффициенты","Расчеты"],"not_rendered":{"charts":0,"images":1,"macros":1,"external_links":0,"defined_names":16,"comments":0,"pivot_tables":0},"unopened":[],"bounds":{"document_bytes":16777216,"sheet_cells":100000,"rows_first":2000,"rows_last":500,"rows_between":2000,"halvings":0,"cell_chars":16384,"cell_head_chars":4096},"cells_cut":0,"cells_raw":0,"read":"whole","date_system":"1900"}

{"sheet":"Старт","index":0,"n_rows":14,"n_cols":24,"rows_kept":14,"cut":false,"hidden":false,"merged":[]}
[]
[null,null,null,null,null,null,null,null,null,null,null,null,null,null,null,null,null,null,"GMT +0",4,{"$f":"TODAY()-7","v":"2021-06-01"},8,"flashscore.com (EN)",3]
[null,null,null,null,null,null,null,null,null,null,null,null,null,null,null,null,null,null,"GMT +1",null,{"$f":"TODAY()-6","v":"2021-06-02"},null,"soccerstand.com (EN)"]
[null,null,null,null,null,null,null,null,null,null,null,null,null,null,null,null,null,null,"GMT +2",null,{"$f":"TODAY()-5","v":"2021-06-03"},null,"soccerstand.com (RU)"]
[null,null,null,null,null,null,null,null,null,null,null,null,null,null,null,null,null,null,"GMT +3",null,{"$f":"TODAY()-4","v":"2021-06-04"},null,"myscore.ru (RU)"]
[null,null,null,null,null,null,null,null,null,null,null,null,null,null,null,null,null,null,"GMT +4",null,{"$f":"TODAY()-3","v":"2021-06-05"},null,"myscore.com.ua (RU)"]
[null,null,null,null,null,null,null,null,null,null,null,null,null,null,null,null,null,null,"GMT +5",null,{"$f":"TODAY() -2","v":"2021-06-06"}]
[null,null,null,null,null,null,null,null,null,null,null,null,null,null,null,null,null,null,"GMT +6",null,"Вчера"]
[null,null,null,null,null,null,null,null,null,null,null,null,null,null,null,null,null,null,"GMT +7",null,"Сегодня"]
[null,null,null,null,null,null,null,null,null,null,null,null,null,null,null,null,null,null,"GMT +8",null,"Завтра"]
[null,null,null,null,null,null,null,null,null,null,null,null,null,null,null,null,null,null,"GMT +9",null,{"$f":"TODAY()+2","v":"2021-06-10"}]
[null,null,null,null,null,null,null,null,null,null,null,null,null,null,null,null,null,null,"GMT +12",null,{"$f":"TODAY()+5","v":"2021-06-13"}]
[null,null,null,null,null,null,null,null,null,null,null,null,null,null,null,null,null,null,"GMT +13",null,{"$f":"TODAY()+6","v":"2021-06-14"}]
[null,null,null,null,null,null,null,null,null,null,null,null,null,null,null,null,null,null,null,null,{"$f":"TODAY()+7","v":"2021-06-15"}]

{"sheet":"Список","index":1,"n_rows":1000,"n_cols":20,"rows_kept":1000,"cut":false,"hidden":false,"merged":[]}
["Чемпионат","Дата/Время","Дома","Гости","Match_ID","Country_ID","home_ID","away_ID","Загрузить","К1","К2","П1 текущий","Х текущий","П2 текущий","П1 старт","Х старт","П2 старт","П1 прогруз","Х прогруз","П2 прогруз"]
["ИСЛАНДИЯ: Высшая лига","2021.06.07 23:00","Валюр","Викингур Рейкьявик","OfHJMwZe",92,null,null,"Загрузить",1,1,1.89,3.83,3.58,1.82,4,3.5,{"$f":"IF(L2=\"\",\"\",L2-O2)","v":6.999999999999984E-2},{"$f":"IF(M2=\"\",\"\",M2-P2)","v":-0.16999999999999993},{"$f":"IF(N2=\"\",\"\",N2-Q2)","v":8.0000000000000071E-2}]
["ЧИЛИ: Примера Б","2021.06.08 01:00","Депортес Пуэрто-Монтт","Депортес Темуко","t0yUjqO7",51,null,null,"Загрузить",1,0,2.2200000000000002,3.22,3.24,2.12,3.1,3.26,{"$f":"IF(L3=\"\",\"\",L3-O3)","v":0.10000000000000009},{"$f":"IF(M3=\"\",\"\",M3-P3)","v":0.12000000000000011},{"$f":"IF(N3=\"\",\"\",N3-Q3)","v":-1.9999999999999574E-2}]
["БРАЗИЛИЯ: Чемпионат Бразилии В","2021.06.08 02:00","Витория","Наутико","4bYqjeFs",39,null,null,"Загрузить",0,1,2.98,2.61,2.77,2.54,3.13,2.9,0.43999999999999995,-0.52,-0.12999999999999989]
["БРАЗИЛИЯ: Чемпионат Бразилии C - Первый этап","2021.06.08 02:00","Пайсанду","Ботафого ПБ","bg9IIx6t",39,null,null,"Загрузить",0,2,2.09,2.87,4.04,1.93,2.9,4.54,0.15999999999999992,-2.9999999999999805E-2,-0.5]
["США: Лига 2 ЮСЛ","2021.06.08 02:00","Lehigh Valley","RC New Jersey","U3djEotN",200,null,null,"Загрузить",3,1,null,null,null,null,null,null,"","",""]
["ЧИЛИ: Высший дивизион","2021.06.08 03:30","Нубленсе","Аудакс Итальяно","dbnKFtB6",51,null,null,"Загрузить",1,0,2.2000000000000002,3.25,3.3,2.37,3.25,2.75,-0.16999999999999993,0,0.54999999999999982]
["КИТАЙ: Первая лига - Первый этап","2021.06.08 11:00","Цзыбо Цуцзюй","Шэньси Чанъань","WIB85crK",52,null,null,"Загрузить",1,1,8.3000000000000007,4.58,1.37,10,4.74,1.26,-1.6999999999999993,-0.16000000000000014,0.1100000000000001]
["АЛЖИР: Лига U21","2021.06.08 12:00","Медеа U21","МК Алжир U21","xWWcxvy9",18,null,null,"Загрузить",1,6,2.4300000000000002,3.24,2.66,2.4,3.3,2.65,3.0000000000000249E-2,-5.9999999999999609E-2,1.0000000000000231E-2]
["АЛЖИР: Лига U21","2021.06.08 12:00","Скикда U21","Белуиздад U21","WhW1ybjF",18,null,null,"Загрузить",1,3,15,5.95,1.17,9.6,4.5,1.31,5.4,1.4500000000000002,-0.14000000000000012]
["ВЬЕТНАМ: Национальная лига - Женщины","2021.06.08 12:00","Ханой 2 (Ж)","TKS Viet Nam (Ж)","dOZ7sprc",206,null,null,"Загрузить",null,null,null,null,null,null,null,null,"","",""]
["МИР: Международные товарищеские матчи","2021.06.08 12:00","Босния и Герцеговина U19","Саудовская Аравия U20","jwq9lgdE",8,null,null,"Загрузить",0,1,1.57,4,5.25,1.51,4,6.05,6.0000000000000053E-2,0,-0.79999999999999982]
["КИТАЙ: Первая лига - Первый этап","2021.06.08 13:00","Zhejiang Professional","Хуакайер ФК","vqBC4HcQ",52,null,null,"Загрузить",null,null,1.2,6.1,13.8,1.21,5.5,10.5,-1.0000000000000009E-2,0.59999999999999964,3.3000000000000007]
["МИР: Международные товарищеские матчи","2021.06.08 14:00","Португалия U18","Норвегия U18","zBUL0mE8",8,null,null,"Загрузить",null,null,null,null,null,null,null,null,"","",""]
["МИР: Международные товарищеские матчи","2021.06.08 15:00","Словакия U21","Финляндия U21","xGjH2RTk",8,null,null,"Загрузить",null,null,1.8,3.2,4,1.61,3.4,5,0.18999999999999995,-0.19999999999999973,-1]
["СОМАЛИ: Чемпионат","2021.06.08 15:30","Декедда","ЛЛПП","4C391jR9",174,null,null,"Загрузить",null,null,null,null,null,null,null,null,"","",""]
["ГРУЗИЯ: Лига Эровнули 2","2021.06.08 16:00","FC Gareji Sagarejo","Тбилиси","4G7wG9If",80,null,null,"Загрузить",null,null,1.69,3.28,5.0999999999999996,2.2999999999999998,3.3,2.63,-0.60999999999999988,-2.0000000000000018E-2,2.4699999999999998]
["ГРУЗИЯ: Лига Эровнули 2","2021.06.08 16:00","Сиони","Мерани Мартвили","dj4VHVmr",80,null,null,"Загрузить",null,null,1.68,3.62,4.62,2.02,3.1,3.48,-0.34000000000000008,0.52,1.1400000000000001]
["МИР: Международные товарищеские матчи","2021.06.08 16:30","Хорватия U18","Словения U18","KCwGxHOa",8,null,null,"Загрузить",null,null,null,null,null,null,null,null,"","",""]
["ЛИВИЯ: Премьер-лига","2021.06.08 17:00","Аль-Ахли Триполи","Абу-Салим","MBdFb4kQ",114,null,null,"Загрузить",null,null,null,null,null,null,null,null,"","",""]
["ЛИВИЯ: Премьер-лига","2021.06.08 17:00","Аль-Садака","Шабааб Аль-Джабал","UgF224ze",114,null,null,"Загрузить",null,null,null,null,null,null,null,null,"","",""]
["ЛИВИЯ: Премьер-лига","2021.06.08 17:00","Аль-Таавун","Аль-Ахдар","rcJ61Ok1",114,null,null,"Загрузить",null,null,null,null,null,null,null,null,"","",""]
["ЛИВИЯ: Премьер-лига","2021.06.08 17:00","Аль-Хмес","Рафик","d4msfOcs",114,null,null,"Загрузить",null,null,null,null,null,null,null,null,"","",""]
["ЛИВИЯ: Премьер-лига","2021.06.08 17:00","Ассвехли","Аль-Атхад","vTxngrDm",114,null,null,"Загрузить",null,null,null,null,null,null,null,null,"","",""]
["ЛИВИЯ: Премьер-лига","2021.06.08 17:00","Олимпик Аззавейя","Махалла Триполи","IJyjh2Sg",114,null,null,"Загрузить",null,null,null,null,null,null,null,null,"","",""]
["МИР: Международные товарищеские матчи","2021.06.08 17:00","Дания U21","Аргентина U23","vXI1aGRP",8,null,null,"Загрузить",null,null,null,null,null,null,null,null,"","",""]
["МИР: Международные товарищеские матчи","2021.06.08 17:00","Косово","Гвинея","Wfw34JBA",8,null,null,"Загрузить",null,null,null,null,null,null,null,null,"","",""]
["ИРАН: Первый дивизион","2021.06.08 17:10","Бадеран Тегеран","Эстеглал Моласани","29bnCyUr",94,null,null,"Загрузить",null,null,1.54,3.76,6.05,1.64,3.2,5.6,-9.9999999999999867E-2,0.55999999999999961,0.45000000000000018]
["ИРАН: Первый дивизион","2021.06.08 17:10","Райка Баболь","Шахин Бушехр","pzTAVPU3",94,null,null,"Загрузить",null,null,3.24,2.34,2.84,2.63,2.7,2.75,0.61000000000000032,-0.36000000000000032,8.9999999999999858E-2]
["ИРАН: Первый дивизион","2021.06.08 17:20","Чока Талеш","Хуши-Талаи","dWcjBeqk",94,null,null,"Загрузить",null,null,3.48,3.01,2.17,3.28,2.5,2.52,0.20000000000000018,0.50999999999999979,-0.35000000000000009]
["ИРАН: Первый дивизион","2021.06.08 17:35","Арман Гохар","Мес Керман","G0O6W5Fc",94,null,null,"Загрузить",null,null,3.58,2.82,2.2400000000000002,3.08,2.63,2.52,0.5,0.18999999999999995,-0.2799999999999998]
["ЕВРОПА: Чемпионат Европы до 21 года - Квалификация","2021.06.08 17:45","Швеция U21","Люксембург U21","tWqYOnEG",6,null,null,"Загрузить",null,null,1.04,14.5,36,1.04,13,24,0,1.5,12]
["ИРАН: Первый дивизион","2021.06.08 17:55","Кашкай Шираз","Гол Рейхан","xAP2Xo0i",94,null,null,"Загрузить",null,null,1.51,3.82,6.35,1.64,3.5,4.88,-0.12999999999999989,0.31999999999999984,1.4699999999999998]
["АЛЖИР: Coupe de la Ligue","2021.06.08 18:00","Магра","УСМ Алжир","x4bdYkPa",18,null,null,"Загрузить",null,null,2.91,3.05,2.41,3.08,2.88,2.3199999999999998,-0.16999999999999993,0.16999999999999993,9.0000000000000302E-2]
["ИТАЛИЯ: Примавера 1","2021.06.08 18:00","Аталанта U19","Дженоа U19","0Kl4P1Uk",98,null,null,"Загрузить",null,null,1.38,5.15,6.1,1.41,5.2,5.8,-3.0000000000000027E-2,-4.9999999999999822E-2,0.29999999999999982]
["ИТАЛИЯ: Примавера 2 - Плей-офф","2021.06.08 18:00","Верона U19","Пескара U19","ve34OVPj",98,null,null,"Загрузить",null,null,2.75,3.54,2.2999999999999998,2.81,3.4,2.2200000000000002,-6.0000000000000053E-2,0.14000000000000012,7.9999999999999627E-2]
["ПОЛЬША: Дивизион 3 - группа 1 - Чемпионшип - плей-офф","2021.06.08 18:00","Знич Бяла-Писка","Ягеллония II","QmTsdyeB",154,null,null,"Загрузить",null,null,1.86,3.88,3.5,2.21,3.68,2.8,-0.34999999999999987,0.19999999999999973,0.70000000000000018]
["ИРАН: Первый дивизион","2021.06.08 18:20","Хейбар Хоррамабад","Могхавемат","OQREUqpA",94,null,null,"Загрузить",null,null,2.06,2.79,4.22,2.61,2.92,2.76,-0.54999999999999982,-0.12999999999999989,1.46]
["ИРАН: Первый дивизион","2021.06.08 18:20","Эстеглал Хузестан","Хавадар","6kHJT3aG",94,null,null,"Загрузить",null,null,2.69,2.46,3.22,3.08,2.75,2.42,-0.39000000000000012,-0.29000000000000004,0.80000000000000027]
["МИР: Международные товарищеские матчи","2021.06.08 18:30","Болгария U21","Албания U21","0O88pPNd",8,null,null,"Загрузить",null,null,1.8,3.4,3.75,1.8,3.4,3.75,0,0,0]
["ФИНЛЯНДИЯ: Второй дивизион - группа C","2021.06.08 18:30","РоПС 2","ГБК Коккола","0hlxeonF",76,null,null,"Загрузить",null,null,1.08,9.6,20,1.1000000000000001,9,14.5,-2.0000000000000018E-2,0.59999999999999964,5.5]
["АЛЖИР: Первый дивизион","2021.06.08 19:00","Медеа","МК Алжир","plt6RRrh",18,null,null,"Загрузить",null,null,2.12,3.02,3.6,2.12,3,3.32,0,2.0000000000000018E-2,0.28000000000000025]
["АЛЖИР: Первый дивизион","2021.06.08 19:00","Скикда","Белуиздад","2PzBQobb",18,null,null,"Загрузить",null,null,5.15,3.38,1.69,5.35,3.3,1.64,-0.19999999999999929,8.0000000000000071E-2,5.0000000000000044E-2]
["ГВИНЕЯ: Лига 1","2021.06.08 19:00","Вакрия","Ашанти ГБ","zRx4V8Cl",86,null,null,"Загрузить",null,null,null,null,null,null,null,null,"","",""]
["ИРАН: Первый дивизион","2021.06.08 19:00","Парс Джануби Джем","Навад Урмия","zNdfAFbe",94,null,null,"Загрузить",null,null,null,null,null,null,null,null,"","",""]
["МИР: Международные товарищеские матчи","2021.06.08 19:00","Австрия U17","Швеция U17","ELeQ4bxP",8,null,null,"Загрузить",null,null,null,null,null,null,null,null,"","",""]
["МИР: Международные товарищеские матчи","2021.06.08 19:00","Камерун","Нигерия","OSGByNhf",8,null,null,"Загрузить",null,null,2.62,3,2.5,2.5,3,2.62,0.12000000000000011,0,-0.12000000000000011]
["МИР: Международные товарищеские матчи","2021.06.08 19:00","Польша","Исландия","h2ZjsTNh",8,null,null,"Загрузить",null,null,1.36,4.75,8.5,1.55,4,6,-0.18999999999999995,0.75,2.5]
["МИР: Клубные товарищеские матчи","2021.06.08 19:00","Рауфосс","Конгсвингер","UPXWFn8m",8,null,null,"Загрузить",null,null,1.77,4.04,3.74,1.85,3.1,4.0999999999999996,-8.0000000000000071E-2,0.94,-0.35999999999999943]
["МИР: Международные товарищеские матчи - женщины","2021.06.08 19:00","Беларусь (Ж)","Иран (Ж)","nqa8p9wm",8,null,null,"Загрузить",null,null,null,null,null,null,null,null,"","",""]
["СЬЕРРА-ЛЕОНЕ: Премьер-лига","2021.06.08 19:15","SLIFA","Олд Эдвардианс","AqVurcrk",169,null,null,"Загрузить",null,null,null,null,null,null,null,null,"","",""]
["ЕВРОПА: Чемпионат Европы до 21 года - Квалификация","2021.06.08 19:30","Фарерские острова U21","Армения U21","rJhiums0",6,null,null,"Загрузить",null,null,2.2400000000000002,3.42,3.12,2.6,3.4,2.2999999999999998,-0.35999999999999988,2.0000000000000018E-2,0.82000000000000028]
["АРГЕНТИНА: Торнео Федерал","2021.06.08 20:00","Чиполлетти","Ферро Хенераль Пико","prZBBrkM",22,null,null,"Загрузить",null,null,1.77,3.34,4.62,2.02,2.88,3.84,-0.25,0.45999999999999996,0.78000000000000025]
["МИР: Международные товарищеские матчи","2021.06.08 20:00","Гамбия","Того","rqYgSmPL",8,null,null,"Загрузить",null,null,2.4500000000000002,2.8,2.9,2.7,2.8,2.6,-0.25,0,0.29999999999999982]
["МИР: Международные товарищеские матчи","2021.06.08 20:00","Сербия U23","Бразилия U23","dp5gHLs9",8,null,null,"Загрузить",null,null,10.5,5.0999999999999996,1.29,8.1999999999999993,5.4,1.31,2.3000000000000007,-0.30000000000000071,-2.0000000000000018E-2]
["МИР: Клубные товарищеские матчи","2021.06.08 20:00","Войтсберг","FC Trofaiach","KYn1pRxM",8,null,null,"Загрузить",null,null,null,null,null,null,null,null,"","",""]
["МИР: Клубные товарищеские матчи","2021.06.08 20:00","Гляйсдорф","Унион Гнас","WCC3GUO6",8,null,null,"Загрузить",null,null,1.1399999999999999,8,12.5,1.21,6,9.3000000000000007,-7.0000000000000062E-2,2,3.1999999999999993]
["ШВЕЦИЯ: Первая лига","2021.06.08 20:00","ГАИС","Ландскруна","2sjuDXWA",181,null,null,"Загрузить",null,null,2.15,3.1,3.6,2,3.5,3.4,0.14999999999999991,-0.39999999999999991,0.20000000000000018]
["ШВЕЦИЯ: Второй дивизион - Северный Геталенд","2021.06.08 20:00","Angered","Grebbestads","2qVaRUB6",181,null,null,"Загрузить",null,null,4.66,3.56,1.63,3.46,3.4,1.93,1.2000000000000002,0.16000000000000014,-0.30000000000000004]
["ЕВРОПА: Чемпионат Европы до 21 года - Квалификация","2021.06.08 20:10","Австрия U21","Эстония U21","xQTbpQ5D",6,null,null,"Загрузить",null,null,1,24,60,1.05,11,24,-5.0000000000000044E-2,13,36]
["ШВЕЦИЯ: Второй дивизион - Западный Геталенд","2021.06.08 20:30","Улларед ИК","Торсланда","CIYdcl8m",181,null,null,"Загрузить",null,null,2.29,4.12,2.33,2.2999999999999998,4.2,2.25,-9.9999999999997868E-3,-8.0000000000000071E-2,8.0000000000000071E-2]
["АРГЕНТИНА: Торнео Федерал","2021.06.08 21:00","Крусеро Дель Норте","Унион Сунчалес","2iPd4x6M",22,null,null,"Загрузить",null,null,1.85,2.97,4.92,2.42,2.88,2.94,-0.56999999999999984,9.0000000000000302E-2,1.98]
["АРГЕНТИНА: Торнео Федерал","2021.06.08 21:00","Пеньяроль","Сансинена","tjEn5tSk",22,null,null,"Загрузить",null,null,2.37,2.98,3.09,2.5,2.75,2.88,-0.12999999999999989,0.22999999999999998,0.20999999999999996]
["АРГЕНТИНА: Примера C - Апертура","2021.06.08 21:00","Архентино де Мерло","Экскурсионистас","EHRtfgXK",22,null,null,"Загрузить",null,null,2.2200000000000002,2.94,3.44,2.0699999999999998,3.34,3.34,0.15000000000000036,-0.39999999999999991,0.10000000000000009]
["АРГЕНТИНА: Примера C - Апертура","2021.06.08 21:00","Итусаинго","Сентраль Кордоба","KfSxeZHE",22,null,null,"Загрузить",null,null,1.94,2.95,4.4000000000000004,2.2200000000000002,2.97,3.4,-0.28000000000000025,-2.0000000000000018E-2,1.0000000000000004]
["АРГЕНТИНА: Примера C - Апертура","2021.06.08 21:00","Лаферрере","Спортиво Итальяно","4npjXVP7",22,null,null,"Загрузить",null,null,1.95,3.19,3.92,1.94,3.3,3.82,1.0000000000000009E-2,-0.10999999999999988,0.10000000000000009]
["АРГЕНТИНА: Примера C - Апертура","2021.06.08 21:00","Реал Пилар","Депортиво Эспаньол","WYorZiee",22,null,null,"Загрузить",null,null,1.92,3.32,3.84,1.77,3.38,4.5599999999999996,{"$f":"IF(L67=\"\",\"\",L67-O67)","v":0.14999999999999991},{"$f":"IF(M67=\"\",\"\",M67-P67)","v":-6.0000000000000053E-2},{"$f":"IF(N67=\"\",\"\",N67-Q67)","v":-0.71999999999999975}]
["АРГЕНТИНА: Примера C - Апертура","2021.06.08 21:00","Хенераль Ламадрид","Клуб Лухан","IVsvzYuk",22,null,null,"Загрузить",null,null,2.81,2.79,2.67,2.33,2.9,3.26,0.48,-0.10999999999999988,-0.58999999999999986]
["ЕВРОПА: Чемпионат Европы до 21 года - Квалификация","2021.06.08 21:00","Косово U21","Андорра U21","IBeurkcs",6,null,null,"Загрузить",null,null,1.33,5.15,8.3000000000000007,1.41,4.32,6.2,-7.9999999999999849E-2,0.83000000000000007,2.1000000000000005]
["МИР: Международные товарищеские матчи","2021.06.08 21:00","Австралия U23","Румыния U23","MufJDx7E",8,null,null,"Загрузить",null,null,2.4,3.6,2.4,2.4,3.6,2.4,0,0,0]
["МИР: Международные товарищеские матчи","2021.06.08 21:00","Бенин","Замбия","6JOodsq6",8,null,null,"Загрузить",null,null,2.2999999999999998,3,2.87,2.37,3,2.75,-7.0000000000000284E-2,0,0.12000000000000011]
["МИР: Международные товарищеские матчи","2021.06.08 21:00","Венгрия","Ирландия","OMuEVEI7",8,null,null,"Загрузить",null,null,2.15,3,3.75,2.5,3.2,2.62,-0.35000000000000009,-0.20000000000000018,1.1299999999999999]
["МИР: Международные товарищеские матчи","2021.06.08 21:00","Мексика U23","Саудовская Аравия U23","v7J8eqC4",8,null,null,"Загрузить",null,null,1.45,4,5.75,1.5,4,5,-5.0000000000000044E-2,0,0.75]
["ШВЕЦИЯ: Второй дивизион - Северный Свеаленд","2021.06.08 21:00","Кунгсангенс","IFK Stocksund","MomkfhGD",181,null,null,"Загрузить",null,null,2.86,3.5,2.16,2.63,3.5,2.25,0.22999999999999998,0,-8.9999999999999858E-2]
["МИР: Международные товарищеские матчи","2021.06.08 21:15","Чехия","Албания","SSZ59kar",8,null,null,"Загрузить",null,null,1.53,3.6,7,1.5,3.6,6.5,3.0000000000000027E-2,0,0.5]
["МИР: Международные товарищеские матчи","2021.06.08 21:45","Испания","Литва","dlstwoJg",8,null,null,"Загрузить",null,null,1.36,4.75,6.5,1.05,13,26,0.31000000000000005,-8.25,-19.5]
["МИР: Клубные товарищеские матчи","2021.06.08 21:45","Рочестер Юнайтед","Лордсвуд","lKFEGpsU",8,null,null,"Загрузить",null,null,3.9,3.9,1.76,3.8,3.74,1.75,0.10000000000000009,0.1599999999999997,1.0000000000000009E-2]
["АРГЕНТИНА: Торнео Федерал","2021.06.08 22:00","Спортиво Лас-Парехас","Хувентуд Унида Гуалегуайчу","YLzfpHEj",22,null,null,"Загрузить",null,null,1.77,3.32,4.66,1.75,3.3,4.42,2.0000000000000018E-2,2.0000000000000018E-2,0.24000000000000021]
["МИР: Международные товарищеские матчи","2021.06.08 22:00","Марокко","Гана","pj9vWEK8",8,null,null,"Загрузить",null,null,1.83,3.25,4.5,1.9,3.1,3.75,-6.999999999999984E-2,0.14999999999999991,0.75]
["МИР: Международные товарищеские матчи","2021.06.08 22:00","Сенегал","Кабо-Верде","thyjLzIs",8,null,null,"Загрузить",null,null,1.45,3.75,7,1.4,4,6.5,5.0000000000000044E-2,-0.25,0.5]
["МИР: Международные товарищеские матчи","2021.06.08 22:10","Франция","Болгария","dESFhJ6s",8,null,null,"Загрузить",null,null,1.06,12,26,1.1000000000000001,9,21,-4.0000000000000036E-2,3,5]
["БРАЗИЛИЯ: Кубок Бразилии","2021.06.08 22:30","Сантос","Сианорти","fy10dH9g",39,null,null,"Загрузить",null,null,1.1599999999999999,5.75,13,1.1599999999999999,7,9,0,-1.25,4]
["СЕВЕРНАЯ И ЦЕНТРАЛЬНАЯ АМЕРИКА: Чемпионат мира - Квалификация - Первый этап","2021.06.08 23:00","Гайана","Пуэрто-Рико","dl3sjXyU",2,null,null,"Загрузить",null,null,null,null,null,null,null,null,"","",""]
["СЕВЕРНАЯ И ЦЕНТРАЛЬНАЯ АМЕРИКА: Чемпионат мира - Квалификация - Первый этап","2021.06.08 23:00","Сент-Винсент и Гренадины","Куба","EDqsRP21",2,null,null,"Загрузить",null,null,null,null,null,null,null,null,"","",""]
["СЕВЕРНАЯ И ЦЕНТРАЛЬНАЯ АМЕРИКА: Чемпионат мира - Квалификация - Первый этап","2021.06.09 00:00","Гаити","Никарагуа","l8BBxE7U",2,null,null,"Загрузить",null,null,1.5,3.75,5.5,1.7,3.4,4.33,-0.19999999999999996,0.35000000000000009,1.17]
["СЕВЕРНАЯ И ЦЕНТРАЛЬНАЯ АМЕРИКА: Чемпионат мира - Квалификация - Первый этап","2021.06.09 00:00","Тринидад и Тобаго","Сент-Китс и Невис","bck9oipo",2,null,null,"Загрузить",null,null,null,null,null,null,null,null,"","",""]
["ЮЖНАЯ АМЕРИКА: Чемпионат мира - Квалификация","2021.06.09 00:00","Эквадор","Перу","zk3r0MTG",3,null,null,"Загрузить",null,null,1.4,4.5,8,1.44,4,8,-4.0000000000000036E-2,0.5,0]
[null,null,null,null,null,null,null,null,null,null,null,null,null,null,null,null,null,"","",""]
[null,null,null,null,null,null,null,null,null,null,null,null,null,null,null,null,null,"","",""]
[null,null,null,null,null,null,null,null,null,null,null,null,null,null,null,null,null,"","",""]
[null,null,null,null,null,null,null,null,null,null,null,null,null,null,null,null,null,"","",""]
[null,null,null,null,null,null,null,null,null,null,null,null,null,null,null,null,null,"","",""]
[null,null,null,null,null,null,null,null,null,null,null,null,null,null,null,null,null,"","",""]
[null,null,null,null,null,null,null,null,null,null,null,null,null,null,null,null,null,"","",""]
[null,null,null,null,null,null,null,null,null,null,null,null,null,null,null,null,null,"","",""]
[null,null,null,null,null,null,null,null,null,null,null,null,null,null,null,null,null,"","",""]
[null,null,null,null,null,null,null,null,null,null,null,null,null,null,null,null,null,"","",""]
[null,null,null,null,null,null,null,null,null,null,null,null,null,null,null,null,null,"","",""]
[null,null,null,null,null,null,null,null,null,null,null,null,null,null,null,null,null,"","",""]
[null,null,null,null,null,null,null,null,null,null,null,null,null,null,null,null,null,"","",""]
[null,null,null,null,null,null,null,null,null,null,null,null,null,null,null,null,null,"","",""]
[null,null,null,null,null,null,null,null,null,null,null,null,null,null,null,null,null,"","",""]
[null,null,null,null,null,null,null,null,null,null,null,null,null,null,null,null,null,"","",""]
[null,null,null,null,null,null,null,null,null,null,null,null,null,null,null,null,null,"","",""]
[null,null,null,null,null,null,null,null,null,null,null,null,null,null,null,null,null,"","",""]
[null,null,null,null,null,null,null,null,null,null,null,null,null,null,null,null,null,"","",""]
[null,null,null,null,null,null,null,null,null,null,null,null,null,null,null,null,null,"","",""]
[null,null,null,null,null,null,null,null,null,null,null,null,null,null,null,null,null,"","",""]
[null,null,null,null,null,null,null,null,null,null,null,null,null,null,null,null,null,"","",""]
[null,null,null,null,null,null,null,null,null,null,null,null,null,null,null,null,null,"","",""]
[null,null,null,null,null,null,null,null,null,null,null,null,null,null,null,null,null,"","",""]
[null,null,null,null,null,null,null,null,null,null,null,null,null,null,null,null,null,"","",""]
[null,null,null,null,null,null,null,null,null,null,null,null,null,null,null,null,null,"","",""]
[null,null,null,null,null,null,null,null,null,null,null,null,null,null,null,null,null,"","",""]
[null,null,null,null,null,null,null,null,null,null,null,null,null,null,null,null,null,"","",""]
[null,null,null,null,null,null,null,null,null,null,null,null,null,null,null,null,null,"","",""]
[null,null,null,null,null,null,null,null,null,null,null,null,null,null,null,null,null,"","",""]
[null,null,null,null,null,null,null,null,null,null,null,null,null,null,null,null,null,"","",""]
[null,null,null,null,null,null,null,null,null,null,null,null,null,null,null,null,null,"","",""]
[null,null,null,null,null,null,null,null,null,null,null,null,null,null,null,null,null,"","",""]
[null,null,null,null,null,null,null,null,null,null,null,null,null,null,null,null,null,"","",""]
[null,null,null,null,null,null,null,null,null,null,null,null,null,null,null,null,null,"","",""]
[null,null,null,null,null,null,null,null,null,null,null,null,null,null,null,null,null,"","",""]
[null,null,null,null,null,null,null,null,null,null,null,null,null,null,null,null,null,"","",""]
[null,null,null,null,null,null,null,null,null,null,null,null,null,null,null,null,null,"","",""]
[null,null,null,null,null,null,null,null,null,null,null,null,null,null,null,null,null,"","",""]
[null,null,null,null,null,null,null,null,null,null,null,null,null,null,null,null,null,"","",""]
[null,null,null,null,null,null,null,null,null,null,null,null,null,null,null,null,null,"","",""]
[null,null,null,null,null,null,null,null,null,null,null,null,null,null,null,null,null,"","",""]
[null,null,null,null,null,null,null,null,null,null,null,null,null,null,null,null,null,"","",""]
[null,null,null,null,null,null,null,null,null,null,null,null,null,null,null,null,null,{"$f":"IF(L131=\"\",\"\",L131-O131)","v":""},{"$f":"IF(M131=\"\",\"\",M131-P131)","v":""},{"$f":"IF(N131=\"\",\"\",N131-Q131)","v":""}]
[null,null,null,null,null,null,null,null,null,null,null,null,null,null,null,null,null,"","",""]
[null,null,null,null,null,null,null,null,null,null,null,null,null,null,null,null,null,"","",""]
[null,null,null,null,null,null,null,null,null,null,null,null,null,null,null,null,null,"","",""]
[null,null,null,null,null,null,null,null,null,null,null,null,null,null,null,null,null,"","",""]
[null,null,null,null,null,null,null,null,null,null,null,null,null,null,null,null,null,"","",""]
[null,null,null,null,null,null,null,null,null,null,null,null,null,null,null,null,null,"","",""]
[null,null,null,null,null,null,null,null,null,null,null,null,null,null,null,null,null,"","",""]
[null,null,null,null,null,null,null,null,null,null,null,null,null,null,null,null,null,"","",""]
[null,null,null,null,null,null,null,null,null,null,null,null,null,null,null,null,null,"","",""]
[null,null,null,null,null,null,null,null,null,null,null,null,null,null,null,null,null,"","",""]
[null,null,null,null,null,null,null,null,null,null,null,null,null,null,null,null,null,"","",""]
[null,null,null,null,null,null,null,null,null,null,null,null,null,null,null,null,null,"","",""]
[null,null,null,null,null,null,null,null,null,null,null,null,null,null,null,null,null,"","",""]
[null,null,null,null,null,null,null,null,null,null,null,null,null,null,null,null,null,"","",""]
[null,null,null,null,null,null,null,null,null,null,null,null,null,null,null,null,null,"","",""]
[null,null,null,null,null,null,null,null,null,null,null,null,null,null,null,null,null,"","",""]
[null,null,null,null,null,null,null,null,null,null,null,null,null,null,null,null,null,"","",""]
[null,null,null,null,null,null,null,null,null,null,null,null,null,null,null,null,null,"","",""]
[null,null,null,null,null,null,null,null,null,null,null,null,null,null,null,null,null,"","",""]
[null,null,null,null,null,null,null,null,null,null,null,null,null,null,null,null,null,"","",""]
[null,null,null,null,null,null,null,null,null,null,null,null,null,null,null,null,null,"","",""]
[null,null,null,null,null,null,null,null,null,null,null,null,null,null,null,null,null,"","",""]
[null,null,null,null,null,null,null,null,null,null,null,null,null,null,null,null,null,"","",""]
[null,null,null,null,null,null,null,null,null,null,null,null,null,null,null,null,null,"","",""]
[null,null,null,null,null,null,null,null,null,null,null,null,null,null,null,null,null,"","",""]
[null,null,null,null,null,null,null,null,null,null,null,null,null,null,null,null,null,"","",""]
[null,null,null,null,null,null,null,null,null,null,null,null,null,null,null,null,null,"","",""]
[null,null,null,null,null,null,null,null,null,null,null,null,null,null,null,null,null,"","",""]
[null,null,null,null,null,null,null,null,null,null,null,null,null,null,null,null,null,"","",""]
[null,null,null,null,null,null,null,null,null,null,null,null,null,null,null,null,null,"","",""]
[null,null,null,null,null,null,null,null,null,null,null,null,null,null,null,null,null,"","",""]
[null,null,null,null,null,null,null,null,null,null,null,null,null,null,null,null,null,"","",""]
[null,null,null,null,null,null,null,null,null,null,null,null,null,null,null,null,null,"","",""]
[null,null,null,null,null,null,null,null,null,null,null,null,null,null,null,null,null,"","",""]
[null,null,null,null,null,null,null,null,null,null,null,null,null,null,null,null,null,"","",""]
[null,null,null,null,null,null,null,null,null,null,null,null,null,null,null,null,null,"","",""]
[null,null,null,null,null,null,null,null,null,null,null,null,null,null,null,null,null,"","",""]
[null,null,null,null,null,null,null,null,null,null,null,null,null,null,null,null,null,"","",""]
[null,null,null,null,null,null,null,null,null,null,null,null,null,null,null,null,null,"","",""]
[null,null,null,null,null,null,null,null,null,null,null,null,null,null,null,null,null,"","",""]
[null,null,null,null,null,null,null,null,null,null,null,null,null,null,null,null,null,"","",""]
[null,null,null,null,null,null,null,null,null,null,null,null,null,null,null,null,null,"","",""]
[null,null,null,null,null,null,null,null,null,null,null,null,null,null,null,null,null,"","",""]
[null,null,null,null,null,null,null,null,null,null,null,null,null,null,null,null,null,"","",""]
[null,null,null,null,null,null,null,null,null,null,null,null,null,null,null,null,null,"","",""]
[null,null,null,null,null,null,null,null,null,null,null,null,null,null,null,null,null,"","",""]
[null,null,null,null,null,null,null,null,null,null,null,null,null,null,null,null,null,"","",""]
[null,null,null,null,null,null,null,null,null,null,null,null,null,null,null,null,null,"","",""]
[null,null,null,null,null,null,null,null,null,null,null,null,null,null,null,null,null,"","",""]
[null,null,null,null,null,null,null,null,null,null,null,null,null,null,null,null,null,"","",""]
[null,null,null,null,null,null,null,null,null,null,null,null,null,null,null,null,null,"","",""]
[null,null,null,null,null,null,null,null,null,null,null,null,null,null,null,null,null,"","",""]
[null,null,null,null,null,null,null,null,null,null,null,null,null,null,null,null,null,"","",""]
[null,null,null,null,null,null,null,null,null,null,null,null,null,null,null,null,null,"","",""]
[null,null,null,null,null,null,null,null,null,null,null,null,null,null,null,null,null,"","",""]
[null,null,null,null,null,null,null,null,null,null,null,null,null,null,null,null,null,"","",""]
[null,null,null,null,null,null,null,null,null,null,null,null,null,null,null,null,null,"","",""]
[null,null,null,null,null,null,null,null,null,null,null,null,null,null,null,null,null,"","",""]
[null,null,null,null,null,null,null,null,null,null,null,null,null,null,null,null,null,"","",""]
[null,null,null,null,null,null,null,null,null,null,null,null,null,null,null,null,null,"","",""]
[null,null,null,null,null,null,null,null,null,null,null,null,null,null,null,null,null,"","",""]
[null,null,null,null,null,null,null,null,null,null,null,null,null,null,null,null,null,"","",""]
[null,null,null,null,null,null,null,null,null,null,null,null,null,null,null,null,null,"","",""]
[null,null,null,null,null,null,null,null,null,null,null,null,null,null,null,null,null,{"$f":"IF(L195=\"\",\"\",L195-O195)","v":""},{"$f":"IF(M195=\"\",\"\",M195-P195)","v":""},{"$f":"IF(N195=\"\",\"\",N195-Q195)","v":""}]
[null,null,null,null,null,null,null,null,null,null,null,null,null,null,null,null,null,"","",""]
[null,null,null,null,null,null,null,null,null,null,null,null,null,null,null,null,null,"","",""]
[null,null,null,null,null,null,null,null,null,null,null,null,null,null,null,null,null,"","",""]
[null,null,null,null,null,null,null,null,null,null,null,null,null,null,null,null,null,"","",""]
[null,null,null,null,null,null,null,null,null,null,null,null,null,null,null,null,null,"","",""]
[null,null,null,null,null,null,null,null,null,null,null,null,null,null,null,null,null,"","",""]
[null,null,null,null,null,null,null,null,null,null,null,null,null,null,null,null,null,"","",""]
[null,null,null,null,null,null,null,null,null,null,null,null,null,null,null,null,null,"","",""]
[null,null,null,null,null,null,null,null,null,null,null,null,null,null,null,null,null,"","",""]
[null,null,null,null,null,null,null,null,null,null,null,null,null,null,null,null,null,"","",""]
[null,null,null,null,null,null,null,null,null,null,null,null,null,null,null,null,null,"","",""]
[null,null,null,null,null,null,null,null,null,null,null,null,null,null,null,null,null,"","",""]
[null,null,null,null,null,null,null,null,null,null,null,null,null,null,null,null,null,"","",""]
[null,null,null,null,null,null,null,null,null,null,null,null,null,null,null,null,null,"","",""]
[null,null,null,null,null,null,null,null,null,null,null,null,null,null,null,null,null,"","",""]
[null,null,null,null,null,null,null,null,null,null,null,null,null,null,null,null,null,"","",""]
[null,null,null,null,null,null,null,null,null,null,null,null,null,null,null,null,null,"","",""]
[null,null,null,null,null,null,null,null,null,null,null,null,null,null,null,null,null,"","",""]
[null,null,null,null,null,null,null,null,null,null,null,null,null,null,null,null,null,"","",""]
[null,null,null,null,null,null,null,null,null,null,null,null,null,null,null,null,null,"","",""]
[null,null,null,null,null,null,null,null,null,null,null,null,null,null,null,null,null,"","",""]
[null,null,null,null,null,null,null,null,null,null,null,null,null,null,null,null,null,"","",""]
[null,null,null,null,null,null,null,null,null,null,null,null,null,null,null,null,null,"","",""]
[null,null,null,null,null,null,null,null,null,null,null,null,null,null,null,null,null,"","",""]
[null,null,null,null,null,null,null,null,null,null,null,null,null,null,null,null,null,"","",""]
[null,null,null,null,null,null,null,null,null,null,null,null,null,null,null,null,null,"","",""]
[null,null,null,null,null,null,null,null,null,null,null,null,null,null,null,null,null,"","",""]
[null,null,null,null,null,null,null,null,null,null,null,null,null,null,null,null,null,"","",""]
[null,null,null,null,null,null,null,null,null,null,null,null,null,null,null,null,null,"","",""]
[null,null,null,null,null,null,null,null,null,null,null,null,null,null,null,null,null,"","",""]
[null,null,null,null,null,null,null,null,null,null,null,null,null,null,null,null,null,"","",""]
[null,null,null,null,null,null,null,null,null,null,null,null,null,null,null,null,null,"","",""]
[null,null,null,null,null,null,null,null,null,null,null,null,null,null,null,null,null,"","",""]
[null,null,null,null,null,null,null,null,null,null,null,null,null,null,null,null,null,"","",""]
[null,null,null,null,null,null,null,null,null,null,null,null,null,null,null,null,null,"","",""]
[null,null,null,null,null,null,null,null,null,null,null,null,null,null,null,null,null,"","",""]
[null,null,null,null,null,null,null,null,null,null,null,null,null,null,null,null,null,"","",""]
[null,null,null,null,null,null,null,null,null,null,null,null,null,null,null,null,null,"","",""]
[null,null,null,null,null,null,null,null,null,null,null,null,null,null,null,null,null,"","",""]
[null,null,null,null,null,null,null,null,null,null,null,null,null,null,null,null,null,"","",""]
[null,null,null,null,null,null,null,null,null,null,null,null,null,null,null,null,null,"","",""]
[null,null,null,null,null,null,null,null,null,null,null,null,null,null,null,null,null,"","",""]
[null,null,null,null,null,null,null,null,null,null,null,null,null,null,null,null,null,"","",""]
[null,null,null,null,null,null,null,null,null,null,null,null,null,null,null,null,null,"","",""]
[null,null,null,null,null,null,null,null,null,null,null,null,null,null,null,null,null,"","",""]
[null,null,null,null,null,null,null,null,null,null,null,null,null,null,null,null,null,"","",""]
[null,null,null,null,null,null,null,null,null,null,null,null,null,null,null,null,null,"","",""]
[null,null,null,null,null,null,null,null,null,null,null,null,null,null,null,null,null,"","",""]
[null,null,null,null,null,null,null,null,null,null,null,null,null,null,null,null,null,"","",""]
[null,null,null,null,null,null,null,null,null,null,null,null,null,null,null,null,null,"","",""]
[null,null,null,null,null,null,null,null,null,null,null,null,null,null,null,null,null,"","",""]
[null,null,null,null,null,null,null,null,null,null,null,null,null,null,null,null,null,"","",""]
[null,null,null,null,null,null,null,null,null,null,null,null,null,null,null,null,null,"","",""]
[null,null,null,null,null,null,null,null,null,null,null,null,null,null,null,null,null,"","",""]
[null,null,null,null,null,null,null,null,null,null,null,null,null,null,null,null,null,"","",""]
[null,null,null,null,null,null,null,null,null,null,null,null,null,null,null,null,null,"","",""]
[null,null,null,null,null,null,null,null,null,null,null,null,null,null,null,null,null,"","",""]
[null,null,null,null,null,null,null,null,null,null,null,null,null,null,null,null,null,"","",""]
[null,null,null,null,null,null,null,null,null,null,null,null,null,null,null,null,null,"","",""]
[null,null,null,null,null,null,null,null,null,null,null,null,null,null,null,null,null,"","",""]
[null,null,null,null,null,null,null,null,null,null,null,null,null,null,null,null,null,"","",""]
[null,null,null,null,null,null,null,null,null,null,null,null,null,null,null,null,null,"","",""]
[null,null,null,null,null,null,null,null,null,null,null,null,null,null,null,null,null,"","",""]
[null,null,null,null,null,null,null,null,null,null,null,null,null,null,null,null,null,{"$f":"IF(L259=\"\",\"\",L259-O259)","v":""},{"$f":"IF(M259=\"\",\"\",M259-P259)","v":""},{"$f":"IF(N259=\"\",\"\",N259-Q259)","v":""}]
[null,null,null,null,null,null,null,null,null,null,null,null,null,null,null,null,null,"","",""]
[null,null,null,null,null,null,null,null,null,null,null,null,null,null,null,null,null,"","",""]
[null,null,null,null,null,null,null,null,null,null,null,null,null,null,null,null,null,"","",""]
[null,null,null,null,null,null,null,null,null,null,null,null,null,null,null,null,null,"","",""]
[null,null,null,null,null,null,null,null,null,null,null,null,null,null,null,null,null,"","",""]
[null,null,null,null,null,null,null,null,null,null,null,null,null,null,null,null,null,"","",""]
[null,null,null,null,null,null,null,null,null,null,null,null,null,null,null,null,null,"","",""]
[null,null,null,null,null,null,null,null,null,null,null,null,null,null,null,null,null,"","",""]
[null,null,null,null,null,null,null,null,null,null,null,null,null,null,null,null,null,"","",""]
[null,null,null,null,null,null,null,null,null,null,null,null,null,null,null,null,null,"","",""]
[null,null,null,null,null,null,null,null,null,null,null,null,null,null,null,null,null,"","",""]
[null,null,null,null,null,null,null,null,null,null,null,null,null,null,null,null,null,"","",""]
[null,null,null,null,null,null,null,null,null,null,null,null,null,null,null,null,null,"","",""]
[null,null,null,null,null,null,null,null,null,null,null,null,null,null,null,null,null,"","",""]
[null,null,null,null,null,null,null,null,null,null,null,null,null,null,null,null,null,"","",""]
[null,null,null,null,null,null,null,null,null,null,null,null,null,null,null,null,null,"","",""]
[null,null,null,null,null,null,null,null,null,null,null,null,null,null,null,null,null,"","",""]
[null,null,null,null,null,null,null,null,null,null,null,null,null,null,null,null,null,"","",""]
[null,null,null,null,null,null,null,null,null,null,null,null,null,null,null,null,null,"","",""]
[null,null,null,null,null,null,null,null,null,null,null,null,null,null,null,null,null,"","",""]
[null,null,null,null,null,null,null,null,null,null,null,null,null,null,null,null,null,"","",""]
[null,null,null,null,null,null,null,null,null,null,null,null,null,null,null,null,null,"","",""]
[null,null,null,null,null,null,null,null,null,null,null,null,null,null,null,null,null,"","",""]
[null,null,null,null,null,null,null,null,null,null,null,null,null,null,null,null,null,"","",""]
[null,null,null,null,null,null,null,null,null,null,null,null,null,null,null,null,null,"","",""]
[null,null,null,null,null,null,null,null,null,null,null,null,null,null,null,null,null,"","",""]
[null,null,null,null,null,null,null,null,null,null,null,null,null,null,null,null,null,"","",""]
[null,null,null,null,null,null,null,null,null,null,null,null,null,null,null,null,null,"","",""]
[null,null,null,null,null,null,null,null,null,null,null,null,null,null,null,null,null,"","",""]
[null,null,null,null,null,null,null,null,null,null,null,null,null,null,null,null,null,"","",""]
[null,null,null,null,null,null,null,null,null,null,null,null,null,null,null,null,null,"","",""]
[null,null,null,null,null,null,null,null,null,null,null,null,null,null,null,null,null,"","",""]
[null,null,null,null,null,null,null,null,null,null,null,null,null,null,null,null,null,"","",""]
[null,null,null,null,null,null,null,null,null,null,null,null,null,null,null,null,null,"","",""]
[null,null,null,null,null,null,null,null,null,null,null,null,null,null,null,null,null,"","",""]
[null,null,null,null,null,null,null,null,null,null,null,null,null,null,null,null,null,"","",""]
[null,null,null,null,null,null,null,null,null,null,null,null,null,null,null,null,null,"","",""]
[null,null,null,null,null,null,null,null,null,null,null,null,null,null,null,null,null,"","",""]
[null,null,null,null,null,null,null,null,null,null,null,null,null,null,null,null,null,"","",""]
[null,null,null,null,null,null,null,null,null,null,null,null,null,null,null,null,null,"","",""]
[null,null,null,null,null,null,null,null,null,null,null,null,null,null,null,null,null,"","",""]
[null,null,null,null,null,null,null,null,null,null,null,null,null,null,null,null,null,"","",""]
[null,null,null,null,null,null,null,null,null,null,null,null,null,null,null,null,null,"","",""]
[null,null,null,null,null,null,null,null,null,null,null,null,null,null,null,null,null,"","",""]
[null,null,null,null,null,null,null,null,null,null,null,null,null,null,null,null,null,"","",""]
[null,null,null,null,null,null,null,null,null,null,null,null,null,null,null,null,null,"","",""]
[null,null,null,null,null,null,null,null,null,null,null,null,null,null,null,null,null,"","",""]
[null,null,null,null,null,null,null,null,null,null,null,null,null,null,null,null,null,"","",""]
[null,null,null,null,null,null,null,null,null,null,null,null,null,null,null,null,null,"","",""]
[null,null,null,null,null,null,null,null,null,null,null,null,null,null,null,null,null,"","",""]
[null,null,null,null,null,null,null,null,null,null,null,null,null,null,null,null,null,"","",""]
[null,null,null,null,null,null,null,null,null,null,null,null,null,null,null,null,null,"","",""]
[null,null,null,null,null,null,null,null,null,null,null,null,null,null,null,null,null,"","",""]
[null,null,null,null,null,null,null,null,null,null,null,null,null,null,null,null,null,"","",""]
[null,null,null,null,null,null,null,null,null,null,null,null,null,null,null,null,null,"","",""]
[null,null,null,null,null,null,null,null,null,null,null,null,null,null,null,null,null,"","",""]
[null,null,null,null,null,null,null,null,null,null,null,null,null,null,null,null,null,"","",""]
[null,null,null,null,null,null,null,null,null,null,null,null,null,null,null,null,null,"","",""]
[null,null,null,null,null,null,null,null,null,null,null,null,null,null,null,null,null,"","",""]
[null,null,null,null,null,null,null,null,null,null,null,null,null,null,null,null,null,"","",""]
[null,null,null,null,null,null,null,null,null,null,null,null,null,null,null,null,null,"","",""]
[null,null,null,null,null,null,null,null,null,null,null,null,null,null,null,null,null,"","",""]
[null,null,null,null,null,null,null,null,null,null,null,null,null,null,null,null,null,"","",""]
[null,null,null,null,null,null,null,null,null,null,null,null,null,null,null,null,null,{"$f":"IF(L323=\"\",\"\",L323-O323)","v":""},{"$f":"IF(M323=\"\",\"\",M323-P323)","v":""},{"$f":"IF(N323=\"\",\"\",N323-Q323)","v":""}]
[null,null,null,null,null,null,null,null,null,null,null,null,null,null,null,null,null,"","",""]
[null,null,null,null,null,null,null,null,null,null,null,null,null,null,null,null,null,"","",""]
[null,null,null,null,null,null,null,null,null,null,null,null,null,null,null,null,null,"","",""]
[null,null,null,null,null,null,null,null,null,null,null,null,null,null,null,null,null,"","",""]
[null,null,null,null,null,null,null,null,null,null,null,null,null,null,null,null,null,"","",""]
[null,null,null,null,null,null,null,null,null,null,null,null,null,null,null,null,null,"","",""]
[null,null,null,null,null,null,null,null,null,null,null,null,null,null,null,null,null,"","",""]
[null,null,null,null,null,null,null,null,null,null,null,null,null,null,null,null,null,"","",""]
[null,null,null,null,null,null,null,null,null,null,null,null,null,null,null,null,null,"","",""]
[null,null,null,null,null,null,null,null,null,null,null,null,null,null,null,null,null,"","",""]
[null,null,null,null,null,null,null,null,null,null,null,null,null,null,null,null,null,"","",""]
[null,null,null,null,null,null,null,null,null,null,null,null,null,null,null,null,null,"","",""]
[null,null,null,null,null,null,null,null,null,null,null,null,null,null,null,null,null,"","",""]
[null,null,null,null,null,null,null,null,null,null,null,null,null,null,null,null,null,"","",""]
[null,null,null,null,null,null,null,null,null,null,null,null,null,null,null,null,null,"","",""]
[null,null,null,null,null,null,null,null,null,null,null,null,null,null,null,null,null,"","",""]
[null,null,null,null,null,null,null,null,null,null,null,null,null,null,null,null,null,"","",""]
[null,null,null,null,null,null,null,null,null,null,null,null,null,null,null,null,null,"","",""]
[null,null,null,null,null,null,null,null,null,null,null,null,null,null,null,null,null,"","",""]
[null,null,null,null,null,null,null,null,null,null,null,null,null,null,null,null,null,"","",""]
[null,null,null,null,null,null,null,null,null,null,null,null,null,null,null,null,null,"","",""]
[null,null,null,null,null,null,null,null,null,null,null,null,null,null,null,null,null,"","",""]
[null,null,null,null,null,null,null,null,null,null,null,null,null,null,null,null,null,"","",""]
[null,null,null,null,null,null,null,null,null,null,null,null,null,null,null,null,null,"","",""]
[null,null,null,null,null,null,null,null,null,null,null,null,null,null,null,null,null,"","",""]
[null,null,null,null,null,null,null,null,null,null,null,null,null,null,null,null,null,"","",""]
[null,null,null,null,null,null,null,null,null,null,null,null,null,null,null,null,null,"","",""]
[null,null,null,null,null,null,null,null,null,null,null,null,null,null,null,null,null,"","",""]
[null,null,null,null,null,null,null,null,null,null,null,null,null,null,null,null,null,"","",""]
[null,null,null,null,null,null,null,null,null,null,null,null,null,null,null,null,null,"","",""]
[null,null,null,null,null,null,null,null,null,null,null,null,null,null,null,null,null,"","",""]
[null,null,null,null,null,null,null,null,null,null,null,null,null,null,null,null,null,"","",""]
[null,null,null,null,null,null,null,null,null,null,null,null,null,null,null,null,null,"","",""]
[null,null,null,null,null,null,null,null,null,null,null,null,null,null,null,null,null,"","",""]
[null,null,null,null,null,null,null,null,null,null,null,null,null,null,null,null,null,"","",""]
[null,null,null,null,null,null,null,null,null,null,null,null,null,null,null,null,null,"","",""]
[null,null,null,null,null,null,null,null,null,null,null,null,null,null,null,null,null,"","",""]
[null,null,null,null,null,null,null,null,null,null,null,null,null,null,null,null,null,"","",""]
[null,null,null,null,null,null,null,null,null,null,null,null,null,null,null,null,null,"","",""]
[null,null,null,null,null,null,null,null,null,null,null,null,null,null,null,null,null,"","",""]
[null,null,null,null,null,null,null,null,null,null,null,null,null,null,null,null,null,"","",""]
[null,null,null,null,null,null,null,null,null,null,null,null,null,null,null,null,null,"","",""]
[null,null,null,null,null,null,null,null,null,null,null,null,null,null,null,null,null,"","",""]
[null,null,null,null,null,null,null,null,null,null,null,null,null,null,null,null,null,"","",""]
[null,null,null,null,null,null,null,null,null,null,null,null,null,null,null,null,null,"","",""]
[null,null,null,null,null,null,null,null,null,null,null,null,null,null,null,null,null,"","",""]
[null,null,null,null,null,null,null,null,null,null,null,null,null,null,null,null,null,"","",""]
[null,null,null,null,null,null,null,null,null,null,null,null,null,null,null,null,null,"","",""]
[null,null,null,null,null,null,null,null,null,null,null,null,null,null,null,null,null,"","",""]
[null,null,null,null,null,null,null,null,null,null,null,null,null,null,null,null,null,"","",""]
[null,null,null,null,null,null,null,null,null,null,null,null,null,null,null,null,null,"","",""]
[null,null,null,null,null,null,null,null,null,null,null,null,null,null,null,null,null,"","",""]
[null,null,null,null,null,null,null,null,null,null,null,null,null,null,null,null,null,"","",""]
[null,null,null,null,null,null,null,null,null,null,null,null,null,null,null,null,null,"","",""]
[null,null,null,null,null,null,null,null,null,null,null,null,null,null,null,null,null,"","",""]
[null,null,null,null,null,null,null,null,null,null,null,null,null,null,null,null,null,"","",""]
[null,null,null,null,null,null,null,null,null,null,null,null,null,null,null,null,null,"","",""]
[null,null,null,null,null,null,null,null,null,null,null,null,null,null,null,null,null,"","",""]
[null,null,null,null,null,null,null,null,null,null,null,null,null,null,null,null,null,"","",""]
[null,null,null,null,null,null,null,null,null,null,null,null,null,null,null,null,null,"","",""]
[null,null,null,null,null,null,null,null,null,null,null,null,null,null,null,null,null,"","",""]
[null,null,null,null,null,null,null,null,null,null,null,null,null,null,null,null,null,"","",""]
[null,null,null,null,null,null,null,null,null,null,null,null,null,null,null,null,null,"","",""]
[null,null,null,null,null,null,null,null,null,null,null,null,null,null,null,null,null,{"$f":"IF(L387=\"\",\"\",L387-O387)","v":""},{"$f":"IF(M387=\"\",\"\",M387-P387)","v":""},{"$f":"IF(N387=\"\",\"\",N387-Q387)","v":""}]
[null,null,null,null,null,null,null,null,null,null,null,null,null,null,null,null,null,"","",""]
[null,null,null,null,null,null,null,null,null,null,null,null,null,null,null,null,null,"","",""]
[null,null,null,null,null,null,null,null,null,null,null,null,null,null,null,null,null,"","",""]
[null,null,null,null,null,null,null,null,null,null,null,null,null,null,null,null,null,"","",""]
[null,null,null,null,null,null,null,null,null,null,null,null,null,null,null,null,null,"","",""]
[null,null,null,null,null,null,null,null,null,null,null,null,null,null,null,null,null,"","",""]
[null,null,null,null,null,null,null,null,null,null,null,null,null,null,null,null,null,"","",""]
[null,null,null,null,null,null,null,null,null,null,null,null,null,null,null,null,null,"","",""]
[null,null,null,null,null,null,null,null,null,null,null,null,null,null,null,null,null,"","",""]
[null,null,null,null,null,null,null,null,null,null,null,null,null,null,null,null,null,"","",""]
[null,null,null,null,null,null,null,null,null,null,null,null,null,null,null,null,null,"","",""]
[null,null,null,null,null,null,null,null,null,null,null,null,null,null,null,null,null,"","",""]
[null,null,null,null,null,null,null,null,null,null,null,null,null,null,null,null,null,"","",""]
[null,null,null,null,null,null,null,null,null,null,null,null,null,null,null,null,null,"","",""]
[null,null,null,null,null,null,null,null,null,null,null,null,null,null,null,null,null,"","",""]
[null,null,null,null,null,null,null,null,null,null,null,null,null,null,null,null,null,"","",""]
[null,null,null,null,null,null,null,null,null,null,null,null,null,null,null,null,null,"","",""]
[null,null,null,null,null,null,null,null,null,null,null,null,null,null,null,null,null,"","",""]
[null,null,null,null,null,null,null,null,null,null,null,null,null,null,null,null,null,"","",""]
[null,null,null,null,null,null,null,null,null,null,null,null,null,null,null,null,null,"","",""]
[null,null,null,null,null,null,null,null,null,null,null,null,null,null,null,null,null,"","",""]
[null,null,null,null,null,null,null,null,null,null,null,null,null,null,null,null,null,"","",""]
[null,null,null,null,null,null,null,null,null,null,null,null,null,null,null,null,null,"","",""]
[null,null,null,null,null,null,null,null,null,null,null,null,null,null,null,null,null,"","",""]
[null,null,null,null,null,null,null,null,null,null,null,null,null,null,null,null,null,"","",""]
[null,null,null,null,null,null,null,null,null,null,null,null,null,null,null,null,null,"","",""]
[null,null,null,null,null,null,null,null,null,null,null,null,null,null,null,null,null,"","",""]
[null,null,null,null,null,null,null,null,null,null,null,null,null,null,null,null,null,"","",""]
[null,null,null,null,null,null,null,null,null,null,null,null,null,null,null,null,null,"","",""]
[null,null,null,null,null,null,null,null,null,null,null,null,null,null,null,null,null,"","",""]
[null,null,null,null,null,null,null,null,null,null,null,null,null,null,null,null,null,"","",""]
[null,null,null,null,null,null,null,null,null,null,null,null,null,null,null,null,null,"","",""]
[null,null,null,null,null,null,null,null,null,null,null,null,null,null,null,null,null,"","",""]
[null,null,null,null,null,null,null,null,null,null,null,null,null,null,null,null,null,"","",""]
[null,null,null,null,null,null,null,null,null,null,null,null,null,null,null,null,null,"","",""]
[null,null,null,null,null,null,null,null,null,null,null,null,null,null,null,null,null,"","",""]
[null,null,null,null,null,null,null,null,null,null,null,null,null,null,null,null,null,"","",""]
[null,null,null,null,null,null,null,null,null,null,null,null,null,null,null,null,null,"","",""]
[null,null,null,null,null,null,null,null,null,null,null,null,null,null,null,null,null,"","",""]
[null,null,null,null,null,null,null,null,null,null,null,null,null,null,null,null,null,"","",""]
[null,null,null,null,null,null,null,null,null,null,null,null,null,null,null,null,null,"","",""]
[null,null,null,null,null,null,null,null,null,null,null,null,null,null,null,null,null,"","",""]
[null,null,null,null,null,null,null,null,null,null,null,null,null,null,null,null,null,"","",""]
[null,null,null,null,null,null,null,null,null,null,null,null,null,null,null,null,null,"","",""]
[null,null,null,null,null,null,null,null,null,null,null,null,null,null,null,null,null,"","",""]
[null,null,null,null,null,null,null,null,null,null,null,null,null,null,null,null,null,"","",""]
[null,null,null,null,null,null,null,null,null,null,null,null,null,null,null,null,null,"","",""]
[null,null,null,null,null,null,null,null,null,null,null,null,null,null,null,null,null,"","",""]
[null,null,null,null,null,null,null,null,null,null,null,null,null,null,null,null,null,"","",""]
[null,null,null,null,null,null,null,null,null,null,null,null,null,null,null,null,null,"","",""]
[null,null,null,null,null,null,null,null,null,null,null,null,null,null,null,null,null,"","",""]
[null,null,null,null,null,null,null,null,null,null,null,null,null,null,null,null,null,"","",""]
[null,null,null,null,null,null,null,null,null,null,null,null,null,null,null,null,null,"","",""]
[null,null,null,null,null,null,null,null,null,null,null,null,null,null,null,null,null,"","",""]
[null,null,null,null,null,null,null,null,null,null,null,null,null,null,null,null,null,"","",""]
[null,null,null,null,null,null,null,null,null,null,null,null,null,null,null,null,null,"","",""]
[null,null,null,null,null,null,null,null,null,null,null,null,null,null,null,null,null,"","",""]
[null,null,null,null,null,null,null,null,null,null,null,null,null,null,null,null,null,"","",""]
[null,null,null,null,null,null,null,null,null,null,null,null,null,null,null,null,null,"","",""]
[null,null,null,null,null,null,null,null,null,null,null,null,null,null,null,null,null,"","",""]
[null,null,null,null,null,null,null,null,null,null,null,null,null,null,null,null,null,"","",""]
[null,null,null,null,null,null,null,null,null,null,null,null,null,null,null,null,null,"","",""]
[null,null,null,null,null,null,null,null,null,null,null,null,null,null,null,null,null,"","",""]
[null,null,null,null,null,null,null,null,null,null,null,null,null,null,null,null,null,{"$f":"IF(L451=\"\",\"\",L451-O451)","v":""},{"$f":"IF(M451=\"\",\"\",M451-P451)","v":""},{"$f":"IF(N451=\"\",\"\",N451-Q451)","v":""}]
[null,null,null,null,null,null,null,null,null,null,null,null,null,null,null,null,null,"","",""]
[null,null,null,null,null,null,null,null,null,null,null,null,null,null,null,null,null,"","",""]
[null,null,null,null,null,null,null,null,null,null,null,null,null,null,null,null,null,"","",""]
[null,null,null,null,null,null,null,null,null,null,null,null,null,null,null,null,null,"","",""]
[null,null,null,null,null,null,null,null,null,null,null,null,null,null,null,null,null,"","",""]
[null,null,null,null,null,null,null,null,null,null,null,null,null,null,null,null,null,"","",""]
[null,null,null,null,null,null,null,null,null,null,null,null,null,null,null,null,null,"","",""]
[null,null,null,null,null,null,null,null,null,null,null,null,null,null,null,null,null,"","",""]
[null,null,null,null,null,null,null,null,null,null,null,null,null,null,null,null,null,"","",""]
[null,null,null,null,null,null,null,null,null,null,null,null,null,null,null,null,null,"","",""]
[null,null,null,null,null,null,null,null,null,null,null,null,null,null,null,null,null,"","",""]
[null,null,null,null,null,null,null,null,null,null,null,null,null,null,null,null,null,"","",""]
[null,null,null,null,null,null,null,null,null,null,null,null,null,null,null,null,null,"","",""]
[null,null,null,null,null,null,null,null,null,null,null,null,null,null,null,null,null,"","",""]
[null,null,null,null,null,null,null,null,null,null,null,null,null,null,null,null,null,"","",""]
[null,null,null,null,null,null,null,null,null,null,null,null,null,null,null,null,null,"","",""]
[null,null,null,null,null,null,null,null,null,null,null,null,null,null,null,null,null,"","",""]
[null,null,null,null,null,null,null,null,null,null,null,null,null,null,null,null,null,"","",""]
[null,null,null,null,null,null,null,null,null,null,null,null,null,null,null,null,null,"","",""]
[null,null,null,null,null,null,null,null,null,null,null,null,null,null,null,null,null,"","",""]
[null,null,null,null,null,null,null,null,null,null,null,null,null,null,null,null,null,"","",""]
[null,null,null,null,null,null,null,null,null,null,null,null,null,null,null,null,null,"","",""]
[null,null,null,null,null,null,null,null,null,null,null,null,null,null,null,null,null,"","",""]
[null,null,null,null,null,null,null,null,null,null,null,null,null,null,null,null,null,"","",""]
[null,null,null,null,null,null,null,null,null,null,null,null,null,null,null,null,null,"","",""]
[null,null,null,null,null,null,null,null,null,null,null,null,null,null,null,null,null,"","",""]
[null,null,null,null,null,null,null,null,null,null,null,null,null,null,null,null,null,"","",""]
[null,null,null,null,null,null,null,null,null,null,null,null,null,null,null,null,null,"","",""]
[null,null,null,null,null,null,null,null,null,null,null,null,null,null,null,null,null,"","",""]
[null,null,null,null,null,null,null,null,null,null,null,null,null,null,null,null,null,"","",""]
[null,null,null,null,null,null,null,null,null,null,null,null,null,null,null,null,null,"","",""]
[null,null,null,null,null,null,null,null,null,null,null,null,null,null,null,null,null,"","",""]
[null,null,null,null,null,null,null,null,null,null,null,null,null,null,null,null,null,"","",""]
[null,null,null,null,null,null,null,null,null,null,null,null,null,null,null,null,null,"","",""]
[null,null,null,null,null,null,null,null,null,null,null,null,null,null,null,null,null,"","",""]
[null,null,null,null,null,null,null,null,null,null,null,null,null,null,null,null,null,"","",""]
[null,null,null,null,null,null,null,null,null,null,null,null,null,null,null,null,null,"","",""]
[null,null,null,null,null,null,null,null,null,null,null,null,null,null,null,null,null,"","",""]
[null,null,null,null,null,null,null,null,null,null,null,null,null,null,null,null,null,"","",""]
[null,null,null,null,null,null,null,null,null,null,null,null,null,null,null,null,null,"","",""]
[null,null,null,null,null,null,null,null,null,null,null,null,null,null,null,null,null,"","",""]
[null,null,null,null,null,null,null,null,null,null,null,null,null,null,null,null,null,"","",""]
[null,null,null,null,null,null,null,null,null,null,null,null,null,null,null,null,null,"","",""]
[null,null,null,null,null,null,null,null,null,null,null,null,null,null,null,null,null,"","",""]
[null,null,null,null,null,null,null,null,null,null,null,null,null,null,null,null,null,"","",""]
[null,null,null,null,null,null,null,null,null,null,null,null,null,null,null,null,null,"","",""]
[null,null,null,null,null,null,null,null,null,null,null,null,null,null,null,null,null,"","",""]
[null,null,null,null,null,null,null,null,null,null,null,null,null,null,null,null,null,"","",""]
[null,null,null,null,null,null,null,null,null,null,null,null,null,null,null,null,null,"","",""]
[null,null,null,null,null,null,null,null,null,null,null,null,null,null,null,null,null,"","",""]
[null,null,null,null,null,null,null,null,null,null,null,null,null,null,null,null,null,"","",""]
[null,null,null,null,null,null,null,null,null,null,null,null,null,null,null,null,null,"","",""]
[null,null,null,null,null,null,null,null,null,null,null,null,null,null,null,null,null,"","",""]
[null,null,null,null,null,null,null,null,null,null,null,null,null,null,null,null,null,"","",""]
[null,null,null,null,null,null,null,null,null,null,null,null,null,null,null,null,null,"","",""]
[null,null,null,null,null,null,null,null,null,null,null,null,null,null,null,null,null,"","",""]
[null,null,null,null,null,null,null,null,null,null,null,null,null,null,null,null,null,"","",""]
[null,null,null,null,null,null,null,null,null,null,null,null,null,null,null,null,null,"","",""]
[null,null,null,null,null,null,null,null,null,null,null,null,null,null,null,null,null,"","",""]
[null,null,null,null,null,null,null,null,null,null,null,null,null,null,null,null,null,"","",""]
[null,null,null,null,null,null,null,null,null,null,null,null,null,null,null,null,null,"","",""]
[null,null,null,null,null,null,null,null,null,null,null,null,null,null,null,null,null,"","",""]
[null,null,null,null,null,null,null,null,null,null,null,null,null,null,null,null,null,"","",""]
[null,null,null,null,null,null,null,null,null,null,null,null,null,null,null,null,null,{"$f":"IF(L515=\"\",\"\",L515-O515)","v":""},{"$f":"IF(M515=\"\",\"\",M515-P515)","v":""},{"$f":"IF(N515=\"\",\"\",N515-Q515)","v":""}]
[null,null,null,null,null,null,null,null,null,null,null,null,null,null,null,null,null,"","",""]
[null,null,null,null,null,null,null,null,null,null,null,null,null,null,null,null,null,"","",""]
[null,null,null,null,null,null,null,null,null,null,null,null,null,null,null,null,null,"","",""]
[null,null,null,null,null,null,null,null,null,null,null,null,null,null,null,null,null,"","",""]
[null,null,null,null,null,null,null,null,null,null,null,null,null,null,null,null,null,"","",""]
[null,null,null,null,null,null,null,null,null,null,null,null,null,null,null,null,null,"","",""]
[null,null,null,null,null,null,null,null,null,null,null,null,null,null,null,null,null,"","",""]
[null,null,null,null,null,null,null,null,null,null,null,null,null,null,null,null,null,"","",""]
[null,null,null,null,null,null,null,null,null,null,null,null,null,null,null,null,null,"","",""]
[null,null,null,null,null,null,null,null,null,null,null,null,null,null,null,null,null,"","",""]
[null,null,null,null,null,null,null,null,null,null,null,null,null,null,null,null,null,"","",""]
[null,null,null,null,null,null,null,null,null,null,null,null,null,null,null,null,null,"","",""]
[null,null,null,null,null,null,null,null,null,null,null,null,null,null,null,null,null,"","",""]
[null,null,null,null,null,null,null,null,null,null,null,null,null,null,null,null,null,"","",""]
[null,null,null,null,null,null,null,null,null,null,null,null,null,null,null,null,null,"","",""]
[null,null,null,null,null,null,null,null,null,null,null,null,null,null,null,null,null,"","",""]
[null,null,null,null,null,null,null,null,null,null,null,null,null,null,null,null,null,"","",""]
[null,null,null,null,null,null,null,null,null,null,null,null,null,null,null,null,null,"","",""]
[null,null,null,null,null,null,null,null,null,null,null,null,null,null,null,null,null,"","",""]
[null,null,null,null,null,null,null,null,null,null,null,null,null,null,null,null,null,"","",""]
[null,null,null,null,null,null,null,null,null,null,null,null,null,null,null,null,null,"","",""]
[null,null,null,null,null,null,null,null,null,null,null,null,null,null,null,null,null,"","",""]
[null,null,null,null,null,null,null,null,null,null,null,null,null,null,null,null,null,"","",""]
[null,null,null,null,null,null,null,null,null,null,null,null,null,null,null,null,null,"","",""]
[null,null,null,null,null,null,null,null,null,null,null,null,null,null,null,null,null,"","",""]
[null,null,null,null,null,null,null,null,null,null,null,null,null,null,null,null,null,"","",""]
[null,null,null,null,null,null,null,null,null,null,null,null,null,null,null,null,null,"","",""]
[null,null,null,null,null,null,null,null,null,null,null,null,null,null,null,null,null,"","",""]
[null,null,null,null,null,null,null,null,null,null,null,null,null,null,null,null,null,"","",""]
[null,null,null,null,null,null,null,null,null,null,null,null,null,null,null,null,null,"","",""]
[null,null,null,null,null,null,null,null,null,null,null,null,null,null,null,null,null,"","",""]
[null,null,null,null,null,null,null,null,null,null,null,null,null,null,null,null,null,"","",""]
[null,null,null,null,null,null,null,null,null,null,null,null,null,null,null,null,null,"","",""]
[null,null,null,null,null,null,null,null,null,null,null,null,null,null,null,null,null,"","",""]
[null,null,null,null,null,null,null,null,null,null,null,null,null,null,null,null,null,"","",""]
[null,null,null,null,null,null,null,null,null,null,null,null,null,null,null,null,null,"","",""]
[null,null,null,null,null,null,null,null,null,null,null,null,null,null,null,null,null,"","",""]
[null,null,null,null,null,null,null,null,null,null,null,null,null,null,null,null,null,"","",""]
[null,null,null,null,null,null,null,null,null,null,null,null,null,null,null,null,null,"","",""]
[null,null,null,null,null,null,null,null,null,null,null,null,null,null,null,null,null,"","",""]
[null,null,null,null,null,null,null,null,null,null,null,null,null,null,null,null,null,"","",""]
[null,null,null,null,null,null,null,null,null,null,null,null,null,null,null,null,null,"","",""]
[null,null,null,null,null,null,null,null,null,null,null,null,null,null,null,null,null,"","",""]
[null,null,null,null,null,null,null,null,null,null,null,null,null,null,null,null,null,"","",""]
[null,null,null,null,null,null,null,null,null,null,null,null,null,null,null,null,null,"","",""]
[null,null,null,null,null,null,null,null,null,null,null,null,null,null,null,null,null,"","",""]
[null,null,null,null,null,null,null,null,null,null,null,null,null,null,null,null,null,"","",""]
[null,null,null,null,null,null,null,null,null,null,null,null,null,null,null,null,null,"","",""]
[null,null,null,null,null,null,null,null,null,null,null,null,null,null,null,null,null,"","",""]
[null,null,null,null,null,null,null,null,null,null,null,null,null,null,null,null,null,"","",""]
[null,null,null,null,null,null,null,null,null,null,null,null,null,null,null,null,null,"","",""]
[null,null,null,null,null,null,null,null,null,null,null,null,null,null,null,null,null,"","",""]
[null,null,null,null,null,null,null,null,null,null,null,null,null,null,null,null,null,"","",""]
[null,null,null,null,null,null,null,null,null,null,null,null,null,null,null,null,null,"","",""]
[null,null,null,null,null,null,null,null,null,null,null,null,null,null,null,null,null,"","",""]
[null,null,null,null,null,null,null,null,null,null,null,null,null,null,null,null,null,"","",""]
[null,null,null,null,null,null,null,null,null,null,null,null,null,null,null,null,null,"","",""]
[null,null,null,null,null,null,null,null,null,null,null,null,null,null,null,null,null,"","",""]
[null,null,null,null,null,null,null,null,null,null,null,null,null,null,null,null,null,"","",""]
[null,null,null,null,null,null,null,null,null,null,null,null,null,null,null,null,null,"","",""]
[null,null,null,null,null,null,null,null,null,null,null,null,null,null,null,null,null,"","",""]
[null,null,null,null,null,null,null,null,null,null,null,null,null,null,null,null,null,"","",""]
[null,null,null,null,null,null,null,null,null,null,null,null,null,null,null,null,null,"","",""]
[null,null,null,null,null,null,null,null,null,null,null,null,null,null,null,null,null,{"$f":"IF(L579=\"\",\"\",L579-O579)","v":""},{"$f":"IF(M579=\"\",\"\",M579-P579)","v":""},{"$f":"IF(N579=\"\",\"\",N579-Q579)","v":""}]
[null,null,null,null,null,null,null,null,null,null,null,null,null,null,null,null,null,"","",""]
[null,null,null,null,null,null,null,null,null,null,null,null,null,null,null,null,null,"","",""]
[null,null,null,null,null,null,null,null,null,null,null,null,null,null,null,null,null,"","",""]
[null,null,null,null,null,null,null,null,null,null,null,null,null,null,null,null,null,"","",""]
[null,null,null,null,null,null,null,null,null,null,null,null,null,null,null,null,null,"","",""]
[null,null,null,null,null,null,null,null,null,null,null,null,null,null,null,null,null,"","",""]
[null,null,null,null,null,null,null,null,null,null,null,null,null,null,null,null,null,"","",""]
[null,null,null,null,null,null,null,null,null,null,null,null,null,null,null,null,null,"","",""]
[null,null,null,null,null,null,null,null,null,null,null,null,null,null,null,null,null,"","",""]
[null,null,null,null,null,null,null,null,null,null,null,null,null,null,null,null,null,"","",""]
[null,null,null,null,null,null,null,null,null,null,null,null,null,null,null,null,null,"","",""]
[null,null,null,null,null,null,null,null,null,null,null,null,null,null,null,null,null,"","",""]
[null,null,null,null,null,null,null,null,null,null,null,null,null,null,null,null,null,"","",""]
[null,null,null,null,null,null,null,null,null,null,null,null,null,null,null,null,null,"","",""]
[null,null,null,null,null,null,null,null,null,null,null,null,null,null,null,null,null,"","",""]
[null,null,null,null,null,null,null,null,null,null,null,null,null,null,null,null,null,"","",""]
[null,null,null,null,null,null,null,null,null,null,null,null,null,null,null,null,null,"","",""]
[null,null,null,null,null,null,null,null,null,null,null,null,null,null,null,null,null,"","",""]
[null,null,null,null,null,null,null,null,null,null,null,null,null,null,null,null,null,"","",""]
[null,null,null,null,null,null,null,null,null,null,null,null,null,null,null,null,null,"","",""]
[null,null,null,null,null,null,null,null,null,null,null,null,null,null,null,null,null,"","",""]
[null,null,null,null,null,null,null,null,null,null,null,null,null,null,null,null,null,"","",""]
[null,null,null,null,null,null,null,null,null,null,null,null,null,null,null,null,null,"","",""]
[null,null,null,null,null,null,null,null,null,null,null,null,null,null,null,null,null,"","",""]
[null,null,null,null,null,null,null,null,null,null,null,null,null,null,null,null,null,"","",""]
[null,null,null,null,null,null,null,null,null,null,null,null,null,null,null,null,null,"","",""]
[null,null,null,null,null,null,null,null,null,null,null,null,null,null,null,null,null,"","",""]
[null,null,null,null,null,null,null,null,null,null,null,null,null,null,null,null,null,"","",""]
[null,null,null,null,null,null,null,null,null,null,null,null,null,null,null,null,null,"","",""]
[null,null,null,null,null,null,null,null,null,null,null,null,null,null,null,null,null,"","",""]
[null,null,null,null,null,null,null,null,null,null,null,null,null,null,null,null,null,"","",""]
[null,null,null,null,null,null,null,null,null,null,null,null,null,null,null,null,null,"","",""]
[null,null,null,null,null,null,null,null,null,null,null,null,null,null,null,null,null,"","",""]
[null,null,null,null,null,null,null,null,null,null,null,null,null,null,null,null,null,"","",""]
[null,null,null,null,null,null,null,null,null,null,null,null,null,null,null,null,null,"","",""]
[null,null,null,null,null,null,null,null,null,null,null,null,null,null,null,null,null,"","",""]
[null,null,null,null,null,null,null,null,null,null,null,null,null,null,null,null,null,"","",""]
[null,null,null,null,null,null,null,null,null,null,null,null,null,null,null,null,null,"","",""]
[null,null,null,null,null,null,null,null,null,null,null,null,null,null,null,null,null,"","",""]
[null,null,null,null,null,null,null,null,null,null,null,null,null,null,null,null,null,"","",""]
[null,null,null,null,null,null,null,null,null,null,null,null,null,null,null,null,null,"","",""]
[null,null,null,null,null,null,null,null,null,null,null,null,null,null,null,null,null,"","",""]
[null,null,null,null,null,null,null,null,null,null,null,null,null,null,null,null,null,"","",""]
[null,null,null,null,null,null,null,null,null,null,null,null,null,null,null,null,null,"","",""]
[null,null,null,null,null,null,null,null,null,null,null,null,null,null,null,null,null,"","",""]
[null,null,null,null,null,null,null,null,null,null,null,null,null,null,null,null,null,"","",""]
[null,null,null,null,null,null,null,null,null,null,null,null,null,null,null,null,null,"","",""]
[null,null,null,null,null,null,null,null,null,null,null,null,null,null,null,null,null,"","",""]
[null,null,null,null,null,null,null,null,null,null,null,null,null,null,null,null,null,"","",""]
[null,null,null,null,null,null,null,null,null,null,null,null,null,null,null,null,null,"","",""]
[null,null,null,null,null,null,null,null,null,null,null,null,null,null,null,null,null,"","",""]
[null,null,null,null,null,null,null,null,null,null,null,null,null,null,null,null,null,"","",""]
[null,null,null,null,null,null,null,null,null,null,null,null,null,null,null,null,null,"","",""]
[null,null,null,null,null,null,null,null,null,null,null,null,null,null,null,null,null,"","",""]
[null,null,null,null,null,null,null,null,null,null,null,null,null,null,null,null,null,"","",""]
[null,null,null,null,null,null,null,null,null,null,null,null,null,null,null,null,null,"","",""]
[null,null,null,null,null,null,null,null,null,null,null,null,null,null,null,null,null,"","",""]
[null,null,null,null,null,null,null,null,null,null,null,null,null,null,null,null,null,"","",""]
[null,null,null,null,null,null,null,null,null,null,null,null,null,null,null,null,null,"","",""]
[null,null,null,null,null,null,null,null,null,null,null,null,null,null,null,null,null,"","",""]
[null,null,null,null,null,null,null,null,null,null,null,null,null,null,null,null,null,"","",""]
[null,null,null,null,null,null,null,null,null,null,null,null,null,null,null,null,null,"","",""]
[null,null,null,null,null,null,null,null,null,null,null,null,null,null,null,null,null,"","",""]
[null,null,null,null,null,null,null,null,null,null,null,null,null,null,null,null,null,{"$f":"IF(L643=\"\",\"\",L643-O643)","v":""},{"$f":"IF(M643=\"\",\"\",M643-P643)","v":""},{"$f":"IF(N643=\"\",\"\",N643-Q643)","v":""}]
[null,null,null,null,null,null,null,null,null,null,null,null,null,null,null,null,null,"","",""]
[null,null,null,null,null,null,null,null,null,null,null,null,null,null,null,null,null,"","",""]
[null,null,null,null,null,null,null,null,null,null,null,null,null,null,null,null,null,"","",""]
[null,null,null,null,null,null,null,null,null,null,null,null,null,null,null,null,null,"","",""]
[null,null,null,null,null,null,null,null,null,null,null,null,null,null,null,null,null,"","",""]
[null,null,null,null,null,null,null,null,null,null,null,null,null,null,null,null,null,"","",""]
[null,null,null,null,null,null,null,null,null,null,null,null,null,null,null,null,null,"","",""]
[null,null,null,null,null,null,null,null,null,null,null,null,null,null,null,null,null,"","",""]
[null,null,null,null,null,null,null,null,null,null,null,null,null,null,null,null,null,"","",""]
[null,null,null,null,null,null,null,null,null,null,null,null,null,null,null,null,null,"","",""]
[null,null,null,null,null,null,null,null,null,null,null,null,null,null,null,null,null,"","",""]
[null,null,null,null,null,null,null,null,null,null,null,null,null,null,null,null,null,"","",""]
[null,null,null,null,null,null,null,null,null,null,null,null,null,null,null,null,null,"","",""]
[null,null,null,null,null,null,null,null,null,null,null,null,null,null,null,null,null,"","",""]
[null,null,null,null,null,null,null,null,null,null,null,null,null,null,null,null,null,"","",""]
[null,null,null,null,null,null,null,null,null,null,null,null,null,null,null,null,null,"","",""]
[null,null,null,null,null,null,null,null,null,null,null,null,null,null,null,null,null,"","",""]
[null,null,null,null,null,null,null,null,null,null,null,null,null,null,null,null,null,"","",""]
[null,null,null,null,null,null,null,null,null,null,null,null,null,null,null,null,null,"","",""]
[null,null,null,null,null,null,null,null,null,null,null,null,null,null,null,null,null,"","",""]
[null,null,null,null,null,null,null,null,null,null,null,null,null,null,null,null,null,"","",""]
[null,null,null,null,null,null,null,null,null,null,null,null,null,null,null,null,null,"","",""]
[null,null,null,null,null,null,null,null,null,null,null,null,null,null,null,null,null,"","",""]
[null,null,null,null,null,null,null,null,null,null,null,null,null,null,null,null,null,"","",""]
[null,null,null,null,null,null,null,null,null,null,null,null,null,null,null,null,null,"","",""]
[null,null,null,null,null,null,null,null,null,null,null,null,null,null,null,null,null,"","",""]
[null,null,null,null,null,null,null,null,null,null,null,null,null,null,null,null,null,"","",""]
[null,null,null,null,null,null,null,null,null,null,null,null,null,null,null,null,null,"","",""]
[null,null,null,null,null,null,null,null,null,null,null,null,null,null,null,null,null,"","",""]
[null,null,null,null,null,null,null,null,null,null,null,null,null,null,null,null,null,"","",""]
[null,null,null,null,null,null,null,null,null,null,null,null,null,null,null,null,null,"","",""]
[null,null,null,null,null,null,null,null,null,null,null,null,null,null,null,null,null,"","",""]
[null,null,null,null,null,null,null,null,null,null,null,null,null,null,null,null,null,"","",""]
[null,null,null,null,null,null,null,null,null,null,null,null,null,null,null,null,null,"","",""]
[null,null,null,null,null,null,null,null,null,null,null,null,null,null,null,null,null,"","",""]
[null,null,null,null,null,null,null,null,null,null,null,null,null,null,null,null,null,"","",""]
[null,null,null,null,null,null,null,null,null,null,null,null,null,null,null,null,null,"","",""]
[null,null,null,null,null,null,null,null,null,null,null,null,null,null,null,null,null,"","",""]
[null,null,null,null,null,null,null,null,null,null,null,null,null,null,null,null,null,"","",""]
[null,null,null,null,null,null,null,null,null,null,null,null,null,null,null,null,null,"","",""]
[null,null,null,null,null,null,null,null,null,null,null,null,null,null,null,null,null,"","",""]
[null,null,null,null,null,null,null,null,null,null,null,null,null,null,null,null,null,"","",""]
[null,null,null,null,null,null,null,null,null,null,null,null,null,null,null,null,null,"","",""]
[null,null,null,null,null,null,null,null,null,null,null,null,null,null,null,null,null,"","",""]
[null,null,null,null,null,null,null,null,null,null,null,null,null,null,null,null,null,"","",""]
[null,null,null,null,null,null,null,null,null,null,null,null,null,null,null,null,null,"","",""]
[null,null,null,null,null,null,null,null,null,null,null,null,null,null,null,null,null,"","",""]
[null,null,null,null,null,null,null,null,null,null,null,null,null,null,null,null,null,"","",""]
[null,null,null,null,null,null,null,null,null,null,null,null,null,null,null,null,null,"","",""]
[null,null,null,null,null,null,null,null,null,null,null,null,null,null,null,null,null,"","",""]
[null,null,null,null,null,null,null,null,null,null,null,null,null,null,null,null,null,"","",""]
[null,null,null,null,null,null,null,null,null,null,null,null,null,null,null,null,null,"","",""]
[null,null,null,null,null,null,null,null,null,null,null,null,null,null,null,null,null,"","",""]
[null,null,null,null,null,null,null,null,null,null,null,null,null,null,null,null,null,"","",""]
[null,null,null,null,null,null,null,null,null,null,null,null,null,null,null,null,null,"","",""]
[null,null,null,null,null,null,null,null,null,null,null,null,null,null,null,null,null,"","",""]
[null,null,null,null,null,null,null,null,null,null,null,null,null,null,null,null,null,"","",""]
[null,null,null,null,null,null,null,null,null,null,null,null,null,null,null,null,null,"","",""]
[null,null,null,null,null,null,null,null,null,null,null,null,null,null,null,null,null,"","",""]
[null,null,null,null,null,null,null,null,null,null,null,null,null,null,null,null,null,"","",""]
[null,null,null,null,null,null,null,null,null,null,null,null,null,null,null,null,null,"","",""]
[null,null,null,null,null,null,null,null,null,null,null,null,null,null,null,null,null,"","",""]
[null,null,null,null,null,null,null,null,null,null,null,null,null,null,null,null,null,"","",""]
[null,null,null,null,null,null,null,null,null,null,null,null,null,null,null,null,null,{"$f":"IF(L707=\"\",\"\",L707-O707)","v":""},{"$f":"IF(M707=\"\",\"\",M707-P707)","v":""},{"$f":"IF(N707=\"\",\"\",N707-Q707)","v":""}]
[null,null,null,null,null,null,null,null,null,null,null,null,null,null,null,null,null,"","",""]
[null,null,null,null,null,null,null,null,null,null,null,null,null,null,null,null,null,"","",""]
[null,null,null,null,null,null,null,null,null,null,null,null,null,null,null,null,null,"","",""]
[null,null,null,null,null,null,null,null,null,null,null,null,null,null,null,null,null,"","",""]
[null,null,null,null,null,null,null,null,null,null,null,null,null,null,null,null,null,"","",""]
[null,null,null,null,null,null,null,null,null,null,null,null,null,null,null,null,null,"","",""]
[null,null,null,null,null,null,null,null,null,null,null,null,null,null,null,null,null,"","",""]
[null,null,null,null,null,null,null,null,null,null,null,null,null,null,null,null,null,"","",""]
[null,null,null,null,null,null,null,null,null,null,null,null,null,null,null,null,null,"","",""]
[null,null,null,null,null,null,null,null,null,null,null,null,null,null,null,null,null,"","",""]
[null,null,null,null,null,null,null,null,null,null,null,null,null,null,null,null,null,"","",""]
[null,null,null,null,null,null,null,null,null,null,null,null,null,null,null,null,null,"","",""]
[null,null,null,null,null,null,null,null,null,null,null,null,null,null,null,null,null,"","",""]
[null,null,null,null,null,null,null,null,null,null,null,null,null,null,null,null,null,"","",""]
[null,null,null,null,null,null,null,null,null,null,null,null,null,null,null,null,null,"","",""]
[null,null,null,null,null,null,null,null,null,null,null,null,null,null,null,null,null,"","",""]
[null,null,null,null,null,null,null,null,null,null,null,null,null,null,null,null,null,"","",""]
[null,null,null,null,null,null,null,null,null,null,null,null,null,null,null,null,null,"","",""]
[null,null,null,null,null,null,null,null,null,null,null,null,null,null,null,null,null,"","",""]
[null,null,null,null,null,null,null,null,null,null,null,null,null,null,null,null,null,"","",""]
[null,null,null,null,null,null,null,null,null,null,null,null,null,null,null,null,null,"","",""]
[null,null,null,null,null,null,null,null,null,null,null,null,null,null,null,null,null,"","",""]
[null,null,null,null,null,null,null,null,null,null,null,null,null,null,null,null,null,"","",""]
[null,null,null,null,null,null,null,null,null,null,null,null,null,null,null,null,null,"","",""]
[null,null,null,null,null,null,null,null,null,null,null,null,null,null,null,null,null,"","",""]
[null,null,null,null,null,null,null,null,null,null,null,null,null,null,null,null,null,"","",""]
[null,null,null,null,null,null,null,null,null,null,null,null,null,null,null,null,null,"","",""]
[null,null,null,null,null,null,null,null,null,null,null,null,null,null,null,null,null,"","",""]
[null,null,null,null,null,null,null,null,null,null,null,null,null,null,null,null,null,"","",""]
[null,null,null,null,null,null,null,null,null,null,null,null,null,null,null,null,null,"","",""]
[null,null,null,null,null,null,null,null,null,null,null,null,null,null,null,null,null,"","",""]
[null,null,null,null,null,null,null,null,null,null,null,null,null,null,null,null,null,"","",""]
[null,null,null,null,null,null,null,null,null,null,null,null,null,null,null,null,null,"","",""]
[null,null,null,null,null,null,null,null,null,null,null,null,null,null,null,null,null,"","",""]
[null,null,null,null,null,null,null,null,null,null,null,null,null,null,null,null,null,"","",""]
[null,null,null,null,null,null,null,null,null,null,null,null,null,null,null,null,null,"","",""]
[null,null,null,null,null,null,null,null,null,null,null,null,null,null,null,null,null,"","",""]
[null,null,null,null,null,null,null,null,null,null,null,null,null,null,null,null,null,"","",""]
[null,null,null,null,null,null,null,null,null,null,null,null,null,null,null,null,null,"","",""]
[null,null,null,null,null,null,null,null,null,null,null,null,null,null,null,null,null,"","",""]
[null,null,null,null,null,null,null,null,null,null,null,null,null,null,null,null,null,"","",""]
[null,null,null,null,null,null,null,null,null,null,null,null,null,null,null,null,null,"","",""]
[null,null,null,null,null,null,null,null,null,null,null,null,null,null,null,null,null,"","",""]
[null,null,null,null,null,null,null,null,null,null,null,null,null,null,null,null,null,"","",""]
[null,null,null,null,null,null,null,null,null,null,null,null,null,null,null,null,null,"","",""]
[null,null,null,null,null,null,null,null,null,null,null,null,null,null,null,null,null,"","",""]
[null,null,null,null,null,null,null,null,null,null,null,null,null,null,null,null,null,"","",""]
[null,null,null,null,null,null,null,null,null,null,null,null,null,null,null,null,null,"","",""]
[null,null,null,null,null,null,null,null,null,null,null,null,null,null,null,null,null,"","",""]
[null,null,null,null,null,null,null,null,null,null,null,null,null,null,null,null,null,"","",""]
[null,null,null,null,null,null,null,null,null,null,null,null,null,null,null,null,null,"","",""]
[null,null,null,null,null,null,null,null,null,null,null,null,null,null,null,null,null,"","",""]
[null,null,null,null,null,null,null,null,null,null,null,null,null,null,null,null,null,"","",""]
[null,null,null,null,null,null,null,null,null,null,null,null,null,null,null,null,null,"","",""]
[null,null,null,null,null,null,null,null,null,null,null,null,null,null,null,null,null,"","",""]
[null,null,null,null,null,null,null,null,null,null,null,null,null,null,null,null,null,"","",""]
[null,null,null,null,null,null,null,null,null,null,null,null,null,null,null,null,null,"","",""]
[null,null,null,null,null,null,null,null,null,null,null,null,null,null,null,null,null,"","",""]
[null,null,null,null,null,null,null,null,null,null,null,null,null,null,null,null,null,"","",""]
[null,null,null,null,null,null,null,null,null,null,null,null,null,null,null,null,null,"","",""]
[null,null,null,null,null,null,null,null,null,null,null,null,null,null,null,null,null,"","",""]
[null,null,null,null,null,null,null,null,null,null,null,null,null,null,null,null,null,"","",""]
[null,null,null,null,null,null,null,null,null,null,null,null,null,null,null,null,null,"","",""]
[null,null,null,null,null,null,null,null,null,null,null,null,null,null,null,null,null,{"$f":"IF(L771=\"\",\"\",L771-O771)","v":""},{"$f":"IF(M771=\"\",\"\",M771-P771)","v":""},{"$f":"IF(N771=\"\",\"\",N771-Q771)","v":""}]
[null,null,null,null,null,null,null,null,null,null,null,null,null,null,null,null,null,"","",""]
[null,null,null,null,null,null,null,null,null,null,null,null,null,null,null,null,null,"","",""]
[null,null,null,null,null,null,null,null,null,null,null,null,null,null,null,null,null,"","",""]
[null,null,null,null,null,null,null,null,null,null,null,null,null,null,null,null,null,"","",""]
[null,null,null,null,null,null,null,null,null,null,null,null,null,null,null,null,null,"","",""]
[null,null,null,null,null,null,null,null,null,null,null,null,null,null,null,null,null,"","",""]
[null,null,null,null,null,null,null,null,null,null,null,null,null,null,null,null,null,"","",""]
[null,null,null,null,null,null,null,null,null,null,null,null,null,null,null,null,null,"","",""]
[null,null,null,null,null,null,null,null,null,null,null,null,null,null,null,null,null,"","",""]
[null,null,null,null,null,null,null,null,null,null,null,null,null,null,null,null,null,"","",""]
[null,null,null,null,null,null,null,null,null,null,null,null,null,null,null,null,null,"","",""]
[null,null,null,null,null,null,null,null,null,null,null,null,null,null,null,null,null,"","",""]
[null,null,null,null,null,null,null,null,null,null,null,null,null,null,null,null,null,"","",""]
[null,null,null,null,null,null,null,null,null,null,null,null,null,null,null,null,null,"","",""]
[null,null,null,null,null,null,null,null,null,null,null,null,null,null,null,null,null,"","",""]
[null,null,null,null,null,null,null,null,null,null,null,null,null,null,null,null,null,"","",""]
[null,null,null,null,null,null,null,null,null,null,null,null,null,null,null,null,null,"","",""]
[null,null,null,null,null,null,null,null,null,null,null,null,null,null,null,null,null,"","",""]
[null,null,null,null,null,null,null,null,null,null,null,null,null,null,null,null,null,"","",""]
[null,null,null,null,null,null,null,null,null,null,null,null,null,null,null,null,null,"","",""]
[null,null,null,null,null,null,null,null,null,null,null,null,null,null,null,null,null,"","",""]
[null,null,null,null,null,null,null,null,null,null,null,null,null,null,null,null,null,"","",""]
[null,null,null,null,null,null,null,null,null,null,null,null,null,null,null,null,null,"","",""]
[null,null,null,null,null,null,null,null,null,null,null,null,null,null,null,null,null,"","",""]
[null,null,null,null,null,null,null,null,null,null,null,null,null,null,null,null,null,"","",""]
[null,null,null,null,null,null,null,null,null,null,null,null,null,null,null,null,null,"","",""]
[null,null,null,null,null,null,null,null,null,null,null,null,null,null,null,null,null,"","",""]
[null,null,null,null,null,null,null,null,null,null,null,null,null,null,null,null,null,"","",""]
[null,null,null,null,null,null,null,null,null,null,null,null,null,null,null,null,null,"","",""]
[null,null,null,null,null,null,null,null,null,null,null,null,null,null,null,null,null,"","",""]
[null,null,null,null,null,null,null,null,null,null,null,null,null,null,null,null,null,"","",""]
[null,null,null,null,null,null,null,null,null,null,null,null,null,null,null,null,null,"","",""]
[null,null,null,null,null,null,null,null,null,null,null,null,null,null,null,null,null,"","",""]
[null,null,null,null,null,null,null,null,null,null,null,null,null,null,null,null,null,"","",""]
[null,null,null,null,null,null,null,null,null,null,null,null,null,null,null,null,null,"","",""]
[null,null,null,null,null,null,null,null,null,null,null,null,null,null,null,null,null,"","",""]
[null,null,null,null,null,null,null,null,null,null,null,null,null,null,null,null,null,"","",""]
[null,null,null,null,null,null,null,null,null,null,null,null,null,null,null,null,null,"","",""]
[null,null,null,null,null,null,null,null,null,null,null,null,null,null,null,null,null,"","",""]
[null,null,null,null,null,null,null,null,null,null,null,null,null,null,null,null,null,"","",""]
[null,null,null,null,null,null,null,null,null,null,null,null,null,null,null,null,null,"","",""]
[null,null,null,null,null,null,null,null,null,null,null,null,null,null,null,null,null,"","",""]
[null,null,null,null,null,null,null,null,null,null,null,null,null,null,null,null,null,"","",""]
[null,null,null,null,null,null,null,null,null,null,null,null,null,null,null,null,null,"","",""]
[null,null,null,null,null,null,null,null,null,null,null,null,null,null,null,null,null,"","",""]
[null,null,null,null,null,null,null,null,null,null,null,null,null,null,null,null,null,"","",""]
[null,null,null,null,null,null,null,null,null,null,null,null,null,null,null,null,null,"","",""]
[null,null,null,null,null,null,null,null,null,null,null,null,null,null,null,null,null,"","",""]
[null,null,null,null,null,null,null,null,null,null,null,null,null,null,null,null,null,"","",""]
[null,null,null,null,null,null,null,null,null,null,null,null,null,null,null,null,null,"","",""]
[null,null,null,null,null,null,null,null,null,null,null,null,null,null,null,null,null,"","",""]
[null,null,null,null,null,null,null,null,null,null,null,null,null,null,null,null,null,"","",""]
[null,null,null,null,null,null,null,null,null,null,null,null,null,null,null,null,null,"","",""]
[null,null,null,null,null,null,null,null,null,null,null,null,null,null,null,null,null,"","",""]
[null,null,null,null,null,null,null,null,null,null,null,null,null,null,null,null,null,"","",""]
[null,null,null,null,null,null,null,null,null,null,null,null,null,null,null,null,null,"","",""]
[null,null,null,null,null,null,null,null,null,null,null,null,null,null,null,null,null,"","",""]
[null,null,null,null,null,null,null,null,null,null,null,null,null,null,null,null,null,"","",""]
[null,null,null,null,null,null,null,null,null,null,null,null,null,null,null,null,null,"","",""]
[null,null,null,null,null,null,null,null,null,null,null,null,null,null,null,null,null,"","",""]
[null,null,null,null,null,null,null,null,null,null,null,null,null,null,null,null,null,"","",""]
[null,null,null,null,null,null,null,null,null,null,null,null,null,null,null,null,null,"","",""]
[null,null,null,null,null,null,null,null,null,null,null,null,null,null,null,null,null,"","",""]
[null,null,null,null,null,null,null,null,null,null,null,null,null,null,null,null,null,{"$f":"IF(L835=\"\",\"\",L835-O835)","v":""},{"$f":"IF(M835=\"\",\"\",M835-P835)","v":""},{"$f":"IF(N835=\"\",\"\",N835-Q835)","v":""}]
[null,null,null,null,null,null,null,null,null,null,null,null,null,null,null,null,null,"","",""]
[null,null,null,null,null,null,null,null,null,null,null,null,null,null,null,null,null,"","",""]
[null,null,null,null,null,null,null,null,null,null,null,null,null,null,null,null,null,"","",""]
[null,null,null,null,null,null,null,null,null,null,null,null,null,null,null,null,null,"","",""]
[null,null,null,null,null,null,null,null,null,null,null,null,null,null,null,null,null,"","",""]
[null,null,null,null,null,null,null,null,null,null,null,null,null,null,null,null,null,"","",""]
[null,null,null,null,null,null,null,null,null,null,null,null,null,null,null,null,null,"","",""]
[null,null,null,null,null,null,null,null,null,null,null,null,null,null,null,null,null,"","",""]
[null,null,null,null,null,null,null,null,null,null,null,null,null,null,null,null,null,"","",""]
[null,null,null,null,null,null,null,null,null,null,null,null,null,null,null,null,null,"","",""]
[null,null,null,null,null,null,null,null,null,null,null,null,null,null,null,null,null,"","",""]
[null,null,null,null,null,null,null,null,null,null,null,null,null,null,null,null,null,"","",""]
[null,null,null,null,null,null,null,null,null,null,null,null,null,null,null,null,null,"","",""]
[null,null,null,null,null,null,null,null,null,null,null,null,null,null,null,null,null,"","",""]
[null,null,null,null,null,null,null,null,null,null,null,null,null,null,null,null,null,"","",""]
[null,null,null,null,null,null,null,null,null,null,null,null,null,null,null,null,null,"","",""]
[null,null,null,null,null,null,null,null,null,null,null,null,null,null,null,null,null,"","",""]
[null,null,null,null,null,null,null,null,null,null,null,null,null,null,null,null,null,"","",""]
[null,null,null,null,null,null,null,null,null,null,null,null,null,null,null,null,null,"","",""]
[null,null,null,null,null,null,null,null,null,null,null,null,null,null,null,null,null,"","",""]
[null,null,null,null,null,null,null,null,null,null,null,null,null,null,null,null,null,"","",""]
[null,null,null,null,null,null,null,null,null,null,null,null,null,null,null,null,null,"","",""]
[null,null,null,null,null,null,null,null,null,null,null,null,null,null,null,null,null,"","",""]
[null,null,null,null,null,null,null,null,null,null,null,null,null,null,null,null,null,"","",""]
[null,null,null,null,null,null,null,null,null,null,null,null,null,null,null,null,null,"","",""]
[null,null,null,null,null,null,null,null,null,null,null,null,null,null,null,null,null,"","",""]
[null,null,null,null,null,null,null,null,null,null,null,null,null,null,null,null,null,"","",""]
[null,null,null,null,null,null,null,null,null,null,null,null,null,null,null,null,null,"","",""]
[null,null,null,null,null,null,null,null,null,null,null,null,null,null,null,null,null,"","",""]
[null,null,null,null,null,null,null,null,null,null,null,null,null,null,null,null,null,"","",""]
[null,null,null,null,null,null,null,null,null,null,null,null,null,null,null,null,null,"","",""]
[null,null,null,null,null,null,null,null,null,null,null,null,null,null,null,null,null,"","",""]
[null,null,null,null,null,null,null,null,null,null,null,null,null,null,null,null,null,"","",""]
[null,null,null,null,null,null,null,null,null,null,null,null,null,null,null,null,null,"","",""]
[null,null,null,null,null,null,null,null,null,null,null,null,null,null,null,null,null,"","",""]
[null,null,null,null,null,null,null,null,null,null,null,null,null,null,null,null,null,"","",""]
[null,null,null,null,null,null,null,null,null,null,null,null,null,null,null,null,null,"","",""]
[null,null,null,null,null,null,null,null,null,null,null,null,null,null,null,null,null,"","",""]
[null,null,null,null,null,null,null,null,null,null,null,null,null,null,null,null,null,"","",""]
[null,null,null,null,null,null,null,null,null,null,null,null,null,null,null,null,null,"","",""]
[null,null,null,null,null,null,null,null,null,null,null,null,null,null,null,null,null,"","",""]
[null,null,null,null,null,null,null,null,null,null,null,null,null,null,null,null,null,"","",""]
[null,null,null,null,null,null,null,null,null,null,null,null,null,null,null,null,null,"","",""]
[null,null,null,null,null,null,null,null,null,null,null,null,null,null,null,null,null,"","",""]
[null,null,null,null,null,null,null,null,null,null,null,null,null,null,null,null,null,"","",""]
[null,null,null,null,null,null,null,null,null,null,null,null,null,null,null,null,null,"","",""]
[null,null,null,null,null,null,null,null,null,null,null,null,null,null,null,null,null,"","",""]
[null,null,null,null,null,null,null,null,null,null,null,null,null,null,null,null,null,"","",""]
[null,null,null,null,null,null,null,null,null,null,null,null,null,null,null,null,null,"","",""]
[null,null,null,null,null,null,null,null,null,null,null,null,null,null,null,null,null,"","",""]
[null,null,null,null,null,null,null,null,null,null,null,null,null,null,null,null,null,"","",""]
[null,null,null,null,null,null,null,null,null,null,null,null,null,null,null,null,null,"","",""]
[null,null,null,null,null,null,null,null,null,null,null,null,null,null,null,null,null,"","",""]
[null,null,null,null,null,null,null,null,null,null,null,null,null,null,null,null,null,"","",""]
[null,null,null,null,null,null,null,null,null,null,null,null,null,null,null,null,null,"","",""]
[null,null,null,null,null,null,null,null,null,null,null,null,null,null,null,null,null,"","",""]
[null,null,null,null,null,null,null,null,null,null,null,null,null,null,null,null,null,"","",""]
[null,null,null,null,null,null,null,null,null,null,null,null,null,null,null,null,null,"","",""]
[null,null,null,null,null,null,null,null,null,null,null,null,null,null,null,null,null,"","",""]
[null,null,null,null,null,null,null,null,null,null,null,null,null,null,null,null,null,"","",""]
[null,null,null,null,null,null,null,null,null,null,null,null,null,null,null,null,null,"","",""]
[null,null,null,null,null,null,null,null,null,null,null,null,null,null,null,null,null,"","",""]
[null,null,null,null,null,null,null,null,null,null,null,null,null,null,null,null,null,"","",""]
[null,null,null,null,null,null,null,null,null,null,null,null,null,null,null,null,null,{"$f":"IF(L899=\"\",\"\",L899-O899)","v":""},{"$f":"IF(M899=\"\",\"\",M899-P899)","v":""},{"$f":"IF(N899=\"\",\"\",N899-Q899)","v":""}]
[null,null,null,null,null,null,null,null,null,null,null,null,null,null,null,null,null,"","",""]
[null,null,null,null,null,null,null,null,null,null,null,null,null,null,null,null,null,"","",""]
[null,null,null,null,null,null,null,null,null,null,null,null,null,null,null,null,null,"","",""]
[null,null,null,null,null,null,null,null,null,null,null,null,null,null,null,null,null,"","",""]
[null,null,null,null,null,null,null,null,null,null,null,null,null,null,null,null,null,"","",""]
[null,null,null,null,null,null,null,null,null,null,null,null,null,null,null,null,null,"","",""]
[null,null,null,null,null,null,null,null,null,null,null,null,null,null,null,null,null,"","",""]
[null,null,null,null,null,null,null,null,null,null,null,null,null,null,null,null,null,"","",""]
[null,null,null,null,null,null,null,null,null,null,null,null,null,null,null,null,null,"","",""]
[null,null,null,null,null,null,null,null,null,null,null,null,null,null,null,null,null,"","",""]
[null,null,null,null,null,null,null,null,null,null,null,null,null,null,null,null,null,"","",""]
[null,null,null,null,null,null,null,null,null,null,null,null,null,null,null,null,null,"","",""]
[null,null,null,null,null,null,null,null,null,null,null,null,null,null,null,null,null,"","",""]
[null,null,null,null,null,null,null,null,null,null,null,null,null,null,null,null,null,"","",""]
[null,null,null,null,null,null,null,null,null,null,null,null,null,null,null,null,null,"","",""]
[null,null,null,null,null,null,null,null,null,null,null,null,null,null,null,null,null,"","",""]
[null,null,null,null,null,null,null,null,null,null,null,null,null,null,null,null,null,"","",""]
[null,null,null,null,null,null,null,null,null,null,null,null,null,null,null,null,null,"","",""]
[null,null,null,null,null,null,null,null,null,null,null,null,null,null,null,null,null,"","",""]
[null,null,null,null,null,null,null,null,null,null,null,null,null,null,null,null,null,"","",""]
[null,null,null,null,null,null,null,null,null,null,null,null,null,null,null,null,null,"","",""]
[null,null,null,null,null,null,null,null,null,null,null,null,null,null,null,null,null,"","",""]
[null,null,null,null,null,null,null,null,null,null,null,null,null,null,null,null,null,"","",""]
[null,null,null,null,null,null,null,null,null,null,null,null,null,null,null,null,null,"","",""]
[null,null,null,null,null,null,null,null,null,null,null,null,null,null,null,null,null,"","",""]
[null,null,null,null,null,null,null,null,null,null,null,null,null,null,null,null,null,"","",""]
[null,null,null,null,null,null,null,null,null,null,null,null,null,null,null,null,null,"","",""]
[null,null,null,null,null,null,null,null,null,null,null,null,null,null,null,null,null,"","",""]
[null,null,null,null,null,null,null,null,null,null,null,null,null,null,null,null,null,"","",""]
[null,null,null,null,null,null,null,null,null,null,null,null,null,null,null,null,null,"","",""]
[null,null,null,null,null,null,null,null,null,null,null,null,null,null,null,null,null,"","",""]
[null,null,null,null,null,null,null,null,null,null,null,null,null,null,null,null,null,"","",""]
[null,null,null,null,null,null,null,null,null,null,null,null,null,null,null,null,null,"","",""]
[null,null,null,null,null,null,null,null,null,null,null,null,null,null,null,null,null,"","",""]
[null,null,null,null,null,null,null,null,null,null,null,null,null,null,null,null,null,"","",""]
[null,null,null,null,null,null,null,null,null,null,null,null,null,null,null,null,null,"","",""]
[null,null,null,null,null,null,null,null,null,null,null,null,null,null,null,null,null,"","",""]
[null,null,null,null,null,null,null,null,null,null,null,null,null,null,null,null,null,"","",""]
[null,null,null,null,null,null,null,null,null,null,null,null,null,null,null,null,null,"","",""]
[null,null,null,null,null,null,null,null,null,null,null,null,null,null,null,null,null,"","",""]
[null,null,null,null,null,null,null,null,null,null,null,null,null,null,null,null,null,"","",""]
[null,null,null,null,null,null,null,null,null,null,null,null,null,null,null,null,null,"","",""]
[null,null,null,null,null,null,null,null,null,null,null,null,null,null,null,null,null,"","",""]
[null,null,null,null,null,null,null,null,null,null,null,null,null,null,null,null,null,"","",""]
[null,null,null,null,null,null,null,null,null,null,null,null,null,null,null,null,null,"","",""]
[null,null,null,null,null,null,null,null,null,null,null,null,null,null,null,null,null,"","",""]
[null,null,null,null,null,null,null,null,null,null,null,null,null,null,null,null,null,"","",""]
[null,null,null,null,null,null,null,null,null,null,null,null,null,null,null,null,null,"","",""]
[null,null,null,null,null,null,null,null,null,null,null,null,null,null,null,null,null,"","",""]
[null,null,null,null,null,null,null,null,null,null,null,null,null,null,null,null,null,"","",""]
[null,null,null,null,null,null,null,null,null,null,null,null,null,null,null,null,null,"","",""]
[null,null,null,null,null,null,null,null,null,null,null,null,null,null,null,null,null,"","",""]
[null,null,null,null,null,null,null,null,null,null,null,null,null,null,null,null,null,"","",""]
[null,null,null,null,null,null,null,null,null,null,null,null,null,null,null,null,null,"","",""]
[null,null,null,null,null,null,null,null,null,null,null,null,null,null,null,null,null,"","",""]
[null,null,null,null,null,null,null,null,null,null,null,null,null,null,null,null,null,"","",""]
[null,null,null,null,null,null,null,null,null,null,null,null,null,null,null,null,null,"","",""]
[null,null,null,null,null,null,null,null,null,null,null,null,null,null,null,null,null,"","",""]
[null,null,null,null,null,null,null,null,null,null,null,null,null,null,null,null,null,"","",""]
[null,null,null,null,null,null,null,null,null,null,null,null,null,null,null,null,null,"","",""]
[null,null,null,null,null,null,null,null,null,null,null,null,null,null,null,null,null,"","",""]
[null,null,null,null,null,null,null,null,null,null,null,null,null,null,null,null,null,"","",""]
[null,null,null,null,null,null,null,null,null,null,null,null,null,null,null,null,null,"","",""]
[null,null,null,null,null,null,null,null,null,null,null,null,null,null,null,null,null,{"$f":"IF(L963=\"\",\"\",L963-O963)","v":""},{"$f":"IF(M963=\"\",\"\",M963-P963)","v":""},{"$f":"IF(N963=\"\",\"\",N963-Q963)","v":""}]
[null,null,null,null,null,null,null,null,null,null,null,null,null,null,null,null,null,"","",""]
[null,null,null,null,null,null,null,null,null,null,null,null,null,null,null,null,null,"","",""]
[null,null,null,null,null,null,null,null,null,null,null,null,null,null,null,null,null,"","",""]
[null,null,null,null,null,null,null,null,null,null,null,null,null,null,null,null,null,"","",""]
[null,null,null,null,null,null,null,null,null,null,null,null,null,null,null,null,null,"","",""]
[null,null,null,null,null,null,null,null,null,null,null,null,null,null,null,null,null,"","",""]
[null,null,null,null,null,null,null,null,null,null,null,null,null,null,null,null,null,"","",""]
[null,null,null,null,null,null,null,null,null,null,null,null,null,null,null,null,null,"","",""]
[null,null,null,null,null,null,null,null,null,null,null,null,null,null,null,null,null,"","",""]
[null,null,null,null,null,null,null,null,null,null,null,null,null,null,null,null,null,"","",""]
[null,null,null,null,null,null,null,null,null,null,null,null,null,null,null,null,null,"","",""]
[null,null,null,null,null,null,null,null,null,null,null,null,null,null,null,null,null,"","",""]
[null,null,null,null,null,null,null,null,null,null,null,null,null,null,null,null,null,"","",""]
[null,null,null,null,null,null,null,null,null,null,null,null,null,null,null,null,null,"","",""]
[null,null,null,null,null,null,null,null,null,null,null,null,null,null,null,null,null,"","",""]
[null,null,null,null,null,null,null,null,null,null,null,null,null,null,null,null,null,"","",""]
[null,null,null,null,null,null,null,null,null,null,null,null,null,null,null,null,null,"","",""]
[null,null,null,null,null,null,null,null,null,null,null,null,null,null,null,null,null,"","",""]
[null,null,null,null,null,null,null,null,null,null,null,null,null,null,null,null,null,"","",""]
[null,null,null,null,null,null,null,null,null,null,null,null,null,null,null,null,null,"","",""]
[null,null,null,null,null,null,null,null,null,null,null,null,null,null,null,null,null,"","",""]
[null,null,null,null,null,null,null,null,null,null,null,null,null,null,null,null,null,"","",""]
[null,null,null,null,null,null,null,null,null,null,null,null,null,null,null,null,null,"","",""]
[null,null,null,null,null,null,null,null,null,null,null,null,null,null,null,null,null,"","",""]
[null,null,null,null,null,null,null,null,null,null,null,null,null,null,null,null,null,"","",""]
[null,null,null,null,null,null,null,null,null,null,null,null,null,null,null,null,null,"","",""]
[null,null,null,null,null,null,null,null,null,null,null,null,null,null,null,null,null,"","",""]
[null,null,null,null,null,null,null,null,null,null,null,null,null,null,null,null,null,"","",""]
[null,null,null,null,null,null,null,null,null,null,null,null,null,null,null,null,null,"","",""]
[null,null,null,null,null,null,null,null,null,null,null,null,null,null,null,null,null,"","",""]
[null,null,null,null,null,null,null,null,null,null,null,null,null,null,null,null,null,"","",""]
[null,null,null,null,null,null,null,null,null,null,null,null,null,null,null,null,null,"","",""]
[null,null,null,null,null,null,null,null,null,null,null,null,null,null,null,null,null,"","",""]
[null,null,null,null,null,null,null,null,null,null,null,null,null,null,null,null,null,"","",""]
[null,null,null,null,null,null,null,null,null,null,null,null,null,null,null,null,null,"","",""]
[null,null,null,null,null,null,null,null,null,null,null,null,null,null,null,null,null,"","",""]
[null,null,null,null,null,null,null,null,null,null,null,null,null,null,null,null,null,"","",""]

{"sheet":"Дома","index":2,"n_rows":150,"n_cols":43,"rows_kept":150,"cut":false,"hidden":true,"merged":[]}
["Чемпионат","Дата/Время","Дома","Гости","К1 в 1Т","К2 в 1Т","К1 во 2Т","К2 во 2Т","Где играли","К1 Голов","К2 Голов","Забито","Пропущено","Результат","Всего Игр","Всего выиграно","Всего ничьих","Всего проиграно","Всего забито","Всего пропущено","Всего очков","Дома игр","Дома выиграно","Дома ничьих","Дома проиграно","Дома забито","Дома пропущено","Дома очков","Гости игр","Гости выиграно","Гости ничьих","Гости проиграно","Гости забито","Гости пропущено","Гости очков","Тотал",null,"1тз","1тп","2тз","2тп","Мз","Мп"]
["ИРАН: Первый дивизион","2021.06.01 18:15","Хуши-Талаи","Бадеран Тегеран",0,0,2,0,"Гости",{"$f":"IF(I2=\"\",\"\",E2+G2)","v":2},{"$f":"IF(I2=\"\",\"\",F2+H2)","v":0},{"$f":"IF(I2=\"\",\"\",IF(I2=\"Дома\",J2,K2))","v":0},{"$f":"IF(I2=\"\",\"\",IF(I2=\"Дома\",K2,J2))","v":2},{"$f":"IF(I2=\"\",\"\",IF(I2=\"Дома\",IF(J2>K2,\"В\",IF(J2=K2,\"Н\",\"П\")),IF(J2<K2,\"В\",IF(J2=K2,\"Н\",\"П\"))))","v":"П"},{"$f":"IF(I2=\"\",\"\",1)","v":1},{"$f":"IF(I2=\"\",\"\",IF(N2=\"В\",1,0))","v":0},{"$f":"IF(I2=\"\",\"\",IF(N2=\"Н\",1,0))","v":0},{"$f":"IF(I2=\"\",\"\",IF(N2=\"П\",1,0))","v":1},{"$f":"IF(I2=\"\",\"\",L2)","v":0},{"$f":"IF(I2=\"\",\"\",M2)","v":2},{"$f":"IF(I2=\"\",\"\",P2*3+Q2)","v":0},{"$f":"IF(I2=\"\",\"\",IF(I2=\"Дома\",1,0))","v":0},{"$f":"IF(I2=\"\",\"\",IF(I2=\"Дома\",IF(N2=\"В\",1,0),0))","v":0},{"$f":"IF(I2=\"\",\"\",IF(I2=\"Дома\",IF(N2=\"Н\",1,0),0))","v":0},{"$f":"IF(I2=\"\",\"\",IF(I2=\"Дома\",IF(N2=\"П\",1,0),0))","v":0},{"$f":"IF(I2=\"\",\"\",IF(I2=\"Дома\",L2,0))","v":0},{"$f":"IF(I2=\"\",\"\",IF(I2=\"Дома\",M2,0))","v":0},{"$f":"IF(I2=\"\",\"\",IF(I2=\"Дома\",W2*3+X2,0))","v":0},{"$f":"IF(I2=\"\",\"\",IF(I2=\"Гости\",1,0))","v":1},{"$f":"IF(I2=\"\",\"\",IF(I2=\"Гости\",IF(N2=\"В\",1,0),0))","v":0},{"$f":"IF(I2=\"\",\"\",IF(I2=\"Гости\",IF(N2=\"Н\",1,0),0))","v":0},{"$f":"IF(I2=\"\",\"\",IF(I2=\"Гости\",IF(N2=\"П\",1,0),0))","v":1},{"$f":"IF(I2=\"\",\"\",IF(I2=\"Гости\",L2,0))","v":0},{"$f":"IF(I2=\"\",\"\",IF(I2=\"Гости\",M2,0))","v":2},{"$f":"IF(I2=\"\",\"\",IF(I2=\"Гости\",AD2*3+AE2,0))","v":0},{"$f":"IF(I2=\"Дома\",L2+M2,\"\")","v":""},null,{"$f":"IF(I2=\"\",\"\",IF(I2=\"Дома\",E2,F2))","v":0},{"$f":"IF(I2=\"\",\"\",IF(I2=\"Дома\",F2,E2))","v":0},{"$f":"IF(I2=\"\",\"\",IF(I2=\"Дома\",G2,H2))","v":0},{"$f":"IF(I2=\"\",\"\",IF(I2=\"Дома\",H2,G2))","v":2},{"$f":"L2","v":0},{"$f":"M2","v":2}]
["ИРАН: Первый дивизион","2021.05.26 18:05","Бадеран Тегеран","Навад Урмия",0,0,1,0,"Дома",{"$f":"IF(I3=\"\",\"\",E3+G3)","v":1},{"$f":"IF(I3=\"\",\"\",F3+H3)","v":0},{"$f":"IF(I3=\"\",\"\",IF(I3=\"Дома\",J3,K3))","v":1},{"$f":"IF(I3=\"\",\"\",IF(I3=\"Дома\",K3,J3))","v":0},{"$f":"IF(I3=\"\",\"\",IF(I3=\"Дома\",IF(J3>K3,\"В\",IF(J3=K3,\"Н\",\"П\")),IF(J3<K3,\"В\",IF(J3=K3,\"Н\",\"П\"))))","v":"В"},{"$f":"IF(I3=\"\",\"\",O2+1)","v":2},{"$f":"IF(I3=\"\",\"\",IF(N3=\"В\",P2+1,P2))","v":1},{"$f":"IF(I3=\"\",\"\",IF(N3=\"Н\",Q2+1,Q2))","v":0},{"$f":"IF(I3=\"\",\"\",IF(N3=\"П\",R2+1,R2))","v":1},{"$f":"IF(I3=\"\",\"\",S2+L3)","v":1},{"$f":"IF(I3=\"\",\"\",T2+M3)","v":2},{"$f":"IF(I3=\"\",\"\",P3*3+Q3)","v":3},{"$f":"IF(I3=\"\",\"\",IF(I3=\"Дома\",V2+1,V2+0))","v":1},{"$f":"IF(I3=\"\",\"\",IF(I3=\"Дома\",IF(N3=\"В\",W2+1,W2),W2))","v":1},{"$f":"IF(I3=\"\",\"\",IF(I3=\"Дома\",IF(N3=\"Н\",X2+1,X2),X2))","v":0},{"$f":"IF(I3=\"\",\"\",IF(I3=\"Дома\",IF(N3=\"П\",Y2+1,Y2),Y2))","v":0},{"$f":"IF(I3=\"\",\"\",IF(I3=\"Дома\",L3+Z2,Z2))","v":1},{"$f":"IF(I3=\"\",\"\",IF(I3=\"Дома\",M3+AA2,AA2))","v":0},{"$f":"IF(I3=\"\",\"\",IF(I3=\"Дома\",W3*3+X3,AB2))","v":3},{"$f":"IF(I3=\"\",\"\",IF(I3=\"Гости\",AC2+1,AC2+0))","v":1},{"$f":"IF(I3=\"\",\"\",IF(I3=\"Гости\",IF(N3=\"В\",AD2+1,AD2),AD2))","v":0},{"$f":"IF(I3=\"\",\"\",IF(I3=\"Гости\",IF(N3=\"Н\",AE2+1,AE2),AE2))","v":0},{"$f":"IF(I3=\"\",\"\",IF(I3=\"Гости\",IF(N3=\"П\",AF2+1,AF2),AF2))","v":1},{"$f":"IF(I3=\"\",\"\",IF(I3=\"Гости\",L3+AG2,AG2))","v":0},{"$f":"IF(I3=\"\",\"\",IF(I3=\"Гости\",M3+AH2,AH2))","v":2},{"$f":"IF(I3=\"\",\"\",IF(I3=\"Гости\",AD3*3+AE3,AI2))","v":0},{"$f":"IF(I3=\"Дома\",L3+M3,\"\")","v":1},null,{"$f":"IF(I3=\"\",\"\",IF(I3=\"Дома\",E3,F3))","v":0},{"$f":"IF(I3=\"\",\"\",IF(I3=\"Дома\",F3,E3))","v":0},{"$f":"IF(I3=\"\",\"\",IF(I3=\"Дома\",G3,H3))","v":1},{"$f":"IF(I3=\"\",\"\",IF(I3=\"Дома\",H3,G3))","v":0},{"$f":"L3","v":1},{"$f":"M3","v":0}]
["ИРАН: Первый дивизион","2021.05.20 18:45","Шахин Бушехр","Бадеран Тегеран",1,1,1,0,"Гости",2,1,1,2,"П",3,{"$f":"IF(I4=\"\",\"\",IF(N4=\"В\",P3+1,P3))","v":1},{"$f":"IF(I4=\"\",\"\",IF(N4=\"Н\",Q3+1,Q3))","v":0},{"$f":"IF(I4=\"\",\"\",IF(N4=\"П\",R3+1,R3))","v":2},{"$f":"IF(I4=\"\",\"\",S3+L4)","v":2},{"$f":"IF(I4=\"\",\"\",T3+M4)","v":4},3,{"$f":"IF(I4=\"\",\"\",IF(I4=\"Дома\",V3+1,V3+0))","v":1},{"$f":"IF(I4=\"\",\"\",IF(I4=\"Дома\",IF(N4=\"В\",W3+1,W3),W3))","v":1},{"$f":"IF(I4=\"\",\"\",IF(I4=\"Дома\",IF(N4=\"Н\",X3+1,X3),X3))","v":0},{"$f":"IF(I4=\"\",\"\",IF(I4=\"Дома\",IF(N4=\"П\",Y3+1,Y3),Y3))","v":0},{"$f":"IF(I4=\"\",\"\",IF(I4=\"Дома\",L4+Z3,Z3))","v":1},{"$f":"IF(I4=\"\",\"\",IF(I4=\"Дома\",M4+AA3,AA3))","v":0},{"$f":"IF(I4=\"\",\"\",IF(I4=\"Дома\",W4*3+X4,AB3))","v":3},{"$f":"IF(I4=\"\",\"\",IF(I4=\"Гости\",AC3+1,AC3+0))","v":2},{"$f":"IF(I4=\"\",\"\",IF(I4=\"Гости\",IF(N4=\"В\",AD3+1,AD3),AD3))","v":0},{"$f":"IF(I4=\"\",\"\",IF(I4=\"Гости\",IF(N4=\"Н\",AE3+1,AE3),AE3))","v":0},{"$f":"IF(I4=\"\",\"\",IF(I4=\"Гости\",IF(N4=\"П\",AF3+1,AF3),AF3))","v":2},{"$f":"IF(I4=\"\",\"\",IF(I4=\"Гости\",L4+AG3,AG3))","v":1},{"$f":"IF(I4=\"\",\"\",IF(I4=\"Гости\",M4+AH3,AH3))","v":4},{"$f":"IF(I4=\"\",\"\",IF(I4=\"Гости\",AD4*3+AE4,AI3))","v":0},"",null,1,1,0,1,1,2]
["ИРАН: Первый дивизион","2021.05.14 16:45","Бадеран Тегеран","Гол Рейхан",2,1,0,0,"Дома",2,1,2,1,"В",4,2,0,2,4,5,6,2,2,0,0,3,1,6,2,0,0,2,1,4,0,3,null,2,1,0,0,2,1]
["ИРАН: Первый дивизион","2021.05.08 18:45","Могхавемат","Бадеран Тегеран",0,1,1,1,"Гости",1,2,2,1,"В",5,3,0,2,6,6,9,2,2,0,0,3,1,6,3,1,0,2,3,5,3,"",null,1,0,1,1,2,1]
["ИРАН: Первый дивизион","2021.04.26 18:45","Бадеран Тегеран","Хавадар",0,1,0,1,"Дома",0,2,0,2,"П",6,3,0,3,6,8,9,3,2,0,1,3,3,6,3,1,0,2,3,5,3,2]
["ИРАН: Первый дивизион","2021.04.19 18:45","Астара","Бадеран Тегеран",0,1,0,2,"Гости",0,3,3,0,"В",7,4,0,3,9,8,12,3,2,0,1,3,3,6,4,2,0,2,6,5,6,"",null,{"$f":"SUM(AL2:AL6)/5","v":0.8},{"$f":"SUM(AM2:AM6)/5","v":0.4},0.4,0.8,1.2,1.2]
["ИРАН: Первый дивизион","2021.04.13 15:00","Бадеран Тегеран","Арман Гохар",2,0,0,0,"Дома",2,0,2,0,{"$f":"IF(I9=\"\",\"\",IF(I9=\"Дома\",IF(J9>K9,\"В\",IF(J9=K9,\"Н\",\"П\")),IF(J9<K9,\"В\",IF(J9=K9,\"Н\",\"П\"))))","v":"В"},8,5,0,3,11,8,15,4,3,0,1,5,3,9,4,2,0,2,6,5,6,2]
["ИРАН: Первый дивизион","2021.04.07 15:00","Хейбар Хоррамабад","Бадеран Тегеран",0,0,1,0,"Гости",1,0,0,1,{"$f":"IF(I10=\"\",\"\",IF(I10=\"Дома\",IF(J10>K10,\"В\",IF(J10=K10,\"Н\",\"П\")),IF(J10<K10,\"В\",IF(J10=K10,\"Н\",\"П\"))))","v":"П"},9,5,0,4,11,9,15,4,3,0,1,5,3,9,5,2,0,3,6,6,6,""]
["ИРАН: Первый дивизион","2021.03.14 14:30","Бадеран Тегеран","Эстеглал Хузестан",0,0,0,0,"Дома",0,0,0,0,"Н",10,5,1,4,11,9,16,5,3,1,1,5,3,10,5,2,0,3,6,6,6,0]
["ИРАН: Первый дивизион","2021.03.07 14:15","Бадеран Тегеран","Малаван",1,0,2,0,"Дома",3,0,3,0,"В",11,6,1,4,14,9,{"$f":"IF(I12=\"\",\"\",P12*3+Q12)","v":19},6,4,1,1,8,3,13,5,2,0,3,6,6,6,3]
["ИРАН: Первый дивизион","2021.03.02 14:00","Райка Баболь","Бадеран Тегеран",0,2,3,0,"Гости",3,2,2,3,"П",12,6,1,5,16,12,19,6,4,1,1,8,3,13,6,2,0,4,8,9,6,""]
["ИРАН: Первый дивизион","2021.02.20 14:00","Бадеран Тегеран","Кашкай Шираз",1,1,0,2,"Дома",1,3,1,3,"П",13,6,1,6,17,15,19,7,4,1,2,9,6,13,6,2,0,4,8,9,6,4]
["ИРАН: Первый дивизион","2021.02.14 13:30","Чока Талеш","Бадеран Тегеран",1,1,1,3,"Гости",2,4,4,2,"В",14,7,1,6,21,17,22,7,4,1,2,9,6,13,7,3,0,4,12,11,9,""]
["ИРАН: Первый дивизион","2021.02.07 13:30","Бадеран Тегеран","Парс Джануби Джем",0,0,1,0,"Дома",1,0,1,0,"В",15,8,1,6,22,17,25,8,5,1,2,10,6,16,7,3,0,4,12,11,9,1]
["ИРАН: Первый дивизион","2021.02.01 13:30","Бадеран Тегеран","Мес Керман",1,1,1,0,"Дома",2,1,2,1,"В",16,9,1,6,24,18,28,9,6,1,2,12,7,19,7,3,0,4,12,11,9,3]
["ИРАН: Первый дивизион","2021.01.25 13:30","Эстеглал Моласани","Бадеран Тегеран",1,0,0,1,"Гости",1,1,1,1,"Н",17,9,2,6,25,19,29,9,6,1,2,12,7,19,8,3,1,4,13,12,10,""]
["ИРАН: Первый дивизион","2021.01.18 13:30","Бадеран Тегеран","Хуши-Талаи",1,1,0,0,"Дома",1,1,1,1,"Н",18,9,3,6,26,20,30,10,6,2,2,13,8,20,8,3,1,4,13,12,10,2]
["ИРАН: Первый дивизион","2021.01.11 13:30","Навад Урмия","Бадеран Тегеран",0,0,0,2,"Гости",0,2,2,0,"В",19,10,3,6,28,20,33,10,6,2,2,13,8,20,9,4,1,4,15,12,13,""]
["ИРАН: Первый дивизион","2021.01.04 13:30","Бадеран Тегеран","Шахин Бушехр",0,0,0,0,"Дома",0,0,0,0,"Н",20,10,4,6,28,20,34,11,6,3,2,13,8,21,9,4,1,4,15,12,13,0]
["ИРАН: Первый дивизион","2020.12.28 13:30","Гол Рейхан","Бадеран Тегеран",1,0,0,0,"Гости",1,0,0,1,"П",21,10,4,7,28,21,34,11,6,3,2,13,8,21,10,4,1,5,15,13,13,""]
["ИРАН: Первый дивизион","2020.12.22 13:30","Бадеран Тегеран","Могхавемат",0,0,0,1,"Дома",0,1,0,1,"П",22,10,4,8,28,22,34,12,6,3,3,13,9,21,10,4,1,5,15,13,13,1]
["ИРАН: Первый дивизион","2020.12.16 13:30","Хавадар","Бадеран Тегеран",1,0,0,2,"Гости",1,2,2,1,"В",23,11,4,8,30,23,37,12,6,3,3,13,9,21,11,5,1,5,17,14,16,""]
["ИРАН: Первый дивизион","2020.12.10 13:30","Бадеран Тегеран","Астара",0,0,1,0,"Дома",1,0,1,0,"В",24,12,4,8,31,23,40,13,7,3,3,14,9,24,11,5,1,5,17,14,16,1]
["ИРАН: Первый дивизион","2020.12.05 13:45","Арман Гохар","Бадеран Тегеран",0,0,0,0,"Гости",0,0,0,0,"Н",25,12,5,8,31,23,41,13,7,3,3,14,9,24,12,5,2,5,17,14,17,""]
["ИРАН: Первый дивизион","2020.11.29 14:15","Бадеран Тегеран","Хейбар Хоррамабад",1,0,0,0,"Дома",1,0,1,0,"В",26,13,5,8,32,23,44,14,8,3,3,15,9,27,12,5,2,5,17,14,17,1]
["ИРАН: Первый дивизион","2020.11.22 15:00","Эстеглал Хузестан","Бадеран Тегеран",0,0,1,0,"Гости",1,0,0,1,"П",27,13,5,9,32,24,44,14,8,3,3,15,9,27,13,5,2,6,17,15,17,""]
["ИРАН: Первый дивизион","2020.08.16 18:30","Мес Рафсанжан","Бадеран Тегеран",0,1,1,0,"Гости",1,1,1,1,"Н",28,13,6,9,33,25,45,14,8,3,3,15,9,27,14,5,3,6,18,16,18,""]
["ИРАН: Первый дивизион","2020.08.08 18:30","Бадеран Тегеран","Сепидруд Рашт",0,0,1,0,"Дома",1,0,1,0,"В",29,14,6,9,34,25,48,15,9,3,3,16,9,30,14,5,3,6,18,16,18,1]
["ИРАН: Первый дивизион","2020.08.02 18:00","Бадеран Тегеран","Навад Урмия",1,0,1,0,"Дома",2,0,2,0,"В",30,15,6,9,36,25,51,16,10,3,3,18,9,33,14,5,3,6,18,16,18,2]
["ИРАН: Первый дивизион","2020.07.25 18:10","Гол Рейхан","Бадеран Тегеран",0,0,1,1,"Гости",1,1,1,1,"Н",31,15,7,9,37,26,52,16,10,3,3,18,9,33,15,5,4,6,19,17,19,""]
["ИРАН: Первый дивизион","2020.07.19 17:40","Бадеран Тегеран","Могхавемат",1,1,2,0,"Дома",3,1,3,1,"В",32,16,7,9,40,27,55,17,11,3,3,21,10,36,15,5,4,6,19,17,19,4]
["ИРАН: Первый дивизион","2020.07.12 18:20","Хуши-Талаи","Бадеран Тегеран",2,1,0,2,"Гости",2,3,3,2,"В",33,17,7,9,43,29,58,17,11,3,3,21,10,36,16,6,4,6,22,19,22,""]
["ИРАН: Первый дивизион","2020.07.06 18:20","Бадеран Тегеран","Мес Керман",0,0,1,2,"Дома",1,2,1,2,"П",{"$f":"IF(I35=\"\",\"\",O34+1)","v":34},17,7,10,44,31,58,18,11,3,4,22,12,36,16,6,4,6,22,19,22,3]
["ИРАН: Первый дивизион","2020.06.30 18:30","Малаван","Бадеран Тегеран",0,0,2,0,"Гости",2,0,0,2,"П",35,17,7,11,44,33,58,18,11,3,4,22,12,36,17,6,4,7,22,21,22,""]
["ИРАН: Первый дивизион","2020.02.28 12:00","Бадеран Тегеран","Damash Gilan",1,1,1,0,"Дома",2,1,2,1,"В",36,18,7,11,46,34,61,19,12,3,4,24,13,39,17,6,4,7,22,21,22,3]
["ИРАН: Первый дивизион","2020.02.23 13:45","Алюминиум Арак","Бадеран Тегеран",0,0,1,0,"Гости",1,0,0,1,"П",37,18,7,12,46,35,61,19,12,3,4,24,13,39,18,6,4,8,22,22,22,""]
["ИРАН: Первый дивизион","2020.02.16 13:45","Бадеран Тегеран","Кашкай Шираз",3,0,1,3,"Дома",4,3,4,3,"В",38,19,7,12,50,38,64,20,13,3,4,28,16,42,18,6,4,8,22,22,22,7]
["ИРАН: Первый дивизион","2020.02.08 13:30","Хавадар","Бадеран Тегеран",0,0,2,1,"Гости",2,1,1,2,"П",39,19,7,13,51,40,64,20,13,3,4,28,16,42,19,6,4,9,23,24,22,""]
["ИРАН: Первый дивизион","2020.02.02 13:30","Бадеран Тегеран","Арман Гохар",1,0,3,0,"Дома",4,0,4,0,"В",40,20,7,13,55,40,67,21,14,3,4,32,16,45,19,6,4,9,23,24,22,4]
[null,null,null,null,null,null,null,null,null,"","","","","","","","","","","","","","","","","","","","","","","","","","",""]
[null,null,null,null,null,null,null,null,null,"","","","","","","","","","","","","","","","","","","","","","","","","","",""]
[null,null,null,null,null,null,null,null,null,"","","","","","","","","","","","","","","","","","","","","","","","","","",""]
[null,null,null,null,null,null,null,null,null,"","","","","","","","","","","","","","","","","","","","","","","","","","",""]
[null,null,null,null,null,null,null,null,null,"","","","","","","","","","","","","","","","","","","","","","","","","","",""]
[null,null,null,null,null,null,null,null,null,"","","","","","","","","","","","","","","","","","","","","","","","","","",""]
[null,null,null,null,null,null,null,null,null,"","","","","","","","","","","","","","","","","","","","","","","","","","",""]
[null,null,null,null,null,null,null,null,null,"","","","","","","","","","","","","","","","","","","","","","","","","","",""]
[null,null,null,null,null,null,null,null,null,"","","","","","","","","","","","","","","","","","","","","","","","","","",""]
[null,null,null,null,null,null,null,null,null,"","","","","","","","","","","","","","","","","","","","","","","","","","",""]
[null,null,null,null,null,null,null,null,null,"","","","","","","","","","","","","","","","","","","","","","","","","","",""]
[null,null,null,null,null,null,null,null,null,"","","","","","","","","","","","","","","","","","","","","","","","","","",""]
[null,null,null,null,null,null,null,null,null,"","","","","","","","","","","","","","","","","","","","","","","","","","",""]
[null,null,null,null,null,null,null,null,null,"","","","","","","","","","","","","","","","","","","","","","","","","","",""]
[null,null,null,null,null,null,null,null,null,"","","","","","","","","","","","","","","","","","","","","","","","","","",""]
[null,null,null,null,null,null,null,null,null,"","","","","","","","","","","","","","","","","","","","","","","","","","",""]
[null,null,null,null,null,null,null,null,null,"","","","","","","","","","","","","","","","","","","","","","","","","","",""]
[null,null,null,null,null,null,null,null,null,"","","","","","","","","","","","","","","","","","","","","","","","","","",""]
[null,null,null,null,null,null,null,null,null,"","","","","","","","","","","","","","","","","","","","","","","","","","",""]
[null,null,null,null,null,null,null,null,null,"","","","","","","","","","","","","","","","","","","","","","","","","","",""]
[null,null,null,null,null,null,null,null,null,"","","","","","","","","","","","","","","","","","","","","","","","","","",""]
[null,null,null,null,null,null,null,null,null,"","","","","","","","","","","","","","","","","","","","","","","","","","",""]
[null,null,null,null,null,null,null,null,null,"","","","","","","","","","","","","","","","","","","","","","","","","","",""]
[null,null,null,null,null,null,null,null,null,"","","","","","","","","","","","","","","","","","","","","","","","","","",""]
[null,null,null,null,null,null,null,null,null,"","","","","","","","","","","","","","","","","","","","","","","","","","",""]
[null,null,null,null,null,null,null,null,null,{"$f":"IF(I67=\"\",\"\",E67+G67)","v":""},{"$f":"IF(I67=\"\",\"\",F67+H67)","v":""},{"$f":"IF(I67=\"\",\"\",IF(I67=\"Дома\",J67,K67))","v":""},{"$f":"IF(I67=\"\",\"\",IF(I67=\"Дома\",K67,J67))","v":""},"",{"$f":"IF(I67=\"\",\"\",O66+1)","v":""},"","","","","",{"$f":"IF(I67=\"\",\"\",P67*3+Q67)","v":""},"","","","","","","","","","","","","","",{"$f":"IF(I67=\"Дома\",L67+M67,\"\")","v":""}]
[null,null,null,null,null,null,null,null,null,"","","","","","",{"$f":"IF(I68=\"\",\"\",IF(N68=\"В\",P67+1,P67))","v":""},{"$f":"IF(I68=\"\",\"\",IF(N68=\"Н\",Q67+1,Q67))","v":""},{"$f":"IF(I68=\"\",\"\",IF(N68=\"П\",R67+1,R67))","v":""},{"$f":"IF(I68=\"\",\"\",S67+L68)","v":""},{"$f":"IF(I68=\"\",\"\",T67+M68)","v":""},"",{"$f":"IF(I68=\"\",\"\",IF(I68=\"Дома\",V67+1,V67+0))","v":""},{"$f":"IF(I68=\"\",\"\",IF(I68=\"Дома\",IF(N68=\"В\",W67+1,W67),W67))","v":""},{"$f":"IF(I68=\"\",\"\",IF(I68=\"Дома\",IF(N68=\"Н\",X67+1,X67),X67))","v":""},{"$f":"IF(I68=\"\",\"\",IF(I68=\"Дома\",IF(N68=\"П\",Y67+1,Y67),Y67))","v":""},{"$f":"IF(I68=\"\",\"\",IF(I68=\"Дома\",L68+Z67,Z67))","v":""},{"$f":"IF(I68=\"\",\"\",IF(I68=\"Дома\",M68+AA67,AA67))","v":""},{"$f":"IF(I68=\"\",\"\",IF(I68=\"Дома\",W68*3+X68,AB67))","v":""},{"$f":"IF(I68=\"\",\"\",IF(I68=\"Гости\",AC67+1,AC67+0))","v":""},{"$f":"IF(I68=\"\",\"\",IF(I68=\"Гости\",IF(N68=\"В\",AD67+1,AD67),AD67))","v":""},{"$f":"IF(I68=\"\",\"\",IF(I68=\"Гости\",IF(N68=\"Н\",AE67+1,AE67),AE67))","v":""},{"$f":"IF(I68=\"\",\"\",IF(I68=\"Гости\",IF(N68=\"П\",AF67+1,AF67),AF67))","v":""},{"$f":"IF(I68=\"\",\"\",IF(I68=\"Гости\",L68+AG67,AG67))","v":""},{"$f":"IF(I68=\"\",\"\",IF(I68=\"Гости\",M68+AH67,AH67))","v":""},{"$f":"IF(I68=\"\",\"\",IF(I68=\"Гости\",AD68*3+AE68,AI67))","v":""},""]
[null,null,null,null,null,null,null,null,null,"","","","","","","","","","","","","","","","","","","","","","","","","","",""]
[null,null,null,null,null,null,null,null,null,"","","","","","","","","","","","","","","","","","","","","","","","","","",""]
[null,null,null,null,null,null,null,null,null,"","","","","","","","","","","","","","","","","","","","","","","","","","",""]
[null,null,null,null,null,null,null,null,null,"","","","","","","","","","","","","","","","","","","","","","","","","","",""]
[null,null,null,null,null,null,null,null,null,"","","","","","","","","","","","","","","","","","","","","","","","","","",""]
[null,null,null,null,null,null,null,null,null,"","","","",{"$f":"IF(I74=\"\",\"\",IF(I74=\"Дома\",IF(J74>K74,\"В\",IF(J74=K74,\"Н\",\"П\")),IF(J74<K74,\"В\",IF(J74=K74,\"Н\",\"П\"))))","v":""},"","","","","","","","","","","","","","","","","","","","","",""]
[null,null,null,null,null,null,null,null,null,"","","","","","","","","","","","","","","","","","","","","","","","","","",""]
[null,null,null,null,null,null,null,null,null,"","","","","","","","","","","","","","","","","","","","","","","","","","",""]
[null,null,null,null,null,null,null,null,null,"","","","","","","","","","","","","","","","","","","","","","","","","","",""]
[null,null,null,null,null,null,null,null,null,"","","","","","","","","","","","","","","","","","","","","","","","","","",""]
[null,null,null,null,null,null,null,null,null,"","","","","","","","","","","","","","","","","","","","","","","","","","",""]
[null,null,null,null,null,null,null,null,null,"","","","","","","","","","","","","","","","","","","","","","","","","","",""]
[null,null,null,null,null,null,null,null,null,"","","","","","","","","","","","","","","","","","","","","","","","","","",""]
[null,null,null,null,null,null,null,null,null,"","","","","","","","","","","","","","","","","","","","","","","","","","",""]
[null,null,null,null,null,null,null,null,null,"","","","","","","","","","","","","","","","","","","","","","","","","","",""]
[null,null,null,null,null,null,null,null,null,"","","","","","","","","","","","","","","","","","","","","","","","","","",""]
[null,null,null,null,null,null,null,null,null,"","","","","","","","","","","","","","","","","","","","","","","","","","",""]
[null,null,null,null,null,null,null,null,null,"","","","","","","","","","","","","","","","","","","","","","","","","","",""]
[null,null,null,null,null,null,null,null,null,"","","","","","","","","","","","","","","","","","","","","","","","","","",""]
[null,null,null,null,null,null,null,null,null,"","","","","","","","","","","","","","","","","","","","","","","","","","",""]
[null,null,null,null,null,null,null,null,null,"","","","","","","","","","","","","","","","","","","","","","","","","","",""]
[null,null,null,null,null,null,null,null,null,"","","","","","","","","","","","","","","","","","","","","","","","","","",""]
[null,null,null,null,null,null,null,null,null,"","","","","","","","","","","","","","","","","","","","","","","","","","",""]
[null,null,null,null,null,null,null,null,null,"","","","","","","","","","","","","","","","","","","","","","","","","","",""]
[null,null,null,null,null,null,null,null,null,"","","","","","","","","","","","","","","","","","","","","","","","","","",""]
[null,null,null,null,null,null,null,null,null,"","","","","","","","","","","","","","","","","","","","","","","","","","",""]
[null,null,null,null,null,null,null,null,null,"","","","","","","","","","","","","","","","","","","","","","","","","","",""]
[null,null,null,null,null,null,null,null,null,"","","","","","","","","","","","","","","","","","","","","","","","","","",""]
[null,null,null,null,null,null,null,null,null,"","","","","","","","","","","","","","","","","","","","","","","","","","",""]
[null,null,null,null,null,null,null,null,null,"","","","","","","","","","","","","","","","","","","","","","","","","","",""]
[null,null,null,null,null,null,null,null,null,"","","","","",{"$f":"IF(I99=\"\",\"\",O98+1)","v":""},"","","","","","","","","","","","","","","","","","","","",""]
[null,null,null,null,null,null,null,null,null,"","","","","","","","","","","","","","","","","","","","","","","","","","",""]
[null,null,null,null,null,null,null,null,null,"","","","","","","","","","","","","","","","","","","","","","","","","","",""]
[null,null,null,null,null,null,null,null,null,"","","","","","","","","","","","","","","","","","","","","","","","","","",""]
[null,null,null,null,null,null,null,null,null,"","","","","","","","","","","","","","","","","","","","","","","","","","",""]
[null,null,null,null,null,null,null,null,null,"","","","","","","","","","","","","","","","","","","","","","","","","","",""]
[null,null,null,null,null,null,null,null,null,"","","","","","","","","","","","","","","","","","","","","","","","","","",""]
[null,null,null,null,null,null,null,null,null,"","","","","","","","","","","","","","","","","","","","","","","","","","",""]
[null,null,null,null,null,null,null,null,null,"","","","","","","","","","","","","","","","","","","","","","","","","","",""]
[null,null,null,null,null,null,null,null,null,"","","","","","","","","","","","","","","","","","","","","","","","","","",""]
[null,null,null,null,null,null,null,null,null,"","","","","","","","","","","","","","","","","","","","","","","","","","",""]
[null,null,null,null,null,null,null,null,null,"","","","","","","","","","","","","","","","","","","","","","","","","","",""]
[null,null,null,null,null,null,null,null,null,"","","","","","","","","","","","","","","","","","","","","","","","","","",""]
[null,null,null,null,null,null,null,null,null,"","","","","","","","","","","","","","","","","","","","","","","","","","",""]
[null,null,null,null,null,null,null,null,null,"","","","","","","","","","","","","","","","","","","","","","","","","","",""]
[null,null,null,null,null,null,null,null,null,"","","","","","","","","","","","","","","","","","","","","","","","","","",""]
[null,null,null,null,null,null,null,null,null,"","","","","","","","","","","","","","","","","","","","","","","","","","",""]
[null,null,null,null,null,null,null,null,null,"","","","","","","","","","","","","","","","","","","","","","","","","","",""]
[null,null,null,null,null,null,null,null,null,"","","","","","","","","","","","","","","","","","","","","","","","","","",""]
[null,null,null,null,null,null,null,null,null,"","","","","","","","","","","","","","","","","","","","","","","","","","",""]
[null,null,null,null,null,null,null,null,null,"","","","","","","","","","","","","","","","","","","","","","","","","","",""]
[null,null,null,null,null,null,null,null,null,"","","","","","","","","","","","","","","","","","","","","","","","","","",""]
[null,null,null,null,null,null,null,null,null,"","","","","","","","","","","","","","","","","","","","","","","","","","",""]
[null,null,null,null,null,null,null,null,null,"","","","","","","","","","","","","","","","","","","","","","","","","","",""]
[null,null,null,null,null,null,null,null,null,"","","","","","","","","","","","","","","","","","","","","","","","","","",""]
[null,null,null,null,null,null,null,null,null,"","","","","","","","","","","","","","","","","","","","","","","","","","",""]
[null,null,null,null,null,null,null,null,null,"","","","","","","","","","","","","","","","","","","","","","","","","","",""]
[null,null,null,null,null,null,null,null,null,"","","","","","","","","","","","","","","","","","","","","","","","","","",""]
[null,null,null,null,null,null,null,null,null,"","","","","","","","","","","","","","","","","","","","","","","","","","",""]
[null,null,null,null,null,null,null,null,null,"","","","","","","","","","","","","","","","","","","","","","","","","","",""]
[null,null,null,null,null,null,null,null,null,"","","","","","","","","","","","","","","","","","","","","","","","","","",""]
[null,null,null,null,null,null,null,null,null,"","","","","","","","","","","","","","","","","","","","","","","","","","",""]
[null,null,null,null,null,null,null,null,null,{"$f":"IF(I131=\"\",\"\",E131+G131)","v":""},{"$f":"IF(I131=\"\",\"\",F131+H131)","v":""},{"$f":"IF(I131=\"\",\"\",IF(I131=\"Дома\",J131,K131))","v":""},{"$f":"IF(I131=\"\",\"\",IF(I131=\"Дома\",K131,J131))","v":""},"",{"$f":"IF(I131=\"\",\"\",O130+1)","v":""},"","","","","",{"$f":"IF(I131=\"\",\"\",P131*3+Q131)","v":""},"","","","","","","","","","","","","","",{"$f":"IF(I131=\"Дома\",L131+M131,\"\")","v":""}]
[null,null,null,null,null,null,null,null,null,"","","","","","",{"$f":"IF(I132=\"\",\"\",IF(N132=\"В\",P131+1,P131))","v":""},{"$f":"IF(I132=\"\",\"\",IF(N132=\"Н\",Q131+1,Q131))","v":""},{"$f":"IF(I132=\"\",\"\",IF(N132=\"П\",R131+1,R131))","v":""},{"$f":"IF(I132=\"\",\"\",S131+L132)","v":""},{"$f":"IF(I132=\"\",\"\",T131+M132)","v":""},"",{"$f":"IF(I132=\"\",\"\",IF(I132=\"Дома\",V131+1,V131+0))","v":""},{"$f":"IF(I132=\"\",\"\",IF(I132=\"Дома\",IF(N132=\"В\",W131+1,W131),W131))","v":""},{"$f":"IF(I132=\"\",\"\",IF(I132=\"Дома\",IF(N132=\"Н\",X131+1,X131),X131))","v":""},{"$f":"IF(I132=\"\",\"\",IF(I132=\"Дома\",IF(N132=\"П\",Y131+1,Y131),Y131))","v":""},{"$f":"IF(I132=\"\",\"\",IF(I132=\"Дома\",L132+Z131,Z131))","v":""},{"$f":"IF(I132=\"\",\"\",IF(I132=\"Дома\",M132+AA131,AA131))","v":""},{"$f":"IF(I132=\"\",\"\",IF(I132=\"Дома\",W132*3+X132,AB131))","v":""},{"$f":"IF(I132=\"\",\"\",IF(I132=\"Гости\",AC131+1,AC131+0))","v":""},{"$f":"IF(I132=\"\",\"\",IF(I132=\"Гости\",IF(N132=\"В\",AD131+1,AD131),AD131))","v":""},{"$f":"IF(I132=\"\",\"\",IF(I132=\"Гости\",IF(N132=\"Н\",AE131+1,AE131),AE131))","v":""},{"$f":"IF(I132=\"\",\"\",IF(I132=\"Гости\",IF(N132=\"П\",AF131+1,AF131),AF131))","v":""},{"$f":"IF(I132=\"\",\"\",IF(I132=\"Гости\",L132+AG131,AG131))","v":""},{"$f":"IF(I132=\"\",\"\",IF(I132=\"Гости\",M132+AH131,AH131))","v":""},{"$f":"IF(I132=\"\",\"\",IF(I132=\"Гости\",AD132*3+AE132,AI131))","v":""},""]
[null,null,null,null,null,null,null,null,null,"","","","","","","","","","","","","","","","","","","","","","","","","","",""]
[null,null,null,null,null,null,null,null,null,"","","","","","","","","","","","","","","","","","","","","","","","","","",""]
[null,null,null,null,null,null,null,null,null,"","","","","","","","","","","","","","","","","","","","","","","","","","",""]
[null,null,null,null,null,null,null,null,null,"","","","","","","","","","","","","","","","","","","","","","","","","","",""]
[null,null,null,null,null,null,null,null,null,"","","","","","","","","","","","","","","","","","","","","","","","","","",""]
[null,null,null,null,null,null,null,null,null,"","","","",{"$f":"IF(I138=\"\",\"\",IF(I138=\"Дома\",IF(J138>K138,\"В\",IF(J138=K138,\"Н\",\"П\")),IF(J138<K138,\"В\",IF(J138=K138,\"Н\",\"П\"))))","v":""},"","","","","","","","","","","","","","","","","","","","","",""]
[null,null,null,null,null,null,null,null,null,"","","","","","","","","","","","","","","","","","","","","","","","","","",""]
[null,null,null,null,null,null,null,null,null,"","","","","","","","","","","","","","","","","","","","","","","","","","",""]
[null,null,null,null,null,null,null,null,null,"","","","","","","","","","","","","","","","","","","","","","","","","","",""]
[null,null,null,null,null,null,null,null,null,"","","","","","","","","","","","","","","","","","","","","","","","","","",""]
[null,null,null,null,null,null,null,null,null,"","","","","","","","","","","","","","","","","","","","","","","","","","",""]
[null,null,null,null,null,null,null,null,null,"","","","","","","","","","","","","","","","","","","","","","","","","","",""]
[null,null,null,null,null,null,null,null,null,"","","","","","","","","","","","","","","","","","","","","","","","","","",""]
[null,null,null,null,null,null,null,null,null,"","","","","","","","","","","","","","","","","","","","","","","","","","",""]
[null,null,null,null,null,null,null,null,null,"","","","","","","","","","","","","","","","","","","","","","","","","","",""]
[null,null,null,null,null,null,null,null,null,"","","","","","","","","","","","","","","","","","","","","","","","","","",""]
[null,null,null,null,null,null,null,null,null,"","","","","","","","","","","","","","","","","","","","","","","","","","",""]
[null,null,null,null,null,null,null,null,null,"","","","","","","","","","","","","","","","","","","","","","","","","","",""]

{"sheet":"Команда1","index":3,"n_rows":12,"n_cols":47,"rows_kept":12,"cut":false,"hidden":true,"merged":[[1,0,1,2],[1,3,1,4],[0,0,0,4],[0,34,0,37],[0,38,0,41],[0,13,0,19],[0,27,0,33],[0,20,0,26]]}
["Данные 10-и последних матчей 1 команды",null,null,null,null,null,null,null,null,null,null,null,null,"Всего",null,null,null,null,null,null,"Дома",null,null,null,null,null,null,"В гостях",null,null,null,null,null,null,"Забивают дома",null,null,null,"Забивают в гостях"]
["Команда - 1",null,null,{"$f":"IF(F3=F4,F3,IF(F3=G4,F3,G3))","v":"Бадеран Тегеран"},null,"Команда1","Команда2","Голы1","Голы2","Где играла","Результат","Забито","Пропущено","Игр","В","Н","П","Забито","Пропущено","Очки","Игр","В","Н","П","Забито","Пропущено","Очки","Игр","В","Н","П","Забито","Пропущено","Очки",0,1,2,"3+",0,1,2,"3+","Забивают","Пропускают","Рейтинг","Серия","Тотал"]
[{"$f":"Дома!B2","v":"2021.06.01 18:15"},{"$f":"Дома!A2","v":"ИРАН: Первый дивизион"},{"$f":"Дома!C2","v":"Хуши-Талаи"},{"$f":"Дома!D2","v":"Бадеран Тегеран"},{"$f":"CONCATENATE(Дома!E2,\"-\",Дома!F2)","v":"0-0"},{"$f":"C3","v":"Хуши-Талаи"},{"$f":"D3","v":"Бадеран Тегеран"},{"$f":"VALUE(LEFT(E3,FIND(\"-\",E3,1)-1))","v":0},{"$f":"VALUE(LEFT(RIGHT(E3,LEN(E3)-FIND(\"-\",E3,1)),2))","v":0},{"$f":"IF(F3=$D$2,\"Дома\",\"В гостях\")","v":"В гостях"},{"$f":"IF(J3=\"Дома\",IF(H3>I3,\"В\",IF(H3=I3,\"Н\",\"П\")),IF(H3<I3,\"В\",IF(H3=I3,\"Н\",\"П\")))","v":"Н"},{"$f":"IF(J3=\"Дома\",H3,I3)","v":0},{"$f":"IF(J3=\"Дома\",I3,H3)","v":0},1,{"$f":"IF(K3=\"В\",1,0)","v":0},{"$f":"IF(K3=\"Н\",1,0)","v":1},{"$f":"IF(K3=\"П\",1,0)","v":0},{"$f":"L3","v":0},{"$f":"M3","v":0},{"$f":"O3*3+P3","v":1},{"$f":"IF(J3=\"Дома\",1,0)","v":0},{"$f":"IF(J3=\"Дома\",IF(K3=\"В\",1,0),0)","v":0},{"$f":"IF(J3=\"Дома\",IF(K3=\"Н\",1,0),0)","v":0},{"$f":"IF(J3=\"Дома\",IF(K3=\"П\",1,0),0)","v":0},{"$f":"IF(J3=\"Дома\",L3,0)","v":0},{"$f":"IF(J3=\"Дома\",M3,0)","v":0},{"$f":"V3*3+W3","v":0},{"$f":"IF(J3<>\"Дома\",1,0)","v":1},{"$f":"IF(J3<>\"Дома\",IF(K3=\"В\",1,0),0)","v":0},{"$f":"IF(J3<>\"Дома\",IF(K3=\"Н\",1,0),0)","v":1},{"$f":"IF(J3<>\"Дома\",IF(K3=\"П\",1,0),0)","v":0},{"$f":"IF(J3<>\"Дома\",L3,0)","v":0},{"$f":"IF(J3<>\"Дома\",M3,0)","v":0},{"$f":"AC3*3+AD3","v":1},{"$f":"IF(J3=\"Дома\",IF(L3=0,1,0),0)","v":0},{"$f":"IF(J3=\"Дома\",IF(L3=1,1,0),0)","v":0},{"$f":"IF(J3=\"Дома\",IF(L3=2,1,0),0)","v":0},{"$f":"IF(J3=\"Дома\",IF(L3>=3,1,0),0)","v":0},{"$f":"IF(J3<>\"Дома\",IF(L3=0,1,0),0)","v":1},{"$f":"IF(J3<>\"Дома\",IF(L3=1,1,0),0)","v":0},{"$f":"IF(J3<>\"Дома\",IF(L3=2,1,0),0)","v":0},{"$f":"IF(J3<>\"Дома\",IF(L3>=3,1,0),0)","v":0},{"$f":"R3/N3","v":0},{"$f":"S3/N3","v":0},{"$f":"(AA3/IF(U3<1,1,U3)+AH3/IF(AB3<1,1,AB3)*1.5+Y3/IF(U3<1,1,U3)+AF3/IF(AB3<1,1,AB3)*1.5-Z3/IF(U3<1,1,U3)*1.5-AG3/IF(AB3<1,1,AB3))/15","v":0.1},{"$f":"IF(J3=\"Дома\",IF(K3=\"В\",\"В\",IF(K3=\"Н\",\"Н\",\"П\")),\"\")","v":""},{"$f":"IF(J3=\"Дома\",L3+M3,\"\")","v":""}]
[{"$f":"Дома!B3","v":"2021.05.26 18:05"},{"$f":"Дома!A3","v":"ИРАН: Первый дивизион"},{"$f":"Дома!C3","v":"Бадеран Тегеран"},{"$f":"Дома!D3","v":"Навад Урмия"},{"$f":"CONCATENATE(Дома!E3,\"-\",Дома!F3)","v":"0-0"},"Бадеран Тегеран","Навад Урмия",0,0,"Дома","Н",0,0,{"$f":"N3+1","v":2},{"$f":"IF(K4=\"В\",O3+1,O3+0)","v":0},{"$f":"IF(K4=\"Н\",P3+1,P3+0)","v":2},{"$f":"IF(K4=\"П\",Q3+1,Q3+0)","v":0},{"$f":"L4+R3","v":0},{"$f":"M4+S3","v":0},2,{"$f":"IF(J4=\"Дома\",U3+1,U3+0)","v":1},{"$f":"IF(J4=\"Дома\",IF(K4=\"В\",V3+1,V3+0),V3+0)","v":0},{"$f":"IF(J4=\"Дома\",IF(K4=\"Н\",W3+1,W3+0),W3+0)","v":1},{"$f":"IF(J4=\"Дома\",IF(K4=\"П\",X3+1,X3+0),X3+0)","v":0},{"$f":"IF(J4=\"Дома\",Y3+L4,Y3+0)","v":0},{"$f":"IF(J4=\"Дома\",Z3+M4,Z3+0)","v":0},1,{"$f":"IF(J4<>\"Дома\",AB3+1,AB3+0)","v":1},{"$f":"IF(J4<>\"Дома\",IF(K4=\"В\",AC3+1,AC3+0),AC3+0)","v":0},{"$f":"IF(J4<>\"Дома\",IF(K4=\"Н\",AD3+1,AD3+0),AD3+0)","v":1},{"$f":"IF(J4<>\"Дома\",IF(K4=\"П\",AE3+1,AE3+0),AE3+0)","v":0},{"$f":"IF(J4<>\"Дома\",AF3+L4,AF3+0)","v":0},{"$f":"IF(J4<>\"Дома\",AG3+M4,AG3+0)","v":0},1,{"$f":"IF(J4=\"Дома\",IF(L4=0,AI3+1,AI3),AI3)","v":1},{"$f":"IF(J4=\"Дома\",IF(L4=1,AJ3+1,AJ3),AJ3)","v":0},{"$f":"IF(J4=\"Дома\",IF(L4=2,AK3+1,AK3),AK3)","v":0},{"$f":"IF(J4=\"Дома\",IF(L4>=3,AL3+1,AL3),AL3)","v":0},{"$f":"IF(J4<>\"Дома\",IF(L4=0,AM3+1,AM3),AM3)","v":1},{"$f":"IF(J4<>\"Дома\",IF(L4=1,AN3+1,AN3),AN3)","v":0},{"$f":"IF(J4<>\"Дома\",IF(L4=2,AO3+1,AO3),AO3)","v":0},{"$f":"IF(J4<>\"Дома\",IF(L4>=3,AP3+1,AP3),AP3)","v":0},0,0,0.16666666666666666,"Н",0]
[{"$f":"Дома!B4","v":"2021.05.20 18:45"},{"$f":"Дома!A4","v":"ИРАН: Первый дивизион"},{"$f":"Дома!C4","v":"Шахин Бушехр"},{"$f":"Дома!D4","v":"Бадеран Тегеран"},{"$f":"CONCATENATE(Дома!E4,\"-\",Дома!F4)","v":"1-1"},"Шахин Бушехр","Бадеран Тегеран",1,1,"В гостях","Н",1,1,3,0,3,0,1,1,3,1,0,1,0,0,0,1,2,0,2,0,1,1,2,1,0,0,0,1,1,0,0,0.33333333333333331,0.33333333333333331,0.18333333333333332,"",""]
[{"$f":"Дома!B5","v":"2021.05.14 16:45"},{"$f":"Дома!A5","v":"ИРАН: Первый дивизион"},{"$f":"Дома!C5","v":"Бадеран Тегеран"},{"$f":"Дома!D5","v":"Гол Рейхан"},{"$f":"CONCATENATE(Дома!E5,\"-\",Дома!F5)","v":"2-1"},"Бадеран Тегеран","Гол Рейхан",2,1,"Дома","В",2,1,4,1,3,0,3,2,6,2,1,1,0,2,1,4,2,0,2,0,1,1,2,1,0,1,0,1,1,0,0,0.75,0.5,0.26666666666666666,"В",3]
[{"$f":"Дома!B6","v":"2021.05.08 18:45"},{"$f":"Дома!A6","v":"ИРАН: Первый дивизион"},{"$f":"Дома!C6","v":"Могхавемат"},{"$f":"Дома!D6","v":"Бадеран Тегеран"},{"$f":"CONCATENATE(Дома!E6,\"-\",Дома!F6)","v":"0-1"},"Могхавемат","Бадеран Тегеран",0,1,"В гостях","В",1,0,5,2,3,0,4,2,9,2,1,1,0,2,1,4,3,1,2,0,2,1,5,1,0,1,0,1,2,0,0,0.8,0.4,0.3611111111111111,"",""]
[{"$f":"Дома!B7","v":"2021.04.26 18:45"},{"$f":"Дома!A7","v":"ИРАН: Первый дивизион"},{"$f":"Дома!C7","v":"Бадеран Тегеран"},{"$f":"Дома!D7","v":"Хавадар"},{"$f":"CONCATENATE(Дома!E7,\"-\",Дома!F7)","v":"0-1"},"Бадеран Тегеран","Хавадар",0,1,"Дома","П",0,1,6,2,3,1,4,3,9,3,1,1,1,2,2,4,3,1,2,0,2,1,5,2,0,1,0,1,2,0,0,0.66666666666666663,0.5,0.27777777777777779,"П",1]
[{"$f":"Дома!B8","v":"2021.04.19 18:45"},{"$f":"Дома!A8","v":"ИРАН: Первый дивизион"},{"$f":"Дома!C8","v":"Астара"},{"$f":"Дома!D8","v":"Бадеран Тегеран"},{"$f":"CONCATENATE(Дома!E8,\"-\",Дома!F8)","v":"0-1"},"Астара","Бадеран Тегеран",0,1,"В гостях","В",1,0,7,3,3,1,5,3,12,3,1,1,1,2,2,4,4,2,2,0,3,1,8,2,0,1,0,1,3,0,0,0.7142857142857143,0.42857142857142855,0.32500000000000001,"",""]
[{"$f":"Дома!B9","v":"2021.04.13 15:00"},{"$f":"Дома!A9","v":"ИРАН: Первый дивизион"},{"$f":"Дома!C9","v":"Бадеран Тегеран"},{"$f":"Дома!D9","v":"Арман Гохар"},{"$f":"CONCATENATE(Дома!E9,\"-\",Дома!F9)","v":"2-0"},"Бадеран Тегеран","Арман Гохар",2,0,"Дома","В",2,0,8,4,3,1,7,3,15,4,2,1,1,4,2,7,4,2,2,0,3,1,8,2,0,2,0,1,3,0,0,0.875,0.375,0.39166666666666666,"В",2]
[{"$f":"Дома!B10","v":"2021.04.07 15:00"},{"$f":"Дома!A10","v":"ИРАН: Первый дивизион"},{"$f":"Дома!C10","v":"Хейбар Хоррамабад"},{"$f":"Дома!D10","v":"Бадеран Тегеран"},{"$f":"CONCATENATE(Дома!E10,\"-\",Дома!F10)","v":"0-0"},"Хейбар Хоррамабад","Бадеран Тегеран",0,0,"В гостях","Н",0,0,9,4,4,1,7,3,16,4,2,1,1,4,2,7,5,2,3,0,3,1,9,2,0,2,0,2,3,0,0,0.77777777777777779,0.33333333333333331,0.36,"",""]
[{"$f":"Дома!B11","v":"2021.03.14 14:30"},{"$f":"Дома!A11","v":"ИРАН: Первый дивизион"},{"$f":"Дома!C11","v":"Бадеран Тегеран"},{"$f":"Дома!D11","v":"Эстеглал Хузестан"},{"$f":"CONCATENATE(Дома!E11,\"-\",Дома!F11)","v":"0-0"},"Бадеран Тегеран","Эстеглал Хузестан",0,0,"Дома","Н",0,0,10,4,5,1,7,3,17,5,2,2,1,4,2,8,5,2,3,0,3,1,9,3,0,2,0,2,3,0,0,0.7,0.3,0.34666666666666668,"Н",0]

{"sheet":"Гости","index":4,"n_rows":150,"n_cols":43,"rows_kept":150,"cut":false,"hidden":true,"merged":[]}
["Чемпионат","Дата/Время","Дома","Гости","К1 в 1Т","К2 в 1Т","К1 во 2Т","К2 во 2Т","Где играли","К1 Голов","К2 Голов","Забито","Пропущено","Результат","Всего Игр","Всего выиграно","Всего ничьих","Всего проиграно","Всего забито","Всего пропущено","Всего очков","Дома игр","Дома выиграно","Дома ничьих","Дома проиграно","Дома забито","Дома пропущено","Дома очков","Гости игр","Гости выиграно","Гости ничьих","Гости проиграно","Гости забито","Гости пропущено","Гости очков","Тотал",null,"1тз","1тп","2тз","2тп","Мз","Мп"]
["ИРАН: Первый дивизион","2021.06.02 17:35","Мес Керман","Эстеглал Моласани",2,1,1,1,"Гости",{"$f":"IF(I2=\"\",\"\",E2+G2)","v":3},{"$f":"IF(I2=\"\",\"\",F2+H2)","v":2},{"$f":"IF(I2=\"\",\"\",IF(I2=\"Дома\",J2,K2))","v":2},{"$f":"IF(I2=\"\",\"\",IF(I2=\"Дома\",K2,J2))","v":3},{"$f":"IF(I2=\"\",\"\",IF(I2=\"Дома\",IF(J2>K2,\"В\",IF(J2=K2,\"Н\",\"П\")),IF(J2<K2,\"В\",IF(J2=K2,\"Н\",\"П\"))))","v":"П"},{"$f":"IF(I2=\"\",\"\",1)","v":1},{"$f":"IF(I2=\"\",\"\",IF(N2=\"В\",1,0))","v":0},{"$f":"IF(I2=\"\",\"\",IF(N2=\"Н\",1,0))","v":0},{"$f":"IF(I2=\"\",\"\",IF(N2=\"П\",1,0))","v":1},{"$f":"IF(I2=\"\",\"\",L2)","v":2},{"$f":"IF(I2=\"\",\"\",M2)","v":3},{"$f":"IF(I2=\"\",\"\",P2*3+Q2)","v":0},{"$f":"IF(I2=\"\",\"\",IF(I2=\"Дома\",1,0))","v":0},{"$f":"IF(I2=\"\",\"\",IF(I2=\"Дома\",IF(N2=\"В\",1,0),0))","v":0},{"$f":"IF(I2=\"\",\"\",IF(I2=\"Дома\",IF(N2=\"Н\",1,0),0))","v":0},{"$f":"IF(I2=\"\",\"\",IF(I2=\"Дома\",IF(N2=\"П\",1,0),0))","v":0},{"$f":"IF(I2=\"\",\"\",IF(I2=\"Дома\",L2,0))","v":0},{"$f":"IF(I2=\"\",\"\",IF(I2=\"Дома\",M2,0))","v":0},{"$f":"IF(I2=\"\",\"\",IF(I2=\"Дома\",W2*3+X2,0))","v":0},{"$f":"IF(I2=\"\",\"\",IF(I2=\"Гости\",1,0))","v":1},{"$f":"IF(I2=\"\",\"\",IF(I2=\"Гости\",IF(N2=\"В\",1,0),0))","v":0},{"$f":"IF(I2=\"\",\"\",IF(I2=\"Гости\",IF(N2=\"Н\",1,0),0))","v":0},{"$f":"IF(I2=\"\",\"\",IF(I2=\"Гости\",IF(N2=\"П\",1,0),0))","v":1},{"$f":"IF(I2=\"\",\"\",IF(I2=\"Гости\",L2,0))","v":2},{"$f":"IF(I2=\"\",\"\",IF(I2=\"Гости\",M2,0))","v":3},{"$f":"IF(I2=\"\",\"\",IF(I2=\"Гости\",AD2*3+AE2,0))","v":0},{"$f":"IF(I2=\"Гости\",L2+M2,\"\")","v":5},null,{"$f":"IF(I2=\"\",\"\",IF(I2=\"Дома\",E2,F2))","v":1},{"$f":"IF(I2=\"\",\"\",IF(I2=\"Дома\",F2,E2))","v":2},{"$f":"IF(I2=\"\",\"\",IF(I2=\"Дома\",G2,H2))","v":1},{"$f":"IF(I2=\"\",\"\",IF(I2=\"Дома\",H2,G2))","v":1},{"$f":"L2","v":2},{"$f":"M2","v":3}]
["ИРАН: Первый дивизион","2021.05.26 19:10","Эстеглал Моласани","Хуши-Талаи",0,1,1,1,"Дома",{"$f":"IF(I3=\"\",\"\",E3+G3)","v":1},{"$f":"IF(I3=\"\",\"\",F3+H3)","v":2},{"$f":"IF(I3=\"\",\"\",IF(I3=\"Дома\",J3,K3))","v":1},{"$f":"IF(I3=\"\",\"\",IF(I3=\"Дома\",K3,J3))","v":2},{"$f":"IF(I3=\"\",\"\",IF(I3=\"Дома\",IF(J3>K3,\"В\",IF(J3=K3,\"Н\",\"П\")),IF(J3<K3,\"В\",IF(J3=K3,\"Н\",\"П\"))))","v":"П"},{"$f":"IF(I3=\"\",\"\",O2+1)","v":2},{"$f":"IF(I3=\"\",\"\",IF(N3=\"В\",P2+1,P2))","v":0},{"$f":"IF(I3=\"\",\"\",IF(N3=\"Н\",Q2+1,Q2))","v":0},{"$f":"IF(I3=\"\",\"\",IF(N3=\"П\",R2+1,R2))","v":2},{"$f":"IF(I3=\"\",\"\",S2+L3)","v":3},{"$f":"IF(I3=\"\",\"\",T2+M3)","v":5},{"$f":"IF(I3=\"\",\"\",P3*3+Q3)","v":0},{"$f":"IF(I3=\"\",\"\",IF(I3=\"Дома\",V2+1,V2+0))","v":1},{"$f":"IF(I3=\"\",\"\",IF(I3=\"Дома\",IF(N3=\"В\",W2+1,W2),W2))","v":0},{"$f":"IF(I3=\"\",\"\",IF(I3=\"Дома\",IF(N3=\"Н\",X2+1,X2),X2))","v":0},{"$f":"IF(I3=\"\",\"\",IF(I3=\"Дома\",IF(N3=\"П\",Y2+1,Y2),Y2))","v":1},{"$f":"IF(I3=\"\",\"\",IF(I3=\"Дома\",L3+Z2,Z2))","v":1},{"$f":"IF(I3=\"\",\"\",IF(I3=\"Дома\",M3+AA2,AA2))","v":2},{"$f":"IF(I3=\"\",\"\",IF(I3=\"Дома\",W3*3+X3,AB2))","v":0},{"$f":"IF(I3=\"\",\"\",IF(I3=\"Гости\",AC2+1,AC2+0))","v":1},{"$f":"IF(I3=\"\",\"\",IF(I3=\"Гости\",IF(N3=\"В\",AD2+1,AD2),AD2))","v":0},{"$f":"IF(I3=\"\",\"\",IF(I3=\"Гости\",IF(N3=\"Н\",AE2+1,AE2),AE2))","v":0},{"$f":"IF(I3=\"\",\"\",IF(I3=\"Гости\",IF(N3=\"П\",AF2+1,AF2),AF2))","v":1},{"$f":"IF(I3=\"\",\"\",IF(I3=\"Гости\",L3+AG2,AG2))","v":2},{"$f":"IF(I3=\"\",\"\",IF(I3=\"Гости\",M3+AH2,AH2))","v":3},{"$f":"IF(I3=\"\",\"\",IF(I3=\"Гости\",AD3*3+AE3,AI2))","v":0},{"$f":"IF(I3=\"Гости\",L3+M3,\"\")","v":""},null,{"$f":"IF(I3=\"\",\"\",IF(I3=\"Дома\",E3,F3))","v":0},{"$f":"IF(I3=\"\",\"\",IF(I3=\"Дома\",F3,E3))","v":1},{"$f":"IF(I3=\"\",\"\",IF(I3=\"Дома\",G3,H3))","v":1},{"$f":"IF(I3=\"\",\"\",IF(I3=\"Дома\",H3,G3))","v":1},{"$f":"L3","v":1},2]
["ИРАН: Первый дивизион","2021.05.20 17:40","Могхавемат","Эстеглал Моласани",1,0,1,1,"Гости",2,1,1,2,"П",3,{"$f":"IF(I4=\"\",\"\",IF(N4=\"В\",P3+1,P3))","v":0},{"$f":"IF(I4=\"\",\"\",IF(N4=\"Н\",Q3+1,Q3))","v":0},{"$f":"IF(I4=\"\",\"\",IF(N4=\"П\",R3+1,R3))","v":3},{"$f":"IF(I4=\"\",\"\",S3+L4)","v":4},{"$f":"IF(I4=\"\",\"\",T3+M4)","v":7},0,{"$f":"IF(I4=\"\",\"\",IF(I4=\"Дома\",V3+1,V3+0))","v":1},{"$f":"IF(I4=\"\",\"\",IF(I4=\"Дома\",IF(N4=\"В\",W3+1,W3),W3))","v":0},{"$f":"IF(I4=\"\",\"\",IF(I4=\"Дома\",IF(N4=\"Н\",X3+1,X3),X3))","v":0},{"$f":"IF(I4=\"\",\"\",IF(I4=\"Дома\",IF(N4=\"П\",Y3+1,Y3),Y3))","v":1},{"$f":"IF(I4=\"\",\"\",IF(I4=\"Дома\",L4+Z3,Z3))","v":1},{"$f":"IF(I4=\"\",\"\",IF(I4=\"Дома\",M4+AA3,AA3))","v":2},{"$f":"IF(I4=\"\",\"\",IF(I4=\"Дома\",W4*3+X4,AB3))","v":0},{"$f":"IF(I4=\"\",\"\",IF(I4=\"Гости\",AC3+1,AC3+0))","v":2},{"$f":"IF(I4=\"\",\"\",IF(I4=\"Гости\",IF(N4=\"В\",AD3+1,AD3),AD3))","v":0},{"$f":"IF(I4=\"\",\"\",IF(I4=\"Гости\",IF(N4=\"Н\",AE3+1,AE3),AE3))","v":0},{"$f":"IF(I4=\"\",\"\",IF(I4=\"Гости\",IF(N4=\"П\",AF3+1,AF3),AF3))","v":2},{"$f":"IF(I4=\"\",\"\",IF(I4=\"Гости\",L4+AG3,AG3))","v":3},{"$f":"IF(I4=\"\",\"\",IF(I4=\"Гости\",M4+AH3,AH3))","v":5},{"$f":"IF(I4=\"\",\"\",IF(I4=\"Гости\",AD4*3+AE4,AI3))","v":0},3,null,0,1,1,1,1,2]
["ИРАН: Первый дивизион","2021.05.14 19:00","Эстеглал Моласани","Навад Урмия",0,0,1,0,"Дома",1,0,1,0,"В",4,1,0,3,5,7,3,2,1,0,1,2,2,3,2,0,0,2,3,5,0,"",null,0,0,1,0,1,0]
["ИРАН: Первый дивизион","2021.05.08 19:00","Гол Рейхан","Эстеглал Моласани",0,0,1,0,"Гости",1,0,0,1,"П",5,1,0,4,5,8,3,2,1,0,1,2,2,3,3,0,0,3,3,6,0,1,null,0,0,0,1,0,1]
["ИРАН: Первый дивизион","2021.04.26 18:45","Эстеглал Моласани","Астара",1,0,0,0,"Дома",1,0,1,0,"В",6,2,0,4,6,8,6,3,2,0,1,3,2,6,3,0,0,3,3,6,0,""]
["ИРАН: Первый дивизион","2021.04.19 20:30","Эстеглал Хузестан","Эстеглал Моласани",2,0,1,1,"Гости",3,1,1,3,"П",7,2,0,5,7,11,6,3,2,0,1,3,2,6,4,0,0,4,4,9,0,4,null,{"$f":"SUM(AL2:AL6)/5","v":0.2},{"$f":"SUM(AM2:AM6)/5","v":0.8},0.8,0.8,1,1.6]
["ИРАН: Первый дивизион","2021.04.13 15:30","Эстеглал Моласани","Хейбар Хоррамабад",0,1,0,0,"Дома",0,1,0,1,{"$f":"IF(I9=\"\",\"\",IF(I9=\"Дома\",IF(J9>K9,\"В\",IF(J9=K9,\"Н\",\"П\")),IF(J9<K9,\"В\",IF(J9=K9,\"Н\",\"П\"))))","v":"П"},8,2,0,6,7,12,6,4,2,0,2,3,3,6,4,0,0,4,4,9,0,""]
["ИРАН: Первый дивизион","2021.04.07 15:00","Хавадар","Эстеглал Моласани",0,0,2,1,"Гости",2,1,1,2,{"$f":"IF(I10=\"\",\"\",IF(I10=\"Дома\",IF(J10>K10,\"В\",IF(J10=K10,\"Н\",\"П\")),IF(J10<K10,\"В\",IF(J10=K10,\"Н\",\"П\"))))","v":"П"},9,2,0,7,8,14,6,4,2,0,2,3,3,6,5,0,0,5,5,11,0,3]
["ИРАН: Первый дивизион","2021.03.17 15:00","Эстеглал Моласани","Райка Баболь",0,0,1,0,"Дома",1,0,1,0,"В",10,3,0,7,9,14,9,5,3,0,2,4,3,9,5,0,0,5,5,11,0,""]
["ИРАН: Кубок Ирана","2021.03.12 14:30","Эстеглал Моласани","Shahin Bandar Ameri",0,0,0,0,"Дома",0,0,0,0,"Н",11,3,1,7,9,14,{"$f":"IF(I12=\"\",\"\",P12*3+Q12)","v":10},6,3,1,2,4,3,10,5,0,0,5,5,11,0,""]
["ИРАН: Первый дивизион","2021.03.07 14:45","Эстеглал Моласани","Шахин Бушехр",1,1,0,0,"Дома",1,1,1,1,"Н",12,3,2,7,10,15,11,7,3,2,2,5,4,11,5,0,0,5,5,11,0,""]
["ИРАН: Первый дивизион","2021.03.02 14:00","Арман Гохар","Эстеглал Моласани",0,0,2,2,"Гости",2,2,2,2,"Н",13,3,3,7,12,17,12,7,3,2,2,5,4,11,6,0,1,5,7,13,1,4]
["ИРАН: Первый дивизион","2021.02.20 14:30","Эстеглал Моласани","Малаван",0,0,0,0,"Дома",0,0,0,0,"Н",14,3,4,7,12,17,13,8,3,3,2,5,4,12,6,0,1,5,7,13,1,""]
["ИРАН: Первый дивизион","2021.02.14 13:30","Кашкай Шираз","Эстеглал Моласани",2,0,1,1,"Гости",3,1,1,3,"П",15,3,4,8,13,20,13,8,3,3,2,5,4,12,7,0,1,6,8,16,1,4]
["ИРАН: Первый дивизион","2021.02.08 14:30","Эстеглал Моласани","Чока Талеш",0,0,0,0,"Дома",0,0,0,0,"Н",16,3,5,8,13,20,14,9,3,4,2,5,4,13,7,0,1,6,8,16,1,""]
["ИРАН: Первый дивизион","2021.02.01 13:30","Парс Джануби Джем","Эстеглал Моласани",0,1,1,0,"Гости",1,1,1,1,"Н",17,3,6,8,14,21,15,9,3,4,2,5,4,13,8,0,2,6,9,17,2,2]
["ИРАН: Первый дивизион","2021.01.25 13:30","Эстеглал Моласани","Бадеран Тегеран",1,0,0,1,"Дома",1,1,1,1,"Н",18,3,7,8,15,22,16,10,3,5,2,6,5,14,8,0,2,6,9,17,2,""]
["ИРАН: Первый дивизион","2021.01.18 13:30","Эстеглал Моласани","Мес Керман",0,0,1,0,"Дома",1,0,1,0,"В",19,4,7,8,16,22,19,11,4,5,2,7,5,17,8,0,2,6,9,17,2,""]
["ИРАН: Первый дивизион","2021.01.11 13:30","Хуши-Талаи","Эстеглал Моласани",1,0,1,1,"Гости",2,1,1,2,"П",20,4,7,9,17,24,19,11,4,5,2,7,5,17,9,0,2,7,10,19,2,3]
["ИРАН: Первый дивизион","2021.01.04 13:30","Эстеглал Моласани","Могхавемат",1,0,0,1,"Дома",1,1,1,1,"Н",21,4,8,9,18,25,20,12,4,6,2,8,6,18,9,0,2,7,10,19,2,""]
["ИРАН: Первый дивизион","2020.12.28 13:30","Навад Урмия","Эстеглал Моласани",0,0,0,1,"Гости",0,1,1,0,"В",22,5,8,9,19,25,23,12,4,6,2,8,6,18,10,1,2,7,11,19,5,1]
["ИРАН: Первый дивизион","2020.12.22 13:30","Эстеглал Моласани","Гол Рейхан",0,0,1,0,"Дома",1,0,1,0,"В",23,6,8,9,20,25,26,13,5,6,2,9,6,21,10,1,2,7,11,19,5,""]
["ИРАН: Первый дивизион","2020.12.16 13:30","Астара","Эстеглал Моласани",1,1,2,0,"Гости",3,1,1,3,"П",24,6,8,10,21,28,26,13,5,6,2,9,6,21,11,1,2,8,12,22,5,4]
["ИРАН: Первый дивизион","2020.12.10 14:00","Эстеглал Моласани","Эстеглал Хузестан",1,1,0,3,"Дома",1,4,1,4,"П",25,6,8,11,22,32,26,14,5,6,3,10,10,21,11,1,2,8,12,22,5,""]
["ИРАН: Первый дивизион","2020.02.02 13:30","Бадеран Тегеран","Арман Гохар",1,0,3,0,"Дома",4,0,4,0,"В",26,7,8,11,26,32,29,15,6,6,3,14,10,24,11,1,2,8,12,22,5,""]
[null,null,null,null,null,null,null,null,null,"","","","","","","","","","","","","","","","","","","","","","","","","","",""]
[null,null,null,null,null,null,null,null,null,"","","","","","","","","","","","","","","","","","","","","","","","","","",""]
[null,null,null,null,null,null,null,null,null,"","","","","","","","","","","","","","","","","","","","","","","","","","",""]
[null,null,null,null,null,null,null,null,null,"","","","","","","","","","","","","","","","","","","","","","","","","","",""]
[null,null,null,null,null,null,null,null,null,"","","","","","","","","","","","","","","","","","","","","","","","","","",""]
[null,null,null,null,null,null,null,null,null,"","","","","","","","","","","","","","","","","","","","","","","","","","",""]
[null,null,null,null,null,null,null,null,null,"","","","","","","","","","","","","","","","","","","","","","","","","","",""]
[null,null,null,null,null,null,null,null,null,"","","","","","","","","","","","","","","","","","","","","","","","","","",""]
[null,null,null,null,null,null,null,null,null,"","","","","","","","","","","","","","","","","","","","","","","","","","",""]
[null,null,null,null,null,null,null,null,null,"","","","","","","","","","","","","","","","","","","","","","","","","","",""]
[null,null,null,null,null,null,null,null,null,"","","","","","","","","","","","","","","","","","","","","","","","","","",""]
[null,null,null,null,null,null,null,null,null,"","","","","","","","","","","","","","","","","","","","","","","","","","",""]
[null,null,null,null,null,null,null,null,null,"","","","","","","","","","","","","","","","","","","","","","","","","","",""]
[null,null,null,null,null,null,null,null,null,"","","","","","","","","","","","","","","","","","","","","","","","","","",""]
[null,null,null,null,null,null,null,null,null,"","","","","","","","","","","","","","","","","","","","","","","","","","",""]
[null,null,null,null,null,null,null,null,null,"","","","","","","","","","","","","","","","","","","","","","","","","","",""]
[null,null,null,null,null,null,null,null,null,"","","","","","","","","","","","","","","","","","","","","","","","","","",""]
[null,null,null,null,null,null,null,null,null,"","","","","","","","","","","","","","","","","","","","","","","","","","",""]
[null,null,null,null,null,null,null,null,null,"","","","","","","","","","","","","","","","","","","","","","","","","","",""]
[null,null,null,null,null,null,null,null,null,"","","","","","","","","","","","","","","","","","","","","","","","","","",""]
[null,null,null,null,null,null,null,null,null,"","","","","","","","","","","","","","","","","","","","","","","","","","",""]
[null,null,null,null,null,null,null,null,null,"","","","","","","","","","","","","","","","","","","","","","","","","","",""]
[null,null,null,null,null,null,null,null,null,"","","","","","","","","","","","","","","","","","","","","","","","","","",""]
[null,null,null,null,null,null,null,null,null,"","","","","","","","","","","","","","","","","","","","","","","","","","",""]
[null,null,null,null,null,null,null,null,null,"","","","","","","","","","","","","","","","","","","","","","","","","","",""]
[null,null,null,null,null,null,null,null,null,"","","","","","","","","","","","","","","","","","","","","","","","","","",""]
[null,null,null,null,null,null,null,null,null,"","","","","","","","","","","","","","","","","","","","","","","","","","",""]
[null,null,null,null,null,null,null,null,null,"","","","","","","","","","","","","","","","","","","","","","","","","","",""]
[null,null,null,null,null,null,null,null,null,"","","","","","","","","","","","","","","","","","","","","","","","","","",""]
[null,null,null,null,null,null,null,null,null,"","","","","","","","","","","","","","","","","","","","","","","","","","",""]
[null,null,null,null,null,null,null,null,null,"","","","","","","","","","","","","","","","","","","","","","","","","","",""]
[null,null,null,null,null,null,null,null,null,"","","","","","","","","","","","","","","","","","","","","","","","","","",""]
[null,null,null,null,null,null,null,null,null,"","","","","","","","","","","","","","","","","","","","","","","","","","",""]
[null,null,null,null,null,null,null,null,null,"","","","","","","","","","","","","","","","","","","","","","","","","","",""]
[null,null,null,null,null,null,null,null,null,"","","","","","","","","","","","","","","","","","","","","","","","","","",""]
[null,null,null,null,null,null,null,null,null,"","","","","","","","","","","","","","","","","","","","","","","","","","",""]
[null,null,null,null,null,null,null,null,null,"","","","","","","","","","","","","","","","","","","","","","","","","","",""]
[null,null,null,null,null,null,null,null,null,"","","","","","","","","","","","","","","","","","","","","","","","","","",""]
[null,null,null,null,null,null,null,null,null,"","","","","","","","","","","","","","","","","","","","","","","","","","",""]
[null,null,null,null,null,null,null,null,null,{"$f":"IF(I67=\"\",\"\",E67+G67)","v":""},{"$f":"IF(I67=\"\",\"\",F67+H67)","v":""},{"$f":"IF(I67=\"\",\"\",IF(I67=\"Дома\",J67,K67))","v":""},{"$f":"IF(I67=\"\",\"\",IF(I67=\"Дома\",K67,J67))","v":""},"",{"$f":"IF(I67=\"\",\"\",O66+1)","v":""},"","","","","",{"$f":"IF(I67=\"\",\"\",P67*3+Q67)","v":""},"","","","","","","","","","","","","","",{"$f":"IF(I67=\"Гости\",L67+M67,\"\")","v":""}]
[null,null,null,null,null,null,null,null,null,"","","","","","",{"$f":"IF(I68=\"\",\"\",IF(N68=\"В\",P67+1,P67))","v":""},{"$f":"IF(I68=\"\",\"\",IF(N68=\"Н\",Q67+1,Q67))","v":""},{"$f":"IF(I68=\"\",\"\",IF(N68=\"П\",R67+1,R67))","v":""},{"$f":"IF(I68=\"\",\"\",S67+L68)","v":""},{"$f":"IF(I68=\"\",\"\",T67+M68)","v":""},"",{"$f":"IF(I68=\"\",\"\",IF(I68=\"Дома\",V67+1,V67+0))","v":""},{"$f":"IF(I68=\"\",\"\",IF(I68=\"Дома\",IF(N68=\"В\",W67+1,W67),W67))","v":""},{"$f":"IF(I68=\"\",\"\",IF(I68=\"Дома\",IF(N68=\"Н\",X67+1,X67),X67))","v":""},{"$f":"IF(I68=\"\",\"\",IF(I68=\"Дома\",IF(N68=\"П\",Y67+1,Y67),Y67))","v":""},{"$f":"IF(I68=\"\",\"\",IF(I68=\"Дома\",L68+Z67,Z67))","v":""},{"$f":"IF(I68=\"\",\"\",IF(I68=\"Дома\",M68+AA67,AA67))","v":""},{"$f":"IF(I68=\"\",\"\",IF(I68=\"Дома\",W68*3+X68,AB67))","v":""},{"$f":"IF(I68=\"\",\"\",IF(I68=\"Гости\",AC67+1,AC67+0))","v":""},{"$f":"IF(I68=\"\",\"\",IF(I68=\"Гости\",IF(N68=\"В\",AD67+1,AD67),AD67))","v":""},{"$f":"IF(I68=\"\",\"\",IF(I68=\"Гости\",IF(N68=\"Н\",AE67+1,AE67),AE67))","v":""},{"$f":"IF(I68=\"\",\"\",IF(I68=\"Гости\",IF(N68=\"П\",AF67+1,AF67),AF67))","v":""},{"$f":"IF(I68=\"\",\"\",IF(I68=\"Гости\",L68+AG67,AG67))","v":""},{"$f":"IF(I68=\"\",\"\",IF(I68=\"Гости\",M68+AH67,AH67))","v":""},{"$f":"IF(I68=\"\",\"\",IF(I68=\"Гости\",AD68*3+AE68,AI67))","v":""},""]
[null,null,null,null,null,null,null,null,null,"","","","","","","","","","","","","","","","","","","","","","","","","","",""]
[null,null,null,null,null,null,null,null,null,"","","","","","","","","","","","","","","","","","","","","","","","","","",""]
[null,null,null,null,null,null,null,null,null,"","","","","","","","","","","","","","","","","","","","","","","","","","",""]
[null,null,null,null,null,null,null,null,null,"","","","","","","","","","","","","","","","","","","","","","","","","","",""]
[null,null,null,null,null,null,null,null,null,"","","","","","","","","","","","","","","","","","","","","","","","","","",""]
[null,null,null,null,null,null,null,null,null,"","","","",{"$f":"IF(I74=\"\",\"\",IF(I74=\"Дома\",IF(J74>K74,\"В\",IF(J74=K74,\"Н\",\"П\")),IF(J74<K74,\"В\",IF(J74=K74,\"Н\",\"П\"))))","v":""},"","","","","","","","","","","","","","","","","","","","","",""]
[null,null,null,null,null,null,null,null,null,"","","","","","","","","","","","","","","","","","","","","","","","","","",""]
[null,null,null,null,null,null,null,null,null,"","","","","","","","","","","","","","","","","","","","","","","","","","",""]
[null,null,null,null,null,null,null,null,null,"","","","","","","","","","","","","","","","","","","","","","","","","","",""]
[null,null,null,null,null,null,null,null,null,"","","","","","","","","","","","","","","","","","","","","","","","","","",""]
[null,null,null,null,null,null,null,null,null,"","","","","","","","","","","","","","","","","","","","","","","","","","",""]
[null,null,null,null,null,null,null,null,null,"","","","","","","","","","","","","","","","","","","","","","","","","","",""]
[null,null,null,null,null,null,null,null,null,"","","","","","","","","","","","","","","","","","","","","","","","","","",""]
[null,null,null,null,null,null,null,null,null,"","","","","","","","","","","","","","","","","","","","","","","","","","",""]
[null,null,null,null,null,null,null,null,null,"","","","","","","","","","","","","","","","","","","","","","","","","","",""]
[null,null,null,null,null,null,null,null,null,"","","","","","","","","","","","","","","","","","","","","","","","","","",""]
[null,null,null,null,null,null,null,null,null,"","","","","","","","","","","","","","","","","","","","","","","","","","",""]
[null,null,null,null,null,null,null,null,null,"","","","","","","","","","","","","","","","","","","","","","","","","","",""]
[null,null,null,null,null,null,null,null,null,"","","","","","","","","","","","","","","","","","","","","","","","","","",""]
[null,null,null,null,null,null,null,null,null,"","","","","","","","","","","","","","","","","","","","","","","","","","",""]
[null,null,null,null,null,null,null,null,null,"","","","","","","","","","","","","","","","","","","","","","","","","","",""]
[null,null,null,null,null,null,null,null,null,"","","","","","","","","","","","","","","","","","","","","","","","","","",""]
[null,null,null,null,null,null,null,null,null,"","","","","","","","","","","","","","","","","","","","","","","","","","",""]
[null,null,null,null,null,null,null,null,null,"","","","","","","","","","","","","","","","","","","","","","","","","","",""]
[null,null,null,null,null,null,null,null,null,"","","","","","","","","","","","","","","","","","","","","","","","","","",""]
[null,null,null,null,null,null,null,null,null,"","","","","","","","","","","","","","","","","","","","","","","","","","",""]
[null,null,null,null,null,null,null,null,null,"","","","","","","","","","","","","","","","","","","","","","","","","","",""]
[null,null,null,null,null,null,null,null,null,"","","","","","","","","","","","","","","","","","","","","","","","","","",""]
[null,null,null,null,null,null,null,null,null,"","","","","","","","","","","","","","","","","","","","","","","","","","",""]
[null,null,null,null,null,null,null,null,null,"","","","","","","","","","","","","","","","","","","","","","","","","","",""]
[null,null,null,null,null,null,null,null,null,"","","","","","","","","","","","","","","","","","","","","","","","","","",""]
[null,null,null,null,null,null,null,null,null,"","","","","","","","","","","","","","","","","","","","","","","","","","",""]
[null,null,null,null,null,null,null,null,null,"","","","","","","","","","","","","","","","","","","","","","","","","","",""]
[null,null,null,null,null,null,null,null,null,"","","","","","","","","","","","","","","","","","","","","","","","","","",""]
[null,null,null,null,null,null,null,null,null,"","","","","","","","","","","","","","","","","","","","","","","","","","",""]
[null,null,null,null,null,null,null,null,null,"","","","","","","","","","","","","","","","","","","","","","","","","","",""]
[null,null,null,null,null,null,null,null,null,"","","","","","","","","","","","","","","","","","","","","","","","","","",""]
[null,null,null,null,null,null,null,null,null,"","","","","","","","","","","","","","","","","","","","","","","","","","",""]
[null,null,null,null,null,null,null,null,null,"","","","","","","","","","","","","","","","","","","","","","","","","","",""]
[null,null,null,null,null,null,null,null,null,"","","","","","","","","","","","","","","","","","","","","","","","","","",""]
[null,null,null,null,null,null,null,null,null,"","","","","","","","","","","","","","","","","","","","","","","","","","",""]
[null,null,null,null,null,null,null,null,null,"","","","","","","","","","","","","","","","","","","","","","","","","","",""]
[null,null,null,null,null,null,null,null,null,"","","","","","","","","","","","","","","","","","","","","","","","","","",""]
[null,null,null,null,null,null,null,null,null,"","","","","","","","","","","","","","","","","","","","","","","","","","",""]
[null,null,null,null,null,null,null,null,null,"","","","","","","","","","","","","","","","","","","","","","","","","","",""]
[null,null,null,null,null,null,null,null,null,"","","","","","","","","","","","","","","","","","","","","","","","","","",""]
[null,null,null,null,null,null,null,null,null,"","","","","","","","","","","","","","","","","","","","","","","","","","",""]
[null,null,null,null,null,null,null,null,null,"","","","","","","","","","","","","","","","","","","","","","","","","","",""]
[null,null,null,null,null,null,null,null,null,"","","","","","","","","","","","","","","","","","","","","","","","","","",""]
[null,null,null,null,null,null,null,null,null,"","","","","","","","","","","","","","","","","","","","","","","","","","",""]
[null,null,null,null,null,null,null,null,null,"","","","","","","","","","","","","","","","","","","","","","","","","","",""]
[null,null,null,null,null,null,null,null,null,"","","","","","","","","","","","","","","","","","","","","","","","","","",""]
[null,null,null,null,null,null,null,null,null,"","","","","","","","","","","","","","","","","","","","","","","","","","",""]
[null,null,null,null,null,null,null,null,null,"","","","","","","","","","","","","","","","","","","","","","","","","","",""]
[null,null,null,null,null,null,null,null,null,"","","","","","","","","","","","","","","","","","","","","","","","","","",""]
[null,null,null,null,null,null,null,null,null,"","","","","","","","","","","","","","","","","","","","","","","","","","",""]
[null,null,null,null,null,null,null,null,null,"","","","","","","","","","","","","","","","","","","","","","","","","","",""]
[null,null,null,null,null,null,null,null,null,"","","","","","","","","","","","","","","","","","","","","","","","","","",""]
[null,null,null,null,null,null,null,null,null,"","","","","","","","","","","","","","","","","","","","","","","","","","",""]
[null,null,null,null,null,null,null,null,null,"","","","","","","","","","","","","","","","","","","","","","","","","","",""]
[null,null,null,null,null,null,null,null,null,"","","","","","","","","","","","","","","","","","","","","","","","","","",""]
[null,null,null,null,null,null,null,null,null,"","","","","","","","","","","","","","","","","","","","","","","","","","",""]
[null,null,null,null,null,null,null,null,null,{"$f":"IF(I131=\"\",\"\",E131+G131)","v":""},{"$f":"IF(I131=\"\",\"\",F131+H131)","v":""},{"$f":"IF(I131=\"\",\"\",IF(I131=\"Дома\",J131,K131))","v":""},{"$f":"IF(I131=\"\",\"\",IF(I131=\"Дома\",K131,J131))","v":""},"",{"$f":"IF(I131=\"\",\"\",O130+1)","v":""},"","","","","",{"$f":"IF(I131=\"\",\"\",P131*3+Q131)","v":""},"","","","","","","","","","","","","","",{"$f":"IF(I131=\"Гости\",L131+M131,\"\")","v":""}]
[null,null,null,null,null,null,null,null,null,"","","","","","",{"$f":"IF(I132=\"\",\"\",IF(N132=\"В\",P131+1,P131))","v":""},{"$f":"IF(I132=\"\",\"\",IF(N132=\"Н\",Q131+1,Q131))","v":""},{"$f":"IF(I132=\"\",\"\",IF(N132=\"П\",R131+1,R131))","v":""},{"$f":"IF(I132=\"\",\"\",S131+L132)","v":""},{"$f":"IF(I132=\"\",\"\",T131+M132)","v":""},"",{"$f":"IF(I132=\"\",\"\",IF(I132=\"Дома\",V131+1,V131+0))","v":""},{"$f":"IF(I132=\"\",\"\",IF(I132=\"Дома\",IF(N132=\"В\",W131+1,W131),W131))","v":""},{"$f":"IF(I132=\"\",\"\",IF(I132=\"Дома\",IF(N132=\"Н\",X131+1,X131),X131))","v":""},{"$f":"IF(I132=\"\",\"\",IF(I132=\"Дома\",IF(N132=\"П\",Y131+1,Y131),Y131))","v":""},{"$f":"IF(I132=\"\",\"\",IF(I132=\"Дома\",L132+Z131,Z131))","v":""},{"$f":"IF(I132=\"\",\"\",IF(I132=\"Дома\",M132+AA131,AA131))","v":""},{"$f":"IF(I132=\"\",\"\",IF(I132=\"Дома\",W132*3+X132,AB131))","v":""},{"$f":"IF(I132=\"\",\"\",IF(I132=\"Гости\",AC131+1,AC131+0))","v":""},{"$f":"IF(I132=\"\",\"\",IF(I132=\"Гости\",IF(N132=\"В\",AD131+1,AD131),AD131))","v":""},{"$f":"IF(I132=\"\",\"\",IF(I132=\"Гости\",IF(N132=\"Н\",AE131+1,AE131),AE131))","v":""},{"$f":"IF(I132=\"\",\"\",IF(I132=\"Гости\",IF(N132=\"П\",AF131+1,AF131),AF131))","v":""},{"$f":"IF(I132=\"\",\"\",IF(I132=\"Гости\",L132+AG131,AG131))","v":""},{"$f":"IF(I132=\"\",\"\",IF(I132=\"Гости\",M132+AH131,AH131))","v":""},{"$f":"IF(I132=\"\",\"\",IF(I132=\"Гости\",AD132*3+AE132,AI131))","v":""},""]
[null,null,null,null,null,null,null,null,null,"","","","","","","","","","","","","","","","","","","","","","","","","","",""]
[null,null,null,null,null,null,null,null,null,"","","","","","","","","","","","","","","","","","","","","","","","","","",""]
[null,null,null,null,null,null,null,null,null,"","","","","","","","","","","","","","","","","","","","","","","","","","",""]
[null,null,null,null,null,null,null,null,null,"","","","","","","","","","","","","","","","","","","","","","","","","","",""]
[null,null,null,null,null,null,null,null,null,"","","","","","","","","","","","","","","","","","","","","","","","","","",""]
[null,null,null,null,null,null,null,null,null,"","","","",{"$f":"IF(I138=\"\",\"\",IF(I138=\"Дома\",IF(J138>K138,\"В\",IF(J138=K138,\"Н\",\"П\")),IF(J138<K138,\"В\",IF(J138=K138,\"Н\",\"П\"))))","v":""},"","","","","","","","","","","","","","","","","","","","","",""]
[null,null,null,null,null,null,null,null,null,"","","","","","","","","","","","","","","","","","","","","","","","","","",""]
[null,null,null,null,null,null,null,null,null,"","","","","","","","","","","","","","","","","","","","","","","","","","",""]
[null,null,null,null,null,null,null,null,null,"","","","","","","","","","","","","","","","","","","","","","","","","","",""]
[null,null,null,null,null,null,null,null,null,"","","","","","","","","","","","","","","","","","","","","","","","","","",""]
[null,null,null,null,null,null,null,null,null,"","","","","","","","","","","","","","","","","","","","","","","","","","",""]
[null,null,null,null,null,null,null,null,null,"","","","","","","","","","","","","","","","","","","","","","","","","","",""]
[null,null,null,null,null,null,null,null,null,"","","","","","","","","","","","","","","","","","","","","","","","","","",""]
[null,null,null,null,null,null,null,null,null,"","","","","","","","","","","","","","","","","","","","","","","","","","",""]
[null,null,null,null,null,null,null,null,null,"","","","","","","","","","","","","","","","","","","","","","","","","","",""]
[null,null,null,null,null,null,null,null,null,"","","","","","","","","","","","","","","","","","","","","","","","","","",""]
[null,null,null,null,null,null,null,null,null,"","","","","","","","","","","","","","","","","","","","","","","","","","",""]
[null,null,null,null,null,null,null,null,null,"","","","","","","","","","","","","","","","","","","","","","","","","","",""]

{"sheet":"Команда2","index":5,"n_rows":12,"n_cols":47,"rows_kept":12,"cut":false,"hidden":true,"merged":[[1,0,1,2],[1,3,1,4],[0,0,0,4],[0,38,0,41],[0,13,0,19],[0,20,0,26],[0,27,0,33],[0,34,0,37]]}
["Данные 10-и последних матчей 2 команды",null,null,null,null,null,null,null,null,null,null,null,null,"Всего",null,null,null,null,null,null,"Дома",null,null,null,null,null,null,"В гостях",null,null,null,null,null,null,"Забивают дома",null,null,null,"Забивают в гостях"]
["Команда - 2",null,null,{"$f":"IF(F3=F4,F3,IF(F3=G4,F3,G3))","v":"Эстеглал Моласани"},null,"Команда1","Команда2","Голы1","Голы2","Где играла","Результат","Забито","Пропущено","Игр","В","Н","П","Забито","Пропущено","Очки","Игр","В","Н","П","Забито","Пропущено","Очки","Игр","В","Н","П","Забито","Пропущено","Очки",0,1,2,"3+",0,1,2,"3+","Забивают","Пропускают","Рейтинг","Серия","Забив"]
[{"$f":"Гости!B2","v":"2021.06.02 17:35"},{"$f":"Гости!A2","v":"ИРАН: Первый дивизион"},{"$f":"Гости!C2","v":"Мес Керман"},{"$f":"Гости!D2","v":"Эстеглал Моласани"},{"$f":"CONCATENATE(Гости!E2,\"-\",Гости!F2)","v":"2-1"},{"$f":"C3","v":"Мес Керман"},{"$f":"D3","v":"Эстеглал Моласани"},{"$f":"VALUE(LEFT(E3,FIND(\"-\",E3,1)-1))","v":2},{"$f":"VALUE(LEFT(RIGHT(E3,LEN(E3)-FIND(\"-\",E3,1)),2))","v":1},{"$f":"IF(F3=$D$2,\"Дома\",\"В гостях\")","v":"В гостях"},{"$f":"IF(J3=\"Дома\",IF(H3>I3,\"В\",IF(H3=I3,\"Н\",\"П\")),IF(H3<I3,\"В\",IF(H3=I3,\"Н\",\"П\")))","v":"П"},{"$f":"IF(J3=\"Дома\",H3,I3)","v":1},{"$f":"IF(J3=\"Дома\",I3,H3)","v":2},1,{"$f":"IF(K3=\"В\",1,0)","v":0},{"$f":"IF(K3=\"Н\",1,0)","v":0},{"$f":"IF(K3=\"П\",1,0)","v":1},{"$f":"L3","v":1},{"$f":"M3","v":2},{"$f":"O3*3+P3","v":0},{"$f":"IF(J3=\"Дома\",1,0)","v":0},{"$f":"IF(J3=\"Дома\",IF(K3=\"В\",1,0),0)","v":0},{"$f":"IF(J3=\"Дома\",IF(K3=\"Н\",1,0),0)","v":0},{"$f":"IF(J3=\"Дома\",IF(K3=\"П\",1,0),0)","v":0},{"$f":"IF(J3=\"Дома\",L3,0)","v":0},{"$f":"IF(J3=\"Дома\",M3,0)","v":0},{"$f":"V3*3+W3","v":0},{"$f":"IF(J3<>\"Дома\",1,0)","v":1},{"$f":"IF(J3<>\"Дома\",IF(K3=\"В\",1,0),0)","v":0},{"$f":"IF(J3<>\"Дома\",IF(K3=\"Н\",1,0),0)","v":0},{"$f":"IF(J3<>\"Дома\",IF(K3=\"П\",1,0),0)","v":1},{"$f":"IF(J3<>\"Дома\",L3,0)","v":1},{"$f":"IF(J3<>\"Дома\",M3,0)","v":2},{"$f":"AC3*3+AD3","v":0},{"$f":"IF(J3=\"Дома\",IF(L3=0,1,0),0)","v":0},{"$f":"IF(J3=\"Дома\",IF(L3=1,1,0),0)","v":0},{"$f":"IF(J3=\"Дома\",IF(L3=2,1,0),0)","v":0},{"$f":"IF(J3=\"Дома\",IF(L3>=3,1,0),0)","v":0},{"$f":"IF(J3<>\"Дома\",IF(L3=0,1,0),0)","v":0},{"$f":"IF(J3<>\"Дома\",IF(L3=1,1,0),0)","v":1},{"$f":"IF(J3<>\"Дома\",IF(L3=2,1,0),0)","v":0},{"$f":"IF(J3<>\"Дома\",IF(L3>=3,1,0),0)","v":0},{"$f":"R3/N3","v":1},{"$f":"S3/N3","v":2},{"$f":"(AA3/IF(U3<1,1,U3)+AH3/IF(AB3<1,1,AB3)*1.5+Y3/IF(U3<1,1,U3)+AF3/IF(AB3<1,1,AB3)*1.5-Z3/IF(U3<1,1,U3)*1.5-AG3/IF(AB3<1,1,AB3))/15","v":-3.3333333333333333E-2},{"$f":"IF(J3=\"В гостях\",IF(K3=\"В\",\"В\",IF(K3=\"Н\",\"Н\",\"П\")),\"\")","v":"П"},{"$f":"IF(J3<>\"Дома\",L3+M3,\"\")","v":3}]
[{"$f":"Гости!B3","v":"2021.05.26 19:10"},{"$f":"Гости!A3","v":"ИРАН: Первый дивизион"},{"$f":"Гости!C3","v":"Эстеглал Моласани"},{"$f":"Гости!D3","v":"Хуши-Талаи"},{"$f":"CONCATENATE(Гости!E3,\"-\",Гости!F3)","v":"0-1"},"Эстеглал Моласани","Хуши-Талаи",0,1,"Дома","П",0,1,{"$f":"N3+1","v":2},{"$f":"IF(K4=\"В\",O3+1,O3+0)","v":0},{"$f":"IF(K4=\"Н\",P3+1,P3+0)","v":0},{"$f":"IF(K4=\"П\",Q3+1,Q3+0)","v":2},{"$f":"L4+R3","v":1},{"$f":"M4+S3","v":3},0,{"$f":"IF(J4=\"Дома\",U3+1,U3+0)","v":1},{"$f":"IF(J4=\"Дома\",IF(K4=\"В\",V3+1,V3+0),V3+0)","v":0},{"$f":"IF(J4=\"Дома\",IF(K4=\"Н\",W3+1,W3+0),W3+0)","v":0},{"$f":"IF(J4=\"Дома\",IF(K4=\"П\",X3+1,X3+0),X3+0)","v":1},{"$f":"IF(J4=\"Дома\",Y3+L4,Y3+0)","v":0},{"$f":"IF(J4=\"Дома\",Z3+M4,Z3+0)","v":1},0,{"$f":"IF(J4<>\"Дома\",AB3+1,AB3+0)","v":1},{"$f":"IF(J4<>\"Дома\",IF(K4=\"В\",AC3+1,AC3+0),AC3+0)","v":0},{"$f":"IF(J4<>\"Дома\",IF(K4=\"Н\",AD3+1,AD3+0),AD3+0)","v":0},{"$f":"IF(J4<>\"Дома\",IF(K4=\"П\",AE3+1,AE3+0),AE3+0)","v":1},{"$f":"IF(J4<>\"Дома\",AF3+L4,AF3+0)","v":1},{"$f":"IF(J4<>\"Дома\",AG3+M4,AG3+0)","v":2},0,{"$f":"IF(J4=\"Дома\",IF(L4=0,AI3+1,AI3),AI3)","v":1},{"$f":"IF(J4=\"Дома\",IF(L4=1,AJ3+1,AJ3),AJ3)","v":0},{"$f":"IF(J4=\"Дома\",IF(L4=2,AK3+1,AK3),AK3)","v":0},{"$f":"IF(J4=\"Дома\",IF(L4>=3,AL3+1,AL3),AL3)","v":0},{"$f":"IF(J4<>\"Дома\",IF(L4=0,AM3+1,AM3),AM3)","v":0},{"$f":"IF(J4<>\"Дома\",IF(L4=1,AN3+1,AN3),AN3)","v":1},{"$f":"IF(J4<>\"Дома\",IF(L4=2,AO3+1,AO3),AO3)","v":0},{"$f":"IF(J4<>\"Дома\",IF(L4>=3,AP3+1,AP3),AP3)","v":0},0.5,1.5,-0.13333333333333333,"",""]
[{"$f":"Гости!B4","v":"2021.05.20 17:40"},{"$f":"Гости!A4","v":"ИРАН: Первый дивизион"},{"$f":"Гости!C4","v":"Могхавемат"},{"$f":"Гости!D4","v":"Эстеглал Моласани"},{"$f":"CONCATENATE(Гости!E4,\"-\",Гости!F4)","v":"1-0"},"Могхавемат","Эстеглал Моласани",1,0,"В гостях","П",0,1,3,0,0,3,1,4,0,1,0,0,1,0,1,0,2,0,0,2,1,3,0,1,0,0,0,1,1,0,0,0.33333333333333331,1.3333333333333333,-0.15,"П",1]
[{"$f":"Гости!B5","v":"2021.05.14 19:00"},{"$f":"Гости!A5","v":"ИРАН: Первый дивизион"},{"$f":"Гости!C5","v":"Эстеглал Моласани"},{"$f":"Гости!D5","v":"Навад Урмия"},{"$f":"CONCATENATE(Гости!E5,\"-\",Гости!F5)","v":"0-0"},"Эстеглал Моласани","Навад Урмия",0,0,"Дома","Н",0,0,4,0,1,3,1,4,1,2,0,1,1,0,1,1,2,0,0,2,1,3,0,2,0,0,0,1,1,0,0,0.25,1,-6.6666666666666666E-2,"",""]
[{"$f":"Гости!B6","v":"2021.05.08 19:00"},{"$f":"Гости!A6","v":"ИРАН: Первый дивизион"},{"$f":"Гости!C6","v":"Гол Рейхан"},{"$f":"Гости!D6","v":"Эстеглал Моласани"},{"$f":"CONCATENATE(Гости!E6,\"-\",Гости!F6)","v":"0-0"},"Гол Рейхан","Эстеглал Моласани",0,0,"В гостях","Н",0,0,5,0,2,3,1,4,2,2,0,1,1,0,1,1,3,0,1,2,1,3,1,2,0,0,0,2,1,0,0,0.2,0.8,-1.6666666666666666E-2,"Н",0]
[{"$f":"Гости!B7","v":"2021.04.26 18:45"},{"$f":"Гости!A7","v":"ИРАН: Первый дивизион"},{"$f":"Гости!C7","v":"Эстеглал Моласани"},{"$f":"Гости!D7","v":"Астара"},{"$f":"CONCATENATE(Гости!E7,\"-\",Гости!F7)","v":"1-0"},"Эстеглал Моласани","Астара",1,0,"Дома","В",1,0,6,1,2,3,2,4,5,3,1,1,1,1,1,4,3,0,1,2,1,3,1,2,1,0,0,2,1,0,0,0.33333333333333331,0.66666666666666663,7.7777777777777765E-2,"",""]
[{"$f":"Гости!B8","v":"2021.04.19 20:30"},{"$f":"Гости!A8","v":"ИРАН: Первый дивизион"},{"$f":"Гости!C8","v":"Эстеглал Хузестан"},{"$f":"Гости!D8","v":"Эстеглал Моласани"},{"$f":"CONCATENATE(Гости!E8,\"-\",Гости!F8)","v":"2-0"},"Эстеглал Хузестан","Эстеглал Моласани",2,0,"В гостях","П",0,2,7,1,2,4,2,6,5,3,1,1,1,1,1,4,4,0,1,3,1,5,1,2,1,0,0,3,1,0,0,0.2857142857142857,0.8571428571428571,4.4444444444444432E-2,"П",2]
[{"$f":"Гости!B9","v":"2021.04.13 15:30"},{"$f":"Гости!A9","v":"ИРАН: Первый дивизион"},{"$f":"Гости!C9","v":"Эстеглал Моласани"},{"$f":"Гости!D9","v":"Хейбар Хоррамабад"},{"$f":"CONCATENATE(Гости!E9,\"-\",Гости!F9)","v":"0-1"},"Эстеглал Моласани","Хейбар Хоррамабад",0,1,"Дома","П",0,1,8,1,2,5,2,7,5,4,1,1,2,1,2,4,4,0,1,3,1,5,1,3,1,0,0,3,1,0,0,0.25,0.875,0,"",""]
[{"$f":"Гости!B10","v":"2021.04.07 15:00"},{"$f":"Гости!A10","v":"ИРАН: Первый дивизион"},{"$f":"Гости!C10","v":"Хавадар"},{"$f":"Гости!D10","v":"Эстеглал Моласани"},{"$f":"CONCATENATE(Гости!E10,\"-\",Гости!F10)","v":"0-0"},"Хавадар","Эстеглал Моласани",0,0,"В гостях","Н",0,0,9,1,3,5,2,7,6,4,1,1,2,1,2,4,5,0,2,3,1,5,2,3,1,0,0,4,1,0,0,0.22222222222222221,0.77777777777777779,2.6666666666666689E-2,"Н",0]
[{"$f":"Гости!B11","v":"2021.03.17 15:00"},{"$f":"Гости!A11","v":"ИРАН: Первый дивизион"},{"$f":"Гости!C11","v":"Эстеглал Моласани"},{"$f":"Гости!D11","v":"Райка Баболь"},{"$f":"CONCATENATE(Гости!E11,\"-\",Гости!F11)","v":"0-0"},"Эстеглал Моласани","Райка Баболь",0,0,"Дома","Н",0,0,10,1,4,5,2,7,7,5,1,2,2,1,2,5,5,0,2,3,1,5,2,4,1,0,0,4,1,0,0,0.2,0.7,3.3333333333333333E-2,"",""]

{"sheet":"ДомаДома","index":6,"n_rows":150,"n_cols":35,"rows_kept":150,"cut":false,"hidden":true,"merged":[]}
["Чемпионат","Дата/Время","Дома","Гости","К1 в 1Т","К2 в 1Т","К1 во 2Т","К2 во 2Т","Где играли","К1 Голов","К2 Голов","Забито","Пропущено","Результат","Всего Игр","Всего выиграно","Всего ничьих","Всего проиграно","Всего забито","Всего пропущено","Всего очков","Дома игр","Дома выиграно","Дома ничьих","Дома проиграно","Дома забито","Дома пропущено","Дома очков","Гости игр","Гости выиграно","Гости ничьих","Гости проиграно","Гости забито","Гости пропущено","Гости очков"]
["ИРАН: Первый дивизион","2021.05.26 18:05","Бадеран Тегеран","Навад Урмия",0,0,1,0,"Дома",{"$f":"IF(I2=\"\",\"\",E2+G2)","v":1},{"$f":"IF(I2=\"\",\"\",F2+H2)","v":0},{"$f":"IF(I2=\"\",\"\",IF(I2=\"Дома\",J2,K2))","v":1},{"$f":"IF(I2=\"\",\"\",IF(I2=\"Дома\",K2,J2))","v":0},{"$f":"IF(I2=\"\",\"\",IF(I2=\"Дома\",IF(J2>K2,\"В\",IF(J2=K2,\"Н\",\"П\")),IF(J2<K2,\"В\",IF(J2=K2,\"Н\",\"П\"))))","v":"В"},{"$f":"IF(I2=\"\",\"\",1)","v":1},{"$f":"IF(I2=\"\",\"\",IF(N2=\"В\",1,0))","v":1},{"$f":"IF(I2=\"\",\"\",IF(N2=\"Н\",1,0))","v":0},{"$f":"IF(I2=\"\",\"\",IF(N2=\"П\",1,0))","v":0},{"$f":"IF(I2=\"\",\"\",L2)","v":1},{"$f":"IF(I2=\"\",\"\",M2)","v":0},{"$f":"IF(I2=\"\",\"\",P2*3+Q2)","v":3},{"$f":"IF(I2=\"\",\"\",IF(I2=\"Дома\",1,0))","v":1},{"$f":"IF(I2=\"\",\"\",IF(I2=\"Дома\",IF(N2=\"В\",1,0),0))","v":1},{"$f":"IF(I2=\"\",\"\",IF(I2=\"Дома\",IF(N2=\"Н\",1,0),0))","v":0},{"$f":"IF(I2=\"\",\"\",IF(I2=\"Дома\",IF(N2=\"П\",1,0),0))","v":0},{"$f":"IF(I2=\"\",\"\",IF(I2=\"Дома\",L2,0))","v":1},{"$f":"IF(I2=\"\",\"\",IF(I2=\"Дома\",M2,0))","v":0},{"$f":"IF(I2=\"\",\"\",IF(I2=\"Дома\",W2*3+X2,0))","v":3},{"$f":"IF(I2=\"\",\"\",IF(I2=\"Гости\",1,0))","v":0},{"$f":"IF(I2=\"\",\"\",IF(I2=\"Гости\",IF(N2=\"В\",1,0),0))","v":0},{"$f":"IF(I2=\"\",\"\",IF(I2=\"Гости\",IF(N2=\"Н\",1,0),0))","v":0},{"$f":"IF(I2=\"\",\"\",IF(I2=\"Гости\",IF(N2=\"П\",1,0),0))","v":0},{"$f":"IF(I2=\"\",\"\",IF(I2=\"Гости\",L2,0))","v":0},{"$f":"IF(I2=\"\",\"\",IF(I2=\"Гости\",M2,0))","v":0},{"$f":"IF(I2=\"\",\"\",IF(I2=\"Гости\",AD2*3+AE2,0))","v":0}]
["ИРАН: Первый дивизион","2021.05.14 16:45","Бадеран Тегеран","Гол Рейхан",2,1,0,0,"Дома",{"$f":"IF(I3=\"\",\"\",E3+G3)","v":2},{"$f":"IF(I3=\"\",\"\",F3+H3)","v":1},{"$f":"IF(I3=\"\",\"\",IF(I3=\"Дома\",J3,K3))","v":2},{"$f":"IF(I3=\"\",\"\",IF(I3=\"Дома\",K3,J3))","v":1},{"$f":"IF(I3=\"\",\"\",IF(I3=\"Дома\",IF(J3>K3,\"В\",IF(J3=K3,\"Н\",\"П\")),IF(J3<K3,\"В\",IF(J3=K3,\"Н\",\"П\"))))","v":"В"},{"$f":"IF(I3=\"\",\"\",O2+1)","v":2},{"$f":"IF(I3=\"\",\"\",IF(N3=\"В\",P2+1,P2))","v":2},{"$f":"IF(I3=\"\",\"\",IF(N3=\"Н\",Q2+1,Q2))","v":0},{"$f":"IF(I3=\"\",\"\",IF(N3=\"П\",R2+1,R2))","v":0},{"$f":"IF(I3=\"\",\"\",S2+L3)","v":3},{"$f":"IF(I3=\"\",\"\",T2+M3)","v":1},{"$f":"IF(I3=\"\",\"\",P3*3+Q3)","v":6},{"$f":"IF(I3=\"\",\"\",IF(I3=\"Дома\",V2+1,V2+0))","v":2},{"$f":"IF(I3=\"\",\"\",IF(I3=\"Дома\",IF(N3=\"В\",W2+1,W2),W2))","v":2},{"$f":"IF(I3=\"\",\"\",IF(I3=\"Дома\",IF(N3=\"Н\",X2+1,X2),X2))","v":0},{"$f":"IF(I3=\"\",\"\",IF(I3=\"Дома\",IF(N3=\"П\",Y2+1,Y2),Y2))","v":0},{"$f":"IF(I3=\"\",\"\",IF(I3=\"Дома\",L3+Z2,Z2))","v":3},{"$f":"IF(I3=\"\",\"\",IF(I3=\"Дома\",M3+AA2,AA2))","v":1},{"$f":"IF(I3=\"\",\"\",IF(I3=\"Дома\",W3*3+X3,AB2))","v":6},{"$f":"IF(I3=\"\",\"\",IF(I3=\"Гости\",AC2+1,AC2+0))","v":0},{"$f":"IF(I3=\"\",\"\",IF(I3=\"Гости\",IF(N3=\"В\",AD2+1,AD2),AD2))","v":0},{"$f":"IF(I3=\"\",\"\",IF(I3=\"Гости\",IF(N3=\"Н\",AE2+1,AE2),AE2))","v":0},{"$f":"IF(I3=\"\",\"\",IF(I3=\"Гости\",IF(N3=\"П\",AF2+1,AF2),AF2))","v":0},{"$f":"IF(I3=\"\",\"\",IF(I3=\"Гости\",L3+AG2,AG2))","v":0},{"$f":"IF(I3=\"\",\"\",IF(I3=\"Гости\",M3+AH2,AH2))","v":0},{"$f":"IF(I3=\"\",\"\",IF(I3=\"Гости\",AD3*3+AE3,AI2))","v":0}]
["ИРАН: Первый дивизион","2021.04.26 18:45","Бадеран Тегеран","Хавадар",0,1,0,1,"Дома",0,2,0,2,"П",3,{"$f":"IF(I4=\"\",\"\",IF(N4=\"В\",P3+1,P3))","v":2},{"$f":"IF(I4=\"\",\"\",IF(N4=\"Н\",Q3+1,Q3))","v":0},{"$f":"IF(I4=\"\",\"\",IF(N4=\"П\",R3+1,R3))","v":1},{"$f":"IF(I4=\"\",\"\",S3+L4)","v":3},{"$f":"IF(I4=\"\",\"\",T3+M4)","v":3},6,{"$f":"IF(I4=\"\",\"\",IF(I4=\"Дома\",V3+1,V3+0))","v":3},{"$f":"IF(I4=\"\",\"\",IF(I4=\"Дома\",IF(N4=\"В\",W3+1,W3),W3))","v":2},{"$f":"IF(I4=\"\",\"\",IF(I4=\"Дома\",IF(N4=\"Н\",X3+1,X3),X3))","v":0},{"$f":"IF(I4=\"\",\"\",IF(I4=\"Дома\",IF(N4=\"П\",Y3+1,Y3),Y3))","v":1},{"$f":"IF(I4=\"\",\"\",IF(I4=\"Дома\",L4+Z3,Z3))","v":3},{"$f":"IF(I4=\"\",\"\",IF(I4=\"Дома\",M4+AA3,AA3))","v":3},{"$f":"IF(I4=\"\",\"\",IF(I4=\"Дома\",W4*3+X4,AB3))","v":6},{"$f":"IF(I4=\"\",\"\",IF(I4=\"Гости\",AC3+1,AC3+0))","v":0},{"$f":"IF(I4=\"\",\"\",IF(I4=\"Гости\",IF(N4=\"В\",AD3+1,AD3),AD3))","v":0},{"$f":"IF(I4=\"\",\"\",IF(I4=\"Гости\",IF(N4=\"Н\",AE3+1,AE3),AE3))","v":0},{"$f":"IF(I4=\"\",\"\",IF(I4=\"Гости\",IF(N4=\"П\",AF3+1,AF3),AF3))","v":0},{"$f":"IF(I4=\"\",\"\",IF(I4=\"Гости\",L4+AG3,AG3))","v":0},{"$f":"IF(I4=\"\",\"\",IF(I4=\"Гости\",M4+AH3,AH3))","v":0},{"$f":"IF(I4=\"\",\"\",IF(I4=\"Гости\",AD4*3+AE4,AI3))","v":0}]
["ИРАН: Первый дивизион","2021.04.13 15:00","Бадеран Тегеран","Арман Гохар",2,0,0,0,"Дома",2,0,2,0,"В",4,3,0,1,5,3,9,4,3,0,1,5,3,9,0,0,0,0,0,0,0]
["ИРАН: Первый дивизион","2021.03.14 14:30","Бадеран Тегеран","Эстеглал Хузестан",0,0,0,0,"Дома",0,0,0,0,"Н",5,3,1,1,5,3,10,5,3,1,1,5,3,10,0,0,0,0,0,0,0]
["ИРАН: Первый дивизион","2021.03.07 14:15","Бадеран Тегеран","Малаван",1,0,2,0,"Дома",3,0,3,0,"В",6,4,1,1,8,3,13,6,4,1,1,8,3,13,0,0,0,0,0,0,0]
["ИРАН: Первый дивизион","2021.02.20 14:00","Бадеран Тегеран","Кашкай Шираз",1,1,0,2,"Дома",1,3,1,3,"П",7,4,1,2,9,6,13,7,4,1,2,9,6,13,0,0,0,0,0,0,0]
["ИРАН: Первый дивизион","2021.02.07 13:30","Бадеран Тегеран","Парс Джануби Джем",0,0,1,0,"Дома",1,0,1,0,{"$f":"IF(I9=\"\",\"\",IF(I9=\"Дома\",IF(J9>K9,\"В\",IF(J9=K9,\"Н\",\"П\")),IF(J9<K9,\"В\",IF(J9=K9,\"Н\",\"П\"))))","v":"В"},8,5,1,2,10,6,16,8,5,1,2,10,6,16,0,0,0,0,0,0,0]
["ИРАН: Первый дивизион","2021.02.01 13:30","Бадеран Тегеран","Мес Керман",1,1,1,0,"Дома",2,1,2,1,{"$f":"IF(I10=\"\",\"\",IF(I10=\"Дома\",IF(J10>K10,\"В\",IF(J10=K10,\"Н\",\"П\")),IF(J10<K10,\"В\",IF(J10=K10,\"Н\",\"П\"))))","v":"В"},9,6,1,2,12,7,19,9,6,1,2,12,7,19,0,0,0,0,0,0,0]
["ИРАН: Первый дивизион","2021.01.18 13:30","Бадеран Тегеран","Хуши-Талаи",1,1,0,0,"Дома",1,1,1,1,"Н",10,6,2,2,13,8,20,10,6,2,2,13,8,20,0,0,0,0,0,0,0]
["ИРАН: Первый дивизион","2021.01.04 13:30","Бадеран Тегеран","Шахин Бушехр",0,0,0,0,"Дома",0,0,0,0,"Н",11,6,3,2,13,8,{"$f":"IF(I12=\"\",\"\",P12*3+Q12)","v":21},11,6,3,2,13,8,21,0,0,0,0,0,0,0]
["ИРАН: Первый дивизион","2020.12.22 13:30","Бадеран Тегеран","Могхавемат",0,0,0,1,"Дома",0,1,0,1,"П",12,6,3,3,13,9,21,12,6,3,3,13,9,21,0,0,0,0,0,0,0]
["ИРАН: Первый дивизион","2020.12.10 13:30","Бадеран Тегеран","Астара",0,0,1,0,"Дома",1,0,1,0,"В",13,7,3,3,14,9,24,13,7,3,3,14,9,24,0,0,0,0,0,0,0]
["ИРАН: Первый дивизион","2020.11.29 14:15","Бадеран Тегеран","Хейбар Хоррамабад",1,0,0,0,"Дома",1,0,1,0,"В",14,8,3,3,15,9,27,14,8,3,3,15,9,27,0,0,0,0,0,0,0]
["ИРАН: Первый дивизион","2020.08.08 18:30","Бадеран Тегеран","Сепидруд Рашт",0,0,1,0,"Дома",1,0,1,0,"В",15,9,3,3,16,9,30,15,9,3,3,16,9,30,0,0,0,0,0,0,0]
["ИРАН: Первый дивизион","2020.08.02 18:00","Бадеран Тегеран","Навад Урмия",1,0,1,0,"Дома",2,0,2,0,"В",16,10,3,3,18,9,33,16,10,3,3,18,9,33,0,0,0,0,0,0,0]
["ИРАН: Первый дивизион","2020.07.19 17:40","Бадеран Тегеран","Могхавемат",1,1,2,0,"Дома",3,1,3,1,"В",17,11,3,3,21,10,36,17,11,3,3,21,10,36,0,0,0,0,0,0,0]
["ИРАН: Первый дивизион","2020.07.06 18:20","Бадеран Тегеран","Мес Керман",0,0,1,2,"Дома",1,2,1,2,"П",18,11,3,4,22,12,36,18,11,3,4,22,12,36,0,0,0,0,0,0,0]
["ИРАН: Первый дивизион","2020.02.28 12:00","Бадеран Тегеран","Damash Gilan",1,1,1,0,"Дома",2,1,2,1,"В",19,12,3,4,24,13,39,19,12,3,4,24,13,39,0,0,0,0,0,0,0]
["ИРАН: Первый дивизион","2020.02.16 13:45","Бадеран Тегеран","Кашкай Шираз",3,0,1,3,"Дома",4,3,4,3,"В",20,13,3,4,28,16,42,20,13,3,4,28,16,42,0,0,0,0,0,0,0]
["ИРАН: Первый дивизион","2020.02.02 13:30","Бадеран Тегеран","Арман Гохар",1,0,3,0,"Дома",4,0,4,0,"В",21,14,3,4,32,16,45,21,14,3,4,32,16,45,0,0,0,0,0,0,0]
[null,null,null,null,null,null,null,null,null,"","","","","","","","","","","","","","","","","","","","","","","","","",""]
[null,null,null,null,null,null,null,null,null,"","","","","","","","","","","","","","","","","","","","","","","","","",""]
[null,null,null,null,null,null,null,null,null,"","","","","","","","","","","","","","","","","","","","","","","","","",""]
[null,null,null,null,null,null,null,null,null,"","","","","","","","","","","","","","","","","","","","","","","","","",""]
[null,null,null,null,null,null,null,null,null,"","","","","","","","","","","","","","","","","","","","","","","","","",""]
[null,null,null,null,null,null,null,null,null,"","","","","","","","","","","","","","","","","","","","","","","","","",""]
[null,null,null,null,null,null,null,null,null,"","","","","","","","","","","","","","","","","","","","","","","","","",""]
[null,null,null,null,null,null,null,null,null,"","","","","","","","","","","","","","","","","","","","","","","","","",""]
[null,null,null,null,null,null,null,null,null,"","","","","","","","","","","","","","","","","","","","","","","","","",""]
[null,null,null,null,null,null,null,null,null,"","","","","","","","","","","","","","","","","","","","","","","","","",""]
[null,null,null,null,null,null,null,null,null,"","","","","","","","","","","","","","","","","","","","","","","","","",""]
[null,null,null,null,null,null,null,null,null,"","","","","","","","","","","","","","","","","","","","","","","","","",""]
[null,null,null,null,null,null,null,null,null,"","","","","","","","","","","","","","","","","","","","","","","","","",""]
[null,null,null,null,null,null,null,null,null,"","","","","","","","","","","","","","","","","","","","","","","","","",""]
[null,null,null,null,null,null,null,null,null,"","","","","","","","","","","","","","","","","","","","","","","","","",""]
[null,null,null,null,null,null,null,null,null,"","","","","","","","","","","","","","","","","","","","","","","","","",""]
[null,null,null,null,null,null,null,null,null,"","","","","","","","","","","","","","","","","","","","","","","","","",""]
[null,null,null,null,null,null,null,null,null,"","","","","","","","","","","","","","","","","","","","","","","","","",""]
[null,null,null,null,null,null,null,null,null,"","","","","","","","","","","","","","","","","","","","","","","","","",""]
[null,null,null,null,null,null,null,null,null,"","","","","","","","","","","","","","","","","","","","","","","","","",""]
[null,null,null,null,null,null,null,null,null,"","","","","","","","","","","","","","","","","","","","","","","","","",""]
[null,null,null,null,null,null,null,null,null,"","","","","","","","","","","","","","","","","","","","","","","","","",""]
[null,null,null,null,null,null,null,null,null,"","","","","","","","","","","","","","","","","","","","","","","","","",""]
[null,null,null,null,null,null,null,null,null,"","","","","","","","","","","","","","","","","","","","","","","","","",""]
[null,null,null,null,null,null,null,null,null,"","","","","","","","","","","","","","","","","","","","","","","","","",""]
[null,null,null,null,null,null,null,null,null,"","","","","","","","","","","","","","","","","","","","","","","","","",""]
[null,null,null,null,null,null,null,null,null,"","","","","","","","","","","","","","","","","","","","","","","","","",""]
[null,null,null,null,null,null,null,null,null,"","","","","","","","","","","","","","","","","","","","","","","","","",""]
[null,null,null,null,null,null,null,null,null,"","","","","","","","","","","","","","","","","","","","","","","","","",""]
[null,null,null,null,null,null,null,null,null,"","","","","","","","","","","","","","","","","","","","","","","","","",""]
[null,null,null,null,null,null,null,null,null,"","","","","","","","","","","","","","","","","","","","","","","","","",""]
[null,null,null,null,null,null,null,null,null,"","","","","","","","","","","","","","","","","","","","","","","","","",""]
[null,null,null,null,null,null,null,null,null,"","","","","","","","","","","","","","","","","","","","","","","","","",""]
[null,null,null,null,null,null,null,null,null,"","","","","","","","","","","","","","","","","","","","","","","","","",""]
[null,null,null,null,null,null,null,null,null,"","","","","","","","","","","","","","","","","","","","","","","","","",""]
[null,null,null,null,null,null,null,null,null,"","","","","","","","","","","","","","","","","","","","","","","","","",""]
[null,null,null,null,null,null,null,null,null,"","","","","","","","","","","","","","","","","","","","","","","","","",""]
[null,null,null,null,null,null,null,null,null,"","","","","","","","","","","","","","","","","","","","","","","","","",""]
[null,null,null,null,null,null,null,null,null,"","","","","","","","","","","","","","","","","","","","","","","","","",""]
[null,null,null,null,null,null,null,null,null,"","","","","","","","","","","","","","","","","","","","","","","","","",""]
[null,null,null,null,null,null,null,null,null,"","","","","","","","","","","","","","","","","","","","","","","","","",""]
[null,null,null,null,null,null,null,null,null,"","","","","","","","","","","","","","","","","","","","","","","","","",""]
[null,null,null,null,null,null,null,null,null,"","","","","","","","","","","","","","","","","","","","","","","","","",""]
[null,null,null,null,null,null,null,null,null,"","","","","","","","","","","","","","","","","","","","","","","","","",""]
[null,null,null,null,null,null,null,null,null,{"$f":"IF(I67=\"\",\"\",E67+G67)","v":""},{"$f":"IF(I67=\"\",\"\",F67+H67)","v":""},{"$f":"IF(I67=\"\",\"\",IF(I67=\"Дома\",J67,K67))","v":""},{"$f":"IF(I67=\"\",\"\",IF(I67=\"Дома\",K67,J67))","v":""},"",{"$f":"IF(I67=\"\",\"\",O66+1)","v":""},"","","","","",{"$f":"IF(I67=\"\",\"\",P67*3+Q67)","v":""},"","","","","","","","","","","","","",""]
[null,null,null,null,null,null,null,null,null,"","","","","","",{"$f":"IF(I68=\"\",\"\",IF(N68=\"В\",P67+1,P67))","v":""},{"$f":"IF(I68=\"\",\"\",IF(N68=\"Н\",Q67+1,Q67))","v":""},{"$f":"IF(I68=\"\",\"\",IF(N68=\"П\",R67+1,R67))","v":""},{"$f":"IF(I68=\"\",\"\",S67+L68)","v":""},{"$f":"IF(I68=\"\",\"\",T67+M68)","v":""},"",{"$f":"IF(I68=\"\",\"\",IF(I68=\"Дома\",V67+1,V67+0))","v":""},{"$f":"IF(I68=\"\",\"\",IF(I68=\"Дома\",IF(N68=\"В\",W67+1,W67),W67))","v":""},{"$f":"IF(I68=\"\",\"\",IF(I68=\"Дома\",IF(N68=\"Н\",X67+1,X67),X67))","v":""},{"$f":"IF(I68=\"\",\"\",IF(I68=\"Дома\",IF(N68=\"П\",Y67+1,Y67),Y67))","v":""},{"$f":"IF(I68=\"\",\"\",IF(I68=\"Дома\",L68+Z67,Z67))","v":""},{"$f":"IF(I68=\"\",\"\",IF(I68=\"Дома\",M68+AA67,AA67))","v":""},{"$f":"IF(I68=\"\",\"\",IF(I68=\"Дома\",W68*3+X68,AB67))","v":""},{"$f":"IF(I68=\"\",\"\",IF(I68=\"Гости\",AC67+1,AC67+0))","v":""},{"$f":"IF(I68=\"\",\"\",IF(I68=\"Гости\",IF(N68=\"В\",AD67+1,AD67),AD67))","v":""},{"$f":"IF(I68=\"\",\"\",IF(I68=\"Гости\",IF(N68=\"Н\",AE67+1,AE67),AE67))","v":""},{"$f":"IF(I68=\"\",\"\",IF(I68=\"Гости\",IF(N68=\"П\",AF67+1,AF67),AF67))","v":""},{"$f":"IF(I68=\"\",\"\",IF(I68=\"Гости\",L68+AG67,AG67))","v":""},{"$f":"IF(I68=\"\",\"\",IF(I68=\"Гости\",M68+AH67,AH67))","v":""},{"$f":"IF(I68=\"\",\"\",IF(I68=\"Гости\",AD68*3+AE68,AI67))","v":""}]
[null,null,null,null,null,null,null,null,null,"","","","","","","","","","","","","","","","","","","","","","","","","",""]
[null,null,null,null,null,null,null,null,null,"","","","","","","","","","","","","","","","","","","","","","","","","",""]
[null,null,null,null,null,null,null,null,null,"","","","","","","","","","","","","","","","","","","","","","","","","",""]
[null,null,null,null,null,null,null,null,null,"","","","","","","","","","","","","","","","","","","","","","","","","",""]
[null,null,null,null,null,null,null,null,null,"","","","","","","","","","","","","","","","","","","","","","","","","",""]
[null,null,null,null,null,null,null,null,null,"","","","",{"$f":"IF(I74=\"\",\"\",IF(I74=\"Дома\",IF(J74>K74,\"В\",IF(J74=K74,\"Н\",\"П\")),IF(J74<K74,\"В\",IF(J74=K74,\"Н\",\"П\"))))","v":""},"","","","","","","","","","","","","","","","","","","","",""]
[null,null,null,null,null,null,null,null,null,"","","","","","","","","","","","","","","","","","","","","","","","","",""]
[null,null,null,null,null,null,null,null,null,"","","","","","","","","","","","","","","","","","","","","","","","","",""]
[null,null,null,null,null,null,null,null,null,"","","","","","","","","","","","","","","","","","","","","","","","","",""]
[null,null,null,null,null,null,null,null,null,"","","","","","","","","","","","","","","","","","","","","","","","","",""]
[null,null,null,null,null,null,null,null,null,"","","","","","","","","","","","","","","","","","","","","","","","","",""]
[null,null,null,null,null,null,null,null,null,"","","","","","","","","","","","","","","","","","","","","","","","","",""]
[null,null,null,null,null,null,null,null,null,"","","","","","","","","","","","","","","","","","","","","","","","","",""]
[null,null,null,null,null,null,null,null,null,"","","","","","","","","","","","","","","","","","","","","","","","","",""]
[null,null,null,null,null,null,null,null,null,"","","","","","","","","","","","","","","","","","","","","","","","","",""]
[null,null,null,null,null,null,null,null,null,"","","","","","","","","","","","","","","","","","","","","","","","","",""]
[null,null,null,null,null,null,null,null,null,"","","","","","","","","","","","","","","","","","","","","","","","","",""]
[null,null,null,null,null,null,null,null,null,"","","","","","","","","","","","","","","","","","","","","","","","","",""]
[null,null,null,null,null,null,null,null,null,"","","","","","","","","","","","","","","","","","","","","","","","","",""]
[null,null,null,null,null,null,null,null,null,"","","","","","","","","","","","","","","","","","","","","","","","","",""]
[null,null,null,null,null,null,null,null,null,"","","","","","","","","","","","","","","","","","","","","","","","","",""]
[null,null,null,null,null,null,null,null,null,"","","","","","","","","","","","","","","","","","","","","","","","","",""]
[null,null,null,null,null,null,null,null,null,"","","","","","","","","","","","","","","","","","","","","","","","","",""]
[null,null,null,null,null,null,null,null,null,"","","","","","","","","","","","","","","","","","","","","","","","","",""]
[null,null,null,null,null,null,null,null,null,"","","","","","","","","","","","","","","","","","","","","","","","","",""]
[null,null,null,null,null,null,null,null,null,"","","","","","","","","","","","","","","","","","","","","","","","","",""]
[null,null,null,null,null,null,null,null,null,"","","","","","","","","","","","","","","","","","","","","","","","","",""]
[null,null,null,null,null,null,null,null,null,"","","","","","","","","","","","","","","","","","","","","","","","","",""]
[null,null,null,null,null,null,null,null,null,"","","","","","","","","","","","","","","","","","","","","","","","","",""]
[null,null,null,null,null,null,null,null,null,"","","","","","","","","","","","","","","","","","","","","","","","","",""]
[null,null,null,null,null,null,null,null,null,"","","","","","","","","","","","","","","","","","","","","","","","","",""]
[null,null,null,null,null,null,null,null,null,"","","","","","","","","","","","","","","","","","","","","","","","","",""]
[null,null,null,null,null,null,null,null,null,"","","","","","","","","","","","","","","","","","","","","","","","","",""]
[null,null,null,null,null,null,null,null,null,"","","","","","","","","","","","","","","","","","","","","","","","","",""]
[null,null,null,null,null,null,null,null,null,"","","","","","","","","","","","","","","","","","","","","","","","","",""]
[null,null,null,null,null,null,null,null,null,"","","","","","","","","","","","","","","","","","","","","","","","","",""]
[null,null,null,null,null,null,null,null,null,"","","","","","","","","","","","","","","","","","","","","","","","","",""]
[null,null,null,null,null,null,null,null,null,"","","","","","","","","","","","","","","","","","","","","","","","","",""]
[null,null,null,null,null,null,null,null,null,"","","","","","","","","","","","","","","","","","","","","","","","","",""]
[null,null,null,null,null,null,null,null,null,"","","","","","","","","","","","","","","","","","","","","","","","","",""]
[null,null,null,null,null,null,null,null,null,"","","","","","","","","","","","","","","","","","","","","","","","","",""]
[null,null,null,null,null,null,null,null,null,"","","","","","","","","","","","","","","","","","","","","","","","","",""]
[null,null,null,null,null,null,null,null,null,"","","","","","","","","","","","","","","","","","","","","","","","","",""]
[null,null,null,null,null,null,null,null,null,"","","","","","","","","","","","","","","","","","","","","","","","","",""]
[null,null,null,null,null,null,null,null,null,"","","","","","","","","","","","","","","","","","","","","","","","","",""]
[null,null,null,null,null,null,null,null,null,"","","","","","","","","","","","","","","","","","","","","","","","","",""]
[null,null,null,null,null,null,null,null,null,"","","","","","","","","","","","","","","","","","","","","","","","","",""]
[null,null,null,null,null,null,null,null,null,"","","","","","","","","","","","","","","","","","","","","","","","","",""]
[null,null,null,null,null,null,null,null,null,"","","","","","","","","","","","","","","","","","","","","","","","","",""]
[null,null,null,null,null,null,null,null,null,"","","","","","","","","","","","","","","","","","","","","","","","","",""]
[null,null,null,null,null,null,null,null,null,"","","","","","","","","","","","","","","","","","","","","","","","","",""]
[null,null,null,null,null,null,null,null,null,"","","","","","","","","","","","","","","","","","","","","","","","","",""]
[null,null,null,null,null,null,null,null,null,"","","","","","","","","","","","","","","","","","","","","","","","","",""]
[null,null,null,null,null,null,null,null,null,"","","","","","","","","","","","","","","","","","","","","","","","","",""]
[null,null,null,null,null,null,null,null,null,"","","","","","","","","","","","","","","","","","","","","","","","","",""]
[null,null,null,null,null,null,null,null,null,"","","","","","","","","","","","","","","","","","","","","","","","","",""]
[null,null,null,null,null,null,null,null,null,"","","","","","","","","","","","","","","","","","","","","","","","","",""]
[null,null,null,null,null,null,null,null,null,"","","","","","","","","","","","","","","","","","","","","","","","","",""]
[null,null,null,null,null,null,null,null,null,"","","","","","","","","","","","","","","","","","","","","","","","","",""]
[null,null,null,null,null,null,null,null,null,"","","","","","","","","","","","","","","","","","","","","","","","","",""]
[null,null,null,null,null,null,null,null,null,"","","","","","","","","","","","","","","","","","","","","","","","","",""]
[null,null,null,null,null,null,null,null,null,"","","","","","","","","","","","","","","","","","","","","","","","","",""]
[null,null,null,null,null,null,null,null,null,{"$f":"IF(I131=\"\",\"\",E131+G131)","v":""},{"$f":"IF(I131=\"\",\"\",F131+H131)","v":""},{"$f":"IF(I131=\"\",\"\",IF(I131=\"Дома\",J131,K131))","v":""},{"$f":"IF(I131=\"\",\"\",IF(I131=\"Дома\",K131,J131))","v":""},"",{"$f":"IF(I131=\"\",\"\",O130+1)","v":""},"","","","","",{"$f":"IF(I131=\"\",\"\",P131*3+Q131)","v":""},"","","","","","","","","","","","","",""]
[null,null,null,null,null,null,null,null,null,"","","","","","",{"$f":"IF(I132=\"\",\"\",IF(N132=\"В\",P131+1,P131))","v":""},{"$f":"IF(I132=\"\",\"\",IF(N132=\"Н\",Q131+1,Q131))","v":""},{"$f":"IF(I132=\"\",\"\",IF(N132=\"П\",R131+1,R131))","v":""},{"$f":"IF(I132=\"\",\"\",S131+L132)","v":""},{"$f":"IF(I132=\"\",\"\",T131+M132)","v":""},"",{"$f":"IF(I132=\"\",\"\",IF(I132=\"Дома\",V131+1,V131+0))","v":""},{"$f":"IF(I132=\"\",\"\",IF(I132=\"Дома\",IF(N132=\"В\",W131+1,W131),W131))","v":""},{"$f":"IF(I132=\"\",\"\",IF(I132=\"Дома\",IF(N132=\"Н\",X131+1,X131),X131))","v":""},{"$f":"IF(I132=\"\",\"\",IF(I132=\"Дома\",IF(N132=\"П\",Y131+1,Y131),Y131))","v":""},{"$f":"IF(I132=\"\",\"\",IF(I132=\"Дома\",L132+Z131,Z131))","v":""},{"$f":"IF(I132=\"\",\"\",IF(I132=\"Дома\",M132+AA131,AA131))","v":""},{"$f":"IF(I132=\"\",\"\",IF(I132=\"Дома\",W132*3+X132,AB131))","v":""},{"$f":"IF(I132=\"\",\"\",IF(I132=\"Гости\",AC131+1,AC131+0))","v":""},{"$f":"IF(I132=\"\",\"\",IF(I132=\"Гости\",IF(N132=\"В\",AD131+1,AD131),AD131))","v":""},{"$f":"IF(I132=\"\",\"\",IF(I132=\"Гости\",IF(N132=\"Н\",AE131+1,AE131),AE131))","v":""},{"$f":"IF(I132=\"\",\"\",IF(I132=\"Гости\",IF(N132=\"П\",AF131+1,AF131),AF131))","v":""},{"$f":"IF(I132=\"\",\"\",IF(I132=\"Гости\",L132+AG131,AG131))","v":""},{"$f":"IF(I132=\"\",\"\",IF(I132=\"Гости\",M132+AH131,AH131))","v":""},{"$f":"IF(I132=\"\",\"\",IF(I132=\"Гости\",AD132*3+AE132,AI131))","v":""}]
[null,null,null,null,null,null,null,null,null,"","","","","","","","","","","","","","","","","","","","","","","","","",""]
[null,null,null,null,null,null,null,null,null,"","","","","","","","","","","","","","","","","","","","","","","","","",""]
[null,null,null,null,null,null,null,null,null,"","","","","","","","","","","","","","","","","","","","","","","","","",""]
[null,null,null,null,null,null,null,null,null,"","","","","","","","","","","","","","","","","","","","","","","","","",""]
[null,null,null,null,null,null,null,null,null,"","","","","","","","","","","","","","","","","","","","","","","","","",""]
[null,null,null,null,null,null,null,null,null,"","","","",{"$f":"IF(I138=\"\",\"\",IF(I138=\"Дома\",IF(J138>K138,\"В\",IF(J138=K138,\"Н\",\"П\")),IF(J138<K138,\"В\",IF(J138=K138,\"Н\",\"П\"))))","v":""},"","","","","","","","","","","","","","","","","","","","",""]
[null,null,null,null,null,null,null,null,null,"","","","","","","","","","","","","","","","","","","","","","","","","",""]
[null,null,null,null,null,null,null,null,null,"","","","","","","","","","","","","","","","","","","","","","","","","",""]
[null,null,null,null,null,null,null,null,null,"","","","","","","","","","","","","","","","","","","","","","","","","",""]
[null,null,null,null,null,null,null,null,null,"","","","","","","","","","","","","","","","","","","","","","","","","",""]
[null,null,null,null,null,null,null,null,null,"","","","","","","","","","","","","","","","","","","","","","","","","",""]
[null,null,null,null,null,null,null,null,null,"","","","","","","","","","","","","","","","","","","","","","","","","",""]
[null,null,null,null,null,null,null,null,null,"","","","","","","","","","","","","","","","","","","","","","","","","",""]
[null,null,null,null,null,null,null,null,null,"","","","","","","","","","","","","","","","","","","","","","","","","",""]
[null,null,null,null,null,null,null,null,null,"","","","","","","","","","","","","","","","","","","","","","","","","",""]
[null,null,null,null,null,null,null,null,null,"","","","","","","","","","","","","","","","","","","","","","","","","",""]
[null,null,null,null,null,null,null,null,null,"","","","","","","","","","","","","","","","","","","","","","","","","",""]
[null,null,null,null,null,null,null,null,null,"","","","","","","","","","","","","","","","","","","","","","","","","",""]

{"sheet":"Predict2.5","index":7,"n_rows":200,"n_cols":24,"rows_kept":200,"cut":false,"hidden":false,"merged":[[20,3,20,6],[14,11,16,14],[6,1,8,8],[8,18,10,18],[11,18,13,18],[14,18,16,18],[14,15,16,17],[17,15,19,17],[20,15,22,15],[20,17,22,17],[20,16,22,16],[17,18,19,18],[17,11,19,14],[20,11,22,14],[24,11,26,17],[27,10,28,13],[27,15,28,18],[29,10,30,11],[29,12,30,13],[29,15,30,16],[29,17,30,18],[1,8,3,13],[1,15,3,20],[5,11,7,17],[8,11,10,14],[11,11,13,14],[8,15,10,17],[11,15,13,17],[34,17,35,18],[33,15,33,18],[31,17,32,18],[198,10,198,11],[198,12,198,13],[31,10,32,11],[31,12,32,13],[31,15,32,16],[33,10,33,13],[34,10,35,11],[34,12,35,13],[34,15,35,16]]}
[]
[null,null,null,null,null,null,null,null,{"$f":"ДомаДома!C2","v":"Бадеран Тегеран"},null,null,null,null,null,null,{"$f":"ГостиГости!D2","v":"Эстеглал Моласани"}]
[]
[]
[]
[null,null,null,null,null,null,null,null,null,null,null,"Predict  Under or Over 2.5"]
[null,"IncOver "]
[]
[null,null,null,null,null,null,null,null,null,null,null,"Прогноз №1",null,null,null,{"$f":"Data!L14","v":"Under2.5"},null,null,{"$f":"Data!O14","v":2.3333333333333335}]
[]
[]
[null,null,null,null,null,null,null,null,null,null,null,"Прогноз №2",null,null,null,{"$f":"Data!L16","v":"Under2.5"},null,null,{"$f":"Data!O16","v":2.5}]
[]
[]
[null,null,null,null,null,null,null,null,null,null,null,"Прогноз №3",null,null,null,{"$f":"Data!L18","v":"Over2.5"},null,null,{"$f":"Data!O18","v":2.6883116883116882}]
[]
[]
[null,null,null,null,null,null,null,null,null,null,null,"Прогноз №4",null,null,null,{"$f":"Data!L20","v":"Under2.5"}]
[]
[]
[null,null,null,"Добавить в Архив",null,null,null,null,null,null,null,"Прогноз №5",null,null,null,{"$f":"Data!L22","v":0.4},{"$f":"Data!M22","v":"Un/Ov"},{"$f":"Data!N22","v":0.6}]
[]
[]
[]
[null,null,null,null,null,null,null,null,null,null,null,{"$f":"Data!I24","v":"Коэффициент на ТМ/ТБ 2.5"}]
[]
[]
[null,null,null,null,null,null,null,null,null,null,{"$f":"Data!K27","v":"Under 2.5"},null,null,null,null,{"$f":"Data!K28","v":"Over 2.5"}]
[]
[null,null,null,null,null,null,null,null,null,null,"Стартовый",null,"Текущий",null,null,{"$f":"K30","v":"Стартовый"},null,{"$f":"M30","v":"Текущий"}]
[]
[null,null,null,null,null,null,null,null,null,null,{"$f":"Data!I27","v":1.48},null,{"$f":"Data!M27","v":1.66},null,null,{"$f":"Data!I28","v":2.6},null,{"$f":"Data!M28","v":2.2200000000000002}]
[]
[null,null,null,null,null,null,null,null,null,null,"Вероятность по Буку",null,null,null,null,{"$f":"K34","v":"Вероятность по Буку"}]
[null,null,null,null,null,null,null,null,null,null,{"$f":"1/K32","v":0.67567567567567566},null,{"$f":"1/M32","v":0.60240963855421692},null,null,{"$f":"1/P32","v":0.38461538461538458},null,{"$f":"1/R32","v":0.4504504504504504}]
[]
[]
[]
[]
[]
[]
[]
[]
[]
[]
[]
[]
[]
[]
[]
[]
[]
[]
[]
[]
[]
[]
[]
[]
[]
[]
[]
[]
[]
[]
[]
[]
[]
[]
[]
[]
[]
[]
[]
[]
[]
[]
[]
[]
[]
[]
[]
[]
[]
[]
[]
[]
[]
[]
[]
[]
[]
[]
[]
[]
[]
[]
[]
[]
[]
[]
[]
[]
[]
[]
[]
[]
[]
[]
[]
[]
[]
[]
[]
[]
[]
[]
[]
[]
[]
[]
[]
[]
[]
[]
[]
[]
[]
[]
[]
[]
[]
[]
[]
[]
[]
[]
[]
[]
[]
[]
[]
[]
[]
[]
[]
[]
[]
[]
[]
[]
[]
[]
[]
[]
[]
[]
[]
[]
[]
[]
[]
[]
[]
[]
[]
[]
[]
[]
[]
[]
[]
[]
[]
[]
[]
[]
[]
[]
[]
[]
[]
[]
[]
[]
[]
[]
[]
[]
[]
[]
[]
[]
[]
[]
[]
[]
[]
[null,null,"Home","Away","Прогноз1","Прогноз2","Прогноз3","Прогноз4","Меньше","Больше","Кэф на ТМ",null,"Кэф на ТБ",null,13,14,15,16,17,18,19,20,21,22]
[null,null,{"$f":"I2","v":"Бадеран Тегеран"},{"$f":"P2","v":"Эстеглал Моласани"},{"$f":"P9","v":"Under2.5"},{"$f":"P12","v":"Under2.5"},{"$f":"P15","v":"Over2.5"},{"$f":"P18","v":"Under2.5"},{"$f":"P21","v":0.4},{"$f":"R21","v":0.6},{"$f":"K32","v":1.48},{"$f":"M32","v":1.66},{"$f":"P32","v":2.6},{"$f":"R32","v":2.2200000000000002}]

{"sheet":"Прогноз","index":8,"n_rows":18,"n_cols":16,"rows_kept":18,"cut":false,"hidden":false,"merged":[[17,8,17,9],[17,10,17,11],[17,12,17,13],[0,3,0,7],[11,1,12,1],[11,2,12,2],[11,3,12,3],[8,1,8,2],[13,2,14,2],[13,3,14,3],[13,8,13,9],[13,10,13,11],[13,12,13,13],[7,6,8,7],[10,5,11,5]]}
[null,null,null,{"$f":"IF(L3=2,\"Внесите все данные!\",\"\")","v":""}]
[]
[null,{"$f":"Команда1!D2","v":"Бадеран Тегеран"},"мячи","эквивалент",null,{"$f":"Команда2!D2","v":"Эстеглал Моласани"},"мячи","эквивалент"]
[null,"Забили дома",{"$f":"Команда1!Y7","v":2},1,null,"Забили дома",{"$f":"Команда2!Y7","v":0},1,null,{"$f":"C4*D4","v":2},null,null,{"$f":"G4*H4","v":0}]
[null,"Заб в гостях",{"$f":"Команда1!AF7","v":2},2,null,"Заб в гостях",{"$f":"Команда2!AF7","v":1},2,null,{"$f":"C5*D5","v":4},null,null,{"$f":"G5*H5","v":2}]
[null,"Проп дома",{"$f":"Команда1!Z7","v":1},2,null,"Проп дома",{"$f":"Команда2!Z7","v":1},2,null,{"$f":"C6*D6","v":2},null,null,{"$f":"G6*H6","v":2}]
[null,"Проп в гостях",{"$f":"Команда1!AG7","v":1},1,null,"Проп в гостях",{"$f":"Команда2!AG7","v":3},1,null,{"$f":"C7*D7","v":1},{"$f":"J9+K9","v":2.6666666666666665},null,{"$f":"G7*H7","v":3},{"$f":"M9+N9","v":1}]
[null,null,null,null,null,{"$f":"Дома!B2","v":"2021.06.01 18:15"},{"$f":"INDEX(Список!A:D,MATCH(Прогноз!B3,Список!C:C,0),1)","v":"ИРАН: Первый дивизион"}]
[null,"предел кэфа",null,0.6,null,{"$f":"INDEX(Список!A:D,MATCH(Прогноз!B3,Список!C:C,0),2)","v":"2021.06.08 17:10"},null,null,null,{"$f":"IF(OR(J4=0,M7=0),0,J4/M7)","v":0.66666666666666663},{"$f":"IF(OR(J5=0,M6=0),0,J5/M6)","v":2},null,{"$f":"IF(OR(M4=0,J7=0),0,M4/J7)","v":0},{"$f":"IF(OR(M5=0,J6=0),0,M5/J6)","v":1}]
[null,null,{"$f":"B3","v":"Бадеран Тегеран"},{"$f":"F3","v":"Эстеглал Моласани"},null,null,{"$f":"B3","v":"Бадеран Тегеран"},{"$f":"F3","v":"Эстеглал Моласани"}]
[null,"Кэф",{"$f":"K7","v":2.6666666666666665},{"$f":"N7","v":1},null,{"$f":"Очные!AG1","v":0}]
[null,"Гол в 1м тайме:",{"$f":"IF(C11<D9,\"ставим\",\"не ставим\")","v":"не ставим"},{"$f":"IF(D11<D9,\"ставим\",\"не ставим\")","v":"не ставим"}]
[null,null,null,null,null,null,null,null,null,null,null,null,null,null,{"$f":"IFERROR(IF(AND(OR(I17<1,J17<1),I18<3,0.99<K17,0.99<L17,2.99<K18),\"1<2\",IF(AND(OR(K17<1,L17<1),K18<3,0.99<I17,0.99<J17,2.99<I18),\"1>2\",\"\")),\"\")","v":""},{"$f":"IF(AND(OR(K17<1,L17<1),K18<3,0.99<I17,0.99<J17,2.99<I18),\"1>2\",\"\")","v":""}]
[null,null,{"$f":"IF(AND(2.99<I18,0.99<I17,0.99<J17),\"ставим\",\"не ставим\")","v":"не ставим"},{"$f":"IF(O13=\"\",\"не ставим\",CONCATENATE(\"ставим\",\" \",O13))","v":"не ставим"},null,null,null,null,"1тайм",null,"2тайм",null,"Матч"]
[null,null,null,null,null,null,null,null,{"$f":"Дома!AL8","v":0.8},{"$f":"Дома!AM8","v":0.4},{"$f":"Дома!AN8","v":0.4},{"$f":"Дома!AO8","v":0.8},{"$f":"Дома!AP8","v":1.2},{"$f":"Дома!AQ8","v":1.2}]
[null,null,null,null,null,null,null,null,{"$f":"Гости!AL8","v":0.2},{"$f":"Гости!AM8","v":0.8},{"$f":"Гости!AN8","v":0.8},{"$f":"Гости!AO8","v":0.8},{"$f":"Гости!AP8","v":1},{"$f":"Гости!AQ8","v":1.6}]
[null,null,null,null,null,null,null,null,{"$f":"SUM(I15:I16)","v":1},{"$f":"SUM(J15:J16)","v":1.2000000000000002},1.2000000000000002,1.6,2.2000000000000002,2.8]
[null,null,null,null,null,null,null,null,{"$f":"SUM(I17:J17)","v":2.2000000000000002},null,{"$f":"SUM(K17:L17)","v":2.8000000000000003},null,{"$f":"SUM(M17:N17)","v":5}]

{"sheet":"ГостиГости","index":9,"n_rows":150,"n_cols":35,"rows_kept":150,"cut":false,"hidden":true,"merged":[]}
["Чемпионат","Дата/Время","Дома","Гости","К1 в 1Т","К2 в 1Т","К1 во 2Т","К2 во 2Т","Где играли","К1 Голов","К2 Голов","Забито","Пропущено","Результат","Всего Игр","Всего выиграно","Всего ничьих","Всего проиграно","Всего забито","Всего пропущено","Всего очков","Дома игр","Дома выиграно","Дома ничьих","Дома проиграно","Дома забито","Дома пропущено","Дома очков","Гости игр","Гости выиграно","Гости ничьих","Гости проиграно","Гости забито","Гости пропущено","Гости очков"]
["ИРАН: Первый дивизион","2021.06.02 17:35","Мес Керман","Эстеглал Моласани",2,1,1,1,"Гости",{"$f":"IF(I2=\"\",\"\",E2+G2)","v":3},{"$f":"IF(I2=\"\",\"\",F2+H2)","v":2},{"$f":"IF(I2=\"\",\"\",IF(I2=\"Дома\",J2,K2))","v":2},{"$f":"IF(I2=\"\",\"\",IF(I2=\"Дома\",K2,J2))","v":3},{"$f":"IF(I2=\"\",\"\",IF(I2=\"Дома\",IF(J2>K2,\"В\",IF(J2=K2,\"Н\",\"П\")),IF(J2<K2,\"В\",IF(J2=K2,\"Н\",\"П\"))))","v":"П"},{"$f":"IF(I2=\"\",\"\",1)","v":1},{"$f":"IF(I2=\"\",\"\",IF(N2=\"В\",1,0))","v":0},{"$f":"IF(I2=\"\",\"\",IF(N2=\"Н\",1,0))","v":0},{"$f":"IF(I2=\"\",\"\",IF(N2=\"П\",1,0))","v":1},{"$f":"IF(I2=\"\",\"\",L2)","v":2},{"$f":"IF(I2=\"\",\"\",M2)","v":3},{"$f":"IF(I2=\"\",\"\",P2*3+Q2)","v":0},{"$f":"IF(I2=\"\",\"\",IF(I2=\"Дома\",1,0))","v":0},{"$f":"IF(I2=\"\",\"\",IF(I2=\"Дома\",IF(N2=\"В\",1,0),0))","v":0},{"$f":"IF(I2=\"\",\"\",IF(I2=\"Дома\",IF(N2=\"Н\",1,0),0))","v":0},{"$f":"IF(I2=\"\",\"\",IF(I2=\"Дома\",IF(N2=\"П\",1,0),0))","v":0},{"$f":"IF(I2=\"\",\"\",IF(I2=\"Дома\",L2,0))","v":0},{"$f":"IF(I2=\"\",\"\",IF(I2=\"Дома\",M2,0))","v":0},{"$f":"IF(I2=\"\",\"\",IF(I2=\"Дома\",W2*3+X2,0))","v":0},{"$f":"IF(I2=\"\",\"\",IF(I2=\"Гости\",1,0))","v":1},{"$f":"IF(I2=\"\",\"\",IF(I2=\"Гости\",IF(N2=\"В\",1,0),0))","v":0},{"$f":"IF(I2=\"\",\"\",IF(I2=\"Гости\",IF(N2=\"Н\",1,0),0))","v":0},{"$f":"IF(I2=\"\",\"\",IF(I2=\"Гости\",IF(N2=\"П\",1,0),0))","v":1},{"$f":"IF(I2=\"\",\"\",IF(I2=\"Гости\",L2,0))","v":2},{"$f":"IF(I2=\"\",\"\",IF(I2=\"Гости\",M2,0))","v":3},{"$f":"IF(I2=\"\",\"\",IF(I2=\"Гости\",AD2*3+AE2,0))","v":0}]
["ИРАН: Первый дивизион","2021.05.20 17:40","Могхавемат","Эстеглал Моласани",1,0,1,1,"Гости",{"$f":"IF(I3=\"\",\"\",E3+G3)","v":2},{"$f":"IF(I3=\"\",\"\",F3+H3)","v":1},{"$f":"IF(I3=\"\",\"\",IF(I3=\"Дома\",J3,K3))","v":1},{"$f":"IF(I3=\"\",\"\",IF(I3=\"Дома\",K3,J3))","v":2},{"$f":"IF(I3=\"\",\"\",IF(I3=\"Дома\",IF(J3>K3,\"В\",IF(J3=K3,\"Н\",\"П\")),IF(J3<K3,\"В\",IF(J3=K3,\"Н\",\"П\"))))","v":"П"},{"$f":"IF(I3=\"\",\"\",O2+1)","v":2},{"$f":"IF(I3=\"\",\"\",IF(N3=\"В\",P2+1,P2))","v":0},{"$f":"IF(I3=\"\",\"\",IF(N3=\"Н\",Q2+1,Q2))","v":0},{"$f":"IF(I3=\"\",\"\",IF(N3=\"П\",R2+1,R2))","v":2},{"$f":"IF(I3=\"\",\"\",S2+L3)","v":3},{"$f":"IF(I3=\"\",\"\",T2+M3)","v":5},{"$f":"IF(I3=\"\",\"\",P3*3+Q3)","v":0},{"$f":"IF(I3=\"\",\"\",IF(I3=\"Дома\",V2+1,V2+0))","v":0},{"$f":"IF(I3=\"\",\"\",IF(I3=\"Дома\",IF(N3=\"В\",W2+1,W2),W2))","v":0},{"$f":"IF(I3=\"\",\"\",IF(I3=\"Дома\",IF(N3=\"Н\",X2+1,X2),X2))","v":0},{"$f":"IF(I3=\"\",\"\",IF(I3=\"Дома\",IF(N3=\"П\",Y2+1,Y2),Y2))","v":0},{"$f":"IF(I3=\"\",\"\",IF(I3=\"Дома\",L3+Z2,Z2))","v":0},{"$f":"IF(I3=\"\",\"\",IF(I3=\"Дома\",M3+AA2,AA2))","v":0},{"$f":"IF(I3=\"\",\"\",IF(I3=\"Дома\",W3*3+X3,AB2))","v":0},{"$f":"IF(I3=\"\",\"\",IF(I3=\"Гости\",AC2+1,AC2+0))","v":2},{"$f":"IF(I3=\"\",\"\",IF(I3=\"Гости\",IF(N3=\"В\",AD2+1,AD2),AD2))","v":0},{"$f":"IF(I3=\"\",\"\",IF(I3=\"Гости\",IF(N3=\"Н\",AE2+1,AE2),AE2))","v":0},{"$f":"IF(I3=\"\",\"\",IF(I3=\"Гости\",IF(N3=\"П\",AF2+1,AF2),AF2))","v":2},{"$f":"IF(I3=\"\",\"\",IF(I3=\"Гости\",L3+AG2,AG2))","v":3},{"$f":"IF(I3=\"\",\"\",IF(I3=\"Гости\",M3+AH2,AH2))","v":5},{"$f":"IF(I3=\"\",\"\",IF(I3=\"Гости\",AD3*3+AE3,AI2))","v":0}]
["ИРАН: Первый дивизион","2021.05.08 19:00","Гол Рейхан","Эстеглал Моласани",0,0,1,0,"Гости",1,0,0,1,"П",3,{"$f":"IF(I4=\"\",\"\",IF(N4=\"В\",P3+1,P3))","v":0},{"$f":"IF(I4=\"\",\"\",IF(N4=\"Н\",Q3+1,Q3))","v":0},{"$f":"IF(I4=\"\",\"\",IF(N4=\"П\",R3+1,R3))","v":3},{"$f":"IF(I4=\"\",\"\",S3+L4)","v":3},{"$f":"IF(I4=\"\",\"\",T3+M4)","v":6},0,{"$f":"IF(I4=\"\",\"\",IF(I4=\"Дома\",V3+1,V3+0))","v":0},{"$f":"IF(I4=\"\",\"\",IF(I4=\"Дома\",IF(N4=\"В\",W3+1,W3),W3))","v":0},{"$f":"IF(I4=\"\",\"\",IF(I4=\"Дома\",IF(N4=\"Н\",X3+1,X3),X3))","v":0},{"$f":"IF(I4=\"\",\"\",IF(I4=\"Дома\",IF(N4=\"П\",Y3+1,Y3),Y3))","v":0},{"$f":"IF(I4=\"\",\"\",IF(I4=\"Дома\",L4+Z3,Z3))","v":0},{"$f":"IF(I4=\"\",\"\",IF(I4=\"Дома\",M4+AA3,AA3))","v":0},{"$f":"IF(I4=\"\",\"\",IF(I4=\"Дома\",W4*3+X4,AB3))","v":0},{"$f":"IF(I4=\"\",\"\",IF(I4=\"Гости\",AC3+1,AC3+0))","v":3},{"$f":"IF(I4=\"\",\"\",IF(I4=\"Гости\",IF(N4=\"В\",AD3+1,AD3),AD3))","v":0},{"$f":"IF(I4=\"\",\"\",IF(I4=\"Гости\",IF(N4=\"Н\",AE3+1,AE3),AE3))","v":0},{"$f":"IF(I4=\"\",\"\",IF(I4=\"Гости\",IF(N4=\"П\",AF3+1,AF3),AF3))","v":3},{"$f":"IF(I4=\"\",\"\",IF(I4=\"Гости\",L4+AG3,AG3))","v":3},{"$f":"IF(I4=\"\",\"\",IF(I4=\"Гости\",M4+AH3,AH3))","v":6},{"$f":"IF(I4=\"\",\"\",IF(I4=\"Гости\",AD4*3+AE4,AI3))","v":0}]
["ИРАН: Первый дивизион","2021.04.19 20:30","Эстеглал Хузестан","Эстеглал Моласани",2,0,1,1,"Гости",3,1,1,3,"П",4,0,0,4,4,9,0,0,0,0,0,0,0,0,4,0,0,4,4,9,0]
["ИРАН: Первый дивизион","2021.04.07 15:00","Хавадар","Эстеглал Моласани",0,0,2,1,"Гости",2,1,1,2,"П",5,0,0,5,5,11,0,0,0,0,0,0,0,0,5,0,0,5,5,11,0]
["ИРАН: Первый дивизион","2021.03.02 14:00","Арман Гохар","Эстеглал Моласани",0,0,2,2,"Гости",2,2,2,2,"Н",6,0,1,5,7,13,1,0,0,0,0,0,0,0,6,0,1,5,7,13,1]
["ИРАН: Первый дивизион","2021.02.14 13:30","Кашкай Шираз","Эстеглал Моласани",2,0,1,1,"Гости",3,1,1,3,"П",7,0,1,6,8,16,1,0,0,0,0,0,0,0,7,0,1,6,8,16,1]
["ИРАН: Первый дивизион","2021.02.01 13:30","Парс Джануби Джем","Эстеглал Моласани",0,1,1,0,"Гости",1,1,1,1,{"$f":"IF(I9=\"\",\"\",IF(I9=\"Дома\",IF(J9>K9,\"В\",IF(J9=K9,\"Н\",\"П\")),IF(J9<K9,\"В\",IF(J9=K9,\"Н\",\"П\"))))","v":"Н"},8,0,2,6,9,17,2,0,0,0,0,0,0,0,8,0,2,6,9,17,2]
["ИРАН: Первый дивизион","2021.01.11 13:30","Хуши-Талаи","Эстеглал Моласани",1,0,1,1,"Гости",2,1,1,2,{"$f":"IF(I10=\"\",\"\",IF(I10=\"Дома\",IF(J10>K10,\"В\",IF(J10=K10,\"Н\",\"П\")),IF(J10<K10,\"В\",IF(J10=K10,\"Н\",\"П\"))))","v":"П"},9,0,2,7,10,19,2,0,0,0,0,0,0,0,9,0,2,7,10,19,2]
["ИРАН: Первый дивизион","2020.12.28 13:30","Навад Урмия","Эстеглал Моласани",0,0,0,1,"Гости",0,1,1,0,"В",10,1,2,7,11,19,5,0,0,0,0,0,0,0,10,1,2,7,11,19,5]
["ИРАН: Первый дивизион","2020.12.16 13:30","Астара","Эстеглал Моласани",1,1,2,0,"Гости",3,1,1,3,"П",11,1,2,8,12,22,{"$f":"IF(I12=\"\",\"\",P12*3+Q12)","v":5},0,0,0,0,0,0,0,11,1,2,8,12,22,5]
[null,null,null,null,null,null,null,null,null,"","","","","","","","","","","","","","","","","","","","","","","","","",""]
[null,null,null,null,null,null,null,null,null,"","","","","","","","","","","","","","","","","","","","","","","","","",""]
[null,null,null,null,null,null,null,null,null,"","","","","","","","","","","","","","","","","","","","","","","","","",""]
[null,null,null,null,null,null,null,null,null,"","","","","","","","","","","","","","","","","","","","","","","","","",""]
[null,null,null,null,null,null,null,null,null,"","","","","","","","","","","","","","","","","","","","","","","","","",""]
[null,null,null,null,null,null,null,null,null,"","","","","","","","","","","","","","","","","","","","","","","","","",""]
[null,null,null,null,null,null,null,null,null,"","","","","","","","","","","","","","","","","","","","","","","","","",""]
[null,null,null,null,null,null,null,null,null,"","","","","","","","","","","","","","","","","","","","","","","","","",""]
[null,null,null,null,null,null,null,null,null,"","","","","","","","","","","","","","","","","","","","","","","","","",""]
[null,null,null,null,null,null,null,null,null,"","","","","","","","","","","","","","","","","","","","","","","","","",""]
[null,null,null,null,null,null,null,null,null,"","","","","","","","","","","","","","","","","","","","","","","","","",""]
[null,null,null,null,null,null,null,null,null,"","","","","","","","","","","","","","","","","","","","","","","","","",""]
[null,null,null,null,null,null,null,null,null,"","","","","","","","","","","","","","","","","","","","","","","","","",""]
[null,null,null,null,null,null,null,null,null,"","","","","","","","","","","","","","","","","","","","","","","","","",""]
[null,null,null,null,null,null,null,null,null,"","","","","","","","","","","","","","","","","","","","","","","","","",""]
[null,null,null,null,null,null,null,null,null,"","","","","","","","","","","","","","","","","","","","","","","","","",""]
[null,null,null,null,null,null,null,null,null,"","","","","","","","","","","","","","","","","","","","","","","","","",""]
[null,null,null,null,null,null,null,null,null,"","","","","","","","","","","","","","","","","","","","","","","","","",""]
[null,null,null,null,null,null,null,null,null,"","","","","","","","","","","","","","","","","","","","","","","","","",""]
[null,null,null,null,null,null,null,null,null,"","","","","","","","","","","","","","","","","","","","","","","","","",""]
[null,null,null,null,null,null,null,null,null,"","","","","","","","","","","","","","","","","","","","","","","","","",""]
[null,null,null,null,null,null,null,null,null,"","","","","","","","","","","","","","","","","","","","","","","","","",""]
[null,null,null,null,null,null,null,null,null,"","","","","","","","","","","","","","","","","","","","","","","","","",""]
[null,null,null,null,null,null,null,null,null,"","","","","","","","","","","","","","","","","","","","","","","","","",""]
[null,null,null,null,null,null,null,null,null,"","","","","","","","","","","","","","","","","","","","","","","","","",""]
[null,null,null,null,null,null,null,null,null,"","","","","","","","","","","","","","","","","","","","","","","","","",""]
[null,null,null,null,null,null,null,null,null,"","","","","","","","","","","","","","","","","","","","","","","","","",""]
[null,null,null,null,null,null,null,null,null,"","","","","","","","","","","","","","","","","","","","","","","","","",""]
[null,null,null,null,null,null,null,null,null,"","","","","","","","","","","","","","","","","","","","","","","","","",""]
[null,null,null,null,null,null,null,null,null,"","","","","","","","","","","","","","","","","","","","","","","","","",""]
[null,null,null,null,null,null,null,null,null,"","","","","","","","","","","","","","","","","","","","","","","","","",""]
[null,null,null,null,null,null,null,null,null,"","","","","","","","","","","","","","","","","","","","","","","","","",""]
[null,null,null,null,null,null,null,null,null,"","","","","","","","","","","","","","","","","","","","","","","","","",""]
[null,null,null,null,null,null,null,null,null,"","","","","","","","","","","","","","","","","","","","","","","","","",""]
[null,null,null,null,null,null,null,null,null,"","","","","","","","","","","","","","","","","","","","","","","","","",""]
[null,null,null,null,null,null,null,null,null,"","","","","","","","","","","","","","","","","","","","","","","","","",""]
[null,null,null,null,null,null,null,null,null,"","","","","","","","","","","","","","","","","","","","","","","","","",""]
[null,null,null,null,null,null,null,null,null,"","","","","","","","","","","","","","","","","","","","","","","","","",""]
[null,null,null,null,null,null,null,null,null,"","","","","","","","","","","","","","","","","","","","","","","","","",""]
[null,null,null,null,null,null,null,null,null,"","","","","","","","","","","","","","","","","","","","","","","","","",""]
[null,null,null,null,null,null,null,null,null,"","","","","","","","","","","","","","","","","","","","","","","","","",""]
[null,null,null,null,null,null,null,null,null,"","","","","","","","","","","","","","","","","","","","","","","","","",""]
[null,null,null,null,null,null,null,null,null,"","","","","","","","","","","","","","","","","","","","","","","","","",""]
[null,null,null,null,null,null,null,null,null,"","","","","","","","","","","","","","","","","","","","","","","","","",""]
[null,null,null,null,null,null,null,null,null,"","","","","","","","","","","","","","","","","","","","","","","","","",""]
[null,null,null,null,null,null,null,null,null,"","","","","","","","","","","","","","","","","","","","","","","","","",""]
[null,null,null,null,null,null,null,null,null,"","","","","","","","","","","","","","","","","","","","","","","","","",""]
[null,null,null,null,null,null,null,null,null,"","","","","","","","","","","","","","","","","","","","","","","","","",""]
[null,null,null,null,null,null,null,null,null,"","","","","","","","","","","","","","","","","","","","","","","","","",""]
[null,null,null,null,null,null,null,null,null,"","","","","","","","","","","","","","","","","","","","","","","","","",""]
[null,null,null,null,null,null,null,null,null,"","","","","","","","","","","","","","","","","","","","","","","","","",""]
[null,null,null,null,null,null,null,null,null,"","","","","","","","","","","","","","","","","","","","","","","","","",""]
[null,null,null,null,null,null,null,null,null,"","","","","","","","","","","","","","","","","","","","","","","","","",""]
[null,null,null,null,null,null,null,null,null,"","","","","","","","","","","","","","","","","","","","","","","","","",""]
[null,null,null,null,null,null,null,null,null,{"$f":"IF(I67=\"\",\"\",E67+G67)","v":""},{"$f":"IF(I67=\"\",\"\",F67+H67)","v":""},{"$f":"IF(I67=\"\",\"\",IF(I67=\"Дома\",J67,K67))","v":""},{"$f":"IF(I67=\"\",\"\",IF(I67=\"Дома\",K67,J67))","v":""},"",{"$f":"IF(I67=\"\",\"\",O66+1)","v":""},"","","","","",{"$f":"IF(I67=\"\",\"\",P67*3+Q67)","v":""},"","","","","","","","","","","","","",""]
[null,null,null,null,null,null,null,null,null,"","","","","","",{"$f":"IF(I68=\"\",\"\",IF(N68=\"В\",P67+1,P67))","v":""},{"$f":"IF(I68=\"\",\"\",IF(N68=\"Н\",Q67+1,Q67))","v":""},{"$f":"IF(I68=\"\",\"\",IF(N68=\"П\",R67+1,R67))","v":""},{"$f":"IF(I68=\"\",\"\",S67+L68)","v":""},{"$f":"IF(I68=\"\",\"\",T67+M68)","v":""},"",{"$f":"IF(I68=\"\",\"\",IF(I68=\"Дома\",V67+1,V67+0))","v":""},{"$f":"IF(I68=\"\",\"\",IF(I68=\"Дома\",IF(N68=\"В\",W67+1,W67),W67))","v":""},{"$f":"IF(I68=\"\",\"\",IF(I68=\"Дома\",IF(N68=\"Н\",X67+1,X67),X67))","v":""},{"$f":"IF(I68=\"\",\"\",IF(I68=\"Дома\",IF(N68=\"П\",Y67+1,Y67),Y67))","v":""},{"$f":"IF(I68=\"\",\"\",IF(I68=\"Дома\",L68+Z67,Z67))","v":""},{"$f":"IF(I68=\"\",\"\",IF(I68=\"Дома\",M68+AA67,AA67))","v":""},{"$f":"IF(I68=\"\",\"\",IF(I68=\"Дома\",W68*3+X68,AB67))","v":""},{"$f":"IF(I68=\"\",\"\",IF(I68=\"Гости\",AC67+1,AC67+0))","v":""},{"$f":"IF(I68=\"\",\"\",IF(I68=\"Гости\",IF(N68=\"В\",AD67+1,AD67),AD67))","v":""},{"$f":"IF(I68=\"\",\"\",IF(I68=\"Гости\",IF(N68=\"Н\",AE67+1,AE67),AE67))","v":""},{"$f":"IF(I68=\"\",\"\",IF(I68=\"Гости\",IF(N68=\"П\",AF67+1,AF67),AF67))","v":""},{"$f":"IF(I68=\"\",\"\",IF(I68=\"Гости\",L68+AG67,AG67))","v":""},{"$f":"IF(I68=\"\",\"\",IF(I68=\"Гости\",M68+AH67,AH67))","v":""},{"$f":"IF(I68=\"\",\"\",IF(I68=\"Гости\",AD68*3+AE68,AI67))","v":""}]
[null,null,null,null,null,null,null,null,null,"","","","","","","","","","","","","","","","","","","","","","","","","",""]
[null,null,null,null,null,null,null,null,null,"","","","","","","","","","","","","","","","","","","","","","","","","",""]
[null,null,null,null,null,null,null,null,null,"","","","","","","","","","","","","","","","","","","","","","","","","",""]
[null,null,null,null,null,null,null,null,null,"","","","","","","","","","","","","","","","","","","","","","","","","",""]
[null,null,null,null,null,null,null,null,null,"","","","","","","","","","","","","","","","","","","","","","","","","",""]
[null,null,null,null,null,null,null,null,null,"","","","",{"$f":"IF(I74=\"\",\"\",IF(I74=\"Дома\",IF(J74>K74,\"В\",IF(J74=K74,\"Н\",\"П\")),IF(J74<K74,\"В\",IF(J74=K74,\"Н\",\"П\"))))","v":""},"","","","","","","","","","","","","","","","","","","","",""]
[null,null,null,null,null,null,null,null,null,"","","","","","","","","","","","","","","","","","","","","","","","","",""]
[null,null,null,null,null,null,null,null,null,"","","","","","","","","","","","","","","","","","","","","","","","","",""]
[null,null,null,null,null,null,null,null,null,"","","","","","","","","","","","","","","","","","","","","","","","","",""]
[null,null,null,null,null,null,null,null,null,"","","","","","","","","","","","","","","","","","","","","","","","","",""]
[null,null,null,null,null,null,null,null,null,"","","","","","","","","","","","","","","","","","","","","","","","","",""]
[null,null,null,null,null,null,null,null,null,"","","","","","","","","","","","","","","","","","","","","","","","","",""]
[null,null,null,null,null,null,null,null,null,"","","","","","","","","","","","","","","","","","","","","","","","","",""]
[null,null,null,null,null,null,null,null,null,"","","","","","","","","","","","","","","","","","","","","","","","","",""]
[null,null,null,null,null,null,null,null,null,"","","","","","","","","","","","","","","","","","","","","","","","","",""]
[null,null,null,null,null,null,null,null,null,"","","","","","","","","","","","","","","","","","","","","","","","","",""]
[null,null,null,null,null,null,null,null,null,"","","","","","","","","","","","","","","","","","","","","","","","","",""]
[null,null,null,null,null,null,null,null,null,"","","","","","","","","","","","","","","","","","","","","","","","","",""]
[null,null,null,null,null,null,null,null,null,"","","","","","","","","","","","","","","","","","","","","","","","","",""]
[null,null,null,null,null,null,null,null,null,"","","","","","","","","","","","","","","","","","","","","","","","","",""]
[null,null,null,null,null,null,null,null,null,"","","","","","","","","","","","","","","","","","","","","","","","","",""]
[null,null,null,null,null,null,null,null,null,"","","","","","","","","","","","","","","","","","","","","","","","","",""]
[null,null,null,null,null,null,null,null,null,"","","","","","","","","","","","","","","","","","","","","","","","","",""]
[null,null,null,null,null,null,null,null,null,"","","","","","","","","","","","","","","","","","","","","","","","","",""]
[null,null,null,null,null,null,null,null,null,"","","","","","","","","","","","","","","","","","","","","","","","","",""]
[null,null,null,null,null,null,null,null,null,"","","","","","","","","","","","","","","","","","","","","","","","","",""]
[null,null,null,null,null,null,null,null,null,"","","","","","","","","","","","","","","","","","","","","","","","","",""]
[null,null,null,null,null,null,null,null,null,"","","","","","","","","","","","","","","","","","","","","","","","","",""]
[null,null,null,null,null,null,null,null,null,"","","","","","","","","","","","","","","","","","","","","","","","","",""]
[null,null,null,null,null,null,null,null,null,"","","","","","","","","","","","","","","","","","","","","","","","","",""]
[null,null,null,null,null,null,null,null,null,"","","","","","","","","","","","","","","","","","","","","","","","","",""]
[null,null,null,null,null,null,null,null,null,"","","","","","","","","","","","","","","","","","","","","","","","","",""]
[null,null,null,null,null,null,null,null,null,"","","","","","","","","","","","","","","","","","","","","","","","","",""]
[null,null,null,null,null,null,null,null,null,"","","","","","","","","","","","","","","","","","","","","","","","","",""]
[null,null,null,null,null,null,null,null,null,"","","","","","","","","","","","","","","","","","","","","","","","","",""]
[null,null,null,null,null,null,null,null,null,"","","","","","","","","","","","","","","","","","","","","","","","","",""]
[null,null,null,null,null,null,null,null,null,"","","","","","","","","","","","","","","","","","","","","","","","","",""]
[null,null,null,null,null,null,null,null,null,"","","","","","","","","","","","","","","","","","","","","","","","","",""]
[null,null,null,null,null,null,null,null,null,"","","","","","","","","","","","","","","","","","","","","","","","","",""]
[null,null,null,null,null,null,null,null,null,"","","","","","","","","","","","","","","","","","","","","","","","","",""]
[null,null,null,null,null,null,null,null,null,"","","","","","","","","","","","","","","","","","","","","","","","","",""]
[null,null,null,null,null,null,null,null,null,"","","","","","","","","","","","","","","","","","","","","","","","","",""]
[null,null,null,null,null,null,null,null,null,"","","","","","","","","","","","","","","","","","","","","","","","","",""]
[null,null,null,null,null,null,null,null,null,"","","","","","","","","","","","","","","","","","","","","","","","","",""]
[null,null,null,null,null,null,null,null,null,"","","","","","","","","","","","","","","","","","","","","","","","","",""]
[null,null,null,null,null,null,null,null,null,"","","","","","","","","","","","","","","","","","","","","","","","","",""]
[null,null,null,null,null,null,null,null,null,"","","","","","","","","","","","","","","","","","","","","","","","","",""]
[null,null,null,null,null,null,null,null,null,"","","","","","","","","","","","","","","","","","","","","","","","","",""]
[null,null,null,null,null,null,null,null,null,"","","","","","","","","","","","","","","","","","","","","","","","","",""]
[null,null,null,null,null,null,null,null,null,"","","","","","","","","","","","","","","","","","","","","","","","","",""]
[null,null,null,null,null,null,null,null,null,"","","","","","","","","","","","","","","","","","","","","","","","","",""]
[null,null,null,null,null,null,null,null,null,"","","","","","","","","","","","","","","","","","","","","","","","","",""]
[null,null,null,null,null,null,null,null,null,"","","","","","","","","","","","","","","","","","","","","","","","","",""]
[null,null,null,null,null,null,null,null,null,"","","","","","","","","","","","","","","","","","","","","","","","","",""]
[null,null,null,null,null,null,null,null,null,"","","","","","","","","","","","","","","","","","","","","","","","","",""]
[null,null,null,null,null,null,null,null,null,"","","","","","","","","","","","","","","","","","","","","","","","","",""]
[null,null,null,null,null,null,null,null,null,"","","","","","","","","","","","","","","","","","","","","","","","","",""]
[null,null,null,null,null,null,null,null,null,"","","","","","","","","","","","","","","","","","","","","","","","","",""]
[null,null,null,null,null,null,null,null,null,"","","","","","","","","","","","","","","","","","","","","","","","","",""]
[null,null,null,null,null,null,null,null,null,"","","","","","","","","","","","","","","","","","","","","","","","","",""]
[null,null,null,null,null,null,null,null,null,"","","","","","","","","","","","","","","","","","","","","","","","","",""]
[null,null,null,null,null,null,null,null,null,"","","","","","","","","","","","","","","","","","","","","","","","","",""]
[null,null,null,null,null,null,null,null,null,{"$f":"IF(I131=\"\",\"\",E131+G131)","v":""},{"$f":"IF(I131=\"\",\"\",F131+H131)","v":""},{"$f":"IF(I131=\"\",\"\",IF(I131=\"Дома\",J131,K131))","v":""},{"$f":"IF(I131=\"\",\"\",IF(I131=\"Дома\",K131,J131))","v":""},"",{"$f":"IF(I131=\"\",\"\",O130+1)","v":""},"","","","","",{"$f":"IF(I131=\"\",\"\",P131*3+Q131)","v":""},"","","","","","","","","","","","","",""]
[null,null,null,null,null,null,null,null,null,"","","","","","",{"$f":"IF(I132=\"\",\"\",IF(N132=\"В\",P131+1,P131))","v":""},{"$f":"IF(I132=\"\",\"\",IF(N132=\"Н\",Q131+1,Q131))","v":""},{"$f":"IF(I132=\"\",\"\",IF(N132=\"П\",R131+1,R131))","v":""},{"$f":"IF(I132=\"\",\"\",S131+L132)","v":""},{"$f":"IF(I132=\"\",\"\",T131+M132)","v":""},"",{"$f":"IF(I132=\"\",\"\",IF(I132=\"Дома\",V131+1,V131+0))","v":""},{"$f":"IF(I132=\"\",\"\",IF(I132=\"Дома\",IF(N132=\"В\",W131+1,W131),W131))","v":""},{"$f":"IF(I132=\"\",\"\",IF(I132=\"Дома\",IF(N132=\"Н\",X131+1,X131),X131))","v":""},{"$f":"IF(I132=\"\",\"\",IF(I132=\"Дома\",IF(N132=\"П\",Y131+1,Y131),Y131))","v":""},{"$f":"IF(I132=\"\",\"\",IF(I132=\"Дома\",L132+Z131,Z131))","v":""},{"$f":"IF(I132=\"\",\"\",IF(I132=\"Дома\",M132+AA131,AA131))","v":""},{"$f":"IF(I132=\"\",\"\",IF(I132=\"Дома\",W132*3+X132,AB131))","v":""},{"$f":"IF(I132=\"\",\"\",IF(I132=\"Гости\",AC131+1,AC131+0))","v":""},{"$f":"IF(I132=\"\",\"\",IF(I132=\"Гости\",IF(N132=\"В\",AD131+1,AD131),AD131))","v":""},{"$f":"IF(I132=\"\",\"\",IF(I132=\"Гости\",IF(N132=\"Н\",AE131+1,AE131),AE131))","v":""},{"$f":"IF(I132=\"\",\"\",IF(I132=\"Гости\",IF(N132=\"П\",AF131+1,AF131),AF131))","v":""},{"$f":"IF(I132=\"\",\"\",IF(I132=\"Гости\",L132+AG131,AG131))","v":""},{"$f":"IF(I132=\"\",\"\",IF(I132=\"Гости\",M132+AH131,AH131))","v":""},{"$f":"IF(I132=\"\",\"\",IF(I132=\"Гости\",AD132*3+AE132,AI131))","v":""}]
[null,null,null,null,null,null,null,null,null,"","","","","","","","","","","","","","","","","","","","","","","","","",""]
[null,null,null,null,null,null,null,null,null,"","","","","","","","","","","","","","","","","","","","","","","","","",""]
[null,null,null,null,null,null,null,null,null,"","","","","","","","","","","","","","","","","","","","","","","","","",""]
[null,null,null,null,null,null,null,null,null,"","","","","","","","","","","","","","","","","","","","","","","","","",""]
[null,null,null,null,null,null,null,null,null,"","","","","","","","","","","","","","","","","","","","","","","","","",""]
[null,null,null,null,null,null,null,null,null,"","","","",{"$f":"IF(I138=\"\",\"\",IF(I138=\"Дома\",IF(J138>K138,\"В\",IF(J138=K138,\"Н\",\"П\")),IF(J138<K138,\"В\",IF(J138=K138,\"Н\",\"П\"))))","v":""},"","","","","","","","","","","","","","","","","","","","",""]
[null,null,null,null,null,null,null,null,null,"","","","","","","","","","","","","","","","","","","","","","","","","",""]
[null,null,null,null,null,null,null,null,null,"","","","","","","","","","","","","","","","","","","","","","","","","",""]
[null,null,null,null,null,null,null,null,null,"","","","","","","","","","","","","","","","","","","","","","","","","",""]
[null,null,null,null,null,null,null,null,null,"","","","","","","","","","","","","","","","","","","","","","","","","",""]
[null,null,null,null,null,null,null,null,null,"","","","","","","","","","","","","","","","","","","","","","","","","",""]
[null,null,null,null,null,null,null,null,null,"","","","","","","","","","","","","","","","","","","","","","","","","",""]
[null,null,null,null,null,null,null,null,null,"","","","","","","","","","","","","","","","","","","","","","","","","",""]
[null,null,null,null,null,null,null,null,null,"","","","","","","","","","","","","","","","","","","","","","","","","",""]
[null,null,null,null,null,null,null,null,null,"","","","","","","","","","","","","","","","","","","","","","","","","",""]
[null,null,null,null,null,null,null,null,null,"","","","","","","","","","","","","","","","","","","","","","","","","",""]
[null,null,null,null,null,null,null,null,null,"","","","","","","","","","","","","","","","","","","","","","","","","",""]
[null,null,null,null,null,null,null,null,null,"","","","","","","","","","","","","","","","","","","","","","","","","",""]

{"sheet":"Очные","index":10,"n_rows":150,"n_cols":33,"rows_kept":150,"cut":false,"hidden":true,"merged":[]}
["Бадеран Тегеран","Эстеглал Моласани",null,null,null,null,"Результат К1","Забито К1","Пропущено К1","Выиграно К1","Ничьих К1","Проиграно К1","РезультатК2","Забито К2","Пропущено К2","Выиграно К2","Ничьих К2","Пропущено К2","ХОЗЯЕВА","Д","Заб","Проп","Г","Заб","Проп","ГОСТИ","Д","Заб","Проп","Г","Заб","Проп",{"$f":"COUNTIF(AG2:AG6,\"00\")","v":0}]
["Первый дивизион (Иран)","2021.01.25 00:00","Эстеглал Моласани","Бадеран Тегеран",1,1,{"$f":"IF(A2=\"\",\"\",IF(A1=C2,IF(E2>F2,\"В\",IF(E2=F2,\"Н\",\"П\")),IF(E2<F2,\"В\",IF(E2=F2,\"Н\",\"П\"))))","v":"Н"},{"$f":"IF(A2=\"\",\"\",IF(A1=C2,E2,F2))","v":1},{"$f":"IF(A2=\"\",\"\",IF(A1=C2,F2,E2))","v":1},{"$f":"IF(A2=\"\",\"\",IF(G2=\"В\",1,0))","v":0},{"$f":"IF(A2=\"\",\"\",IF(G2=\"Н\",1,0))","v":1},{"$f":"IF(A2=\"\",\"\",IF(G2=\"П\",1,0))","v":0},{"$f":"IF(A2=\"\",\"\",IF(B1=D2,IF(F2>E2,\"В\",IF(F2=E2,\"Н\",\"П\")),IF(F2<E2,\"В\",IF(F2=E2,\"Н\",\"П\"))))","v":"Н"},{"$f":"IF(A2=\"\",\"\",IF(B1=D2,F2,E2))","v":1},{"$f":"IF(A2=\"\",\"\",IF(B1=D2,E2,F2))","v":1},{"$f":"IF(A2=\"\",\"\",IF(M2=\"В\",1,0))","v":0},{"$f":"IF(A2=\"\",\"\",IF(M2=\"Н\",1,0))","v":1},{"$f":"IF(A2=\"\",\"\",IF(M2=\"П\",1,0))","v":0},{"$f":"IF(A2=\"\",\"\",IF(C2=$A$1,\"Дома\",IF(D2=$A$1,\"В Гостях\",\"\")))","v":"В Гостях"},{"$f":"IF(S2=\"Дома\",G2,\"\")","v":""},{"$f":"IF(S2=\"Дома\",E2,\"\")","v":""},{"$f":"IF(S2=\"Дома\",F2,\"\")","v":""},{"$f":"IF(S2=\"В Гостях\",G2,\"\")","v":"Н"},{"$f":"IF(S2=\"В Гостях\",F2,\"\")","v":1},{"$f":"IF(S2=\"В Гостях\",E2,\"\")","v":1},{"$f":"IF(A2=\"\",\"\",IF(D2=$A$1,\"Дома\",IF(C2=$A$1,\"В Гостях\",\"\")))","v":"Дома"},{"$f":"IF(Z2=\"Дома\",M2,\"\")","v":"Н"},{"$f":"IF(Z2=\"Дома\",E2,\"\")","v":1},{"$f":"IF(Z2=\"Дома\",F2,\"\")","v":1},{"$f":"IF(Z2=\"В Гостях\",M2,\"\")","v":""},{"$f":"IF(Z2=\"В Гостях\",F2,\"\")","v":""},{"$f":"IF(Z2=\"В Гостях\",E2,\"\")","v":""},{"$f":"IF(E2=\"\",\"\",CONCATENATE(E2,F2))","v":"11"}]
[null,null,null,null,null,null,{"$f":"IF(A3=\"\",\"\",IF($A$1=C3,IF(E3>F3,\"В\",IF(E3=F3,\"Н\",\"П\")),IF(E3<F3,\"В\",IF(E3=F3,\"Н\",\"П\"))))","v":""},{"$f":"IF(A3=\"\",\"\",IF($A$1=C3,E3+H2,F3+H2))","v":""},{"$f":"IF(A3=\"\",\"\",IF($A$1=C3,F3+I2,E3+I2))","v":""},{"$f":"IF(A3=\"\",\"\",IF(G3=\"В\",1+J2,0+J2))","v":""},{"$f":"IF(A3=\"\",\"\",IF(G3=\"Н\",1+K2,0+K2))","v":""},{"$f":"IF(A3=\"\",\"\",IF(G3=\"П\",1+L2,0+L2))","v":""},{"$f":"IF(A3=\"\",\"\",IF($B$1=D3,IF(F3>E3,\"В\",IF(F3=E3,\"Н\",\"П\")),IF(F3<E3,\"В\",IF(F3=E3,\"Н\",\"П\"))))","v":""},{"$f":"IF(A3=\"\",\"\",IF($B$1=D3,F3+N2,E3+N2))","v":""},{"$f":"IF(A3=\"\",\"\",IF($B$1=D3,E3+O2,F3+O2))","v":""},{"$f":"IF(A3=\"\",\"\",IF(M3=\"В\",1+P2,0+P2))","v":""},{"$f":"IF(A3=\"\",\"\",IF(M3=\"Н\",1+Q2,0+Q2))","v":""},{"$f":"IF(A3=\"\",\"\",IF(M3=\"П\",1+R2,0+R2))","v":""},{"$f":"IF(A3=\"\",\"\",IF(C3=$A$1,\"Дома\",IF(D3=$A$1,\"В Гостях\",\"\")))","v":""},{"$f":"IF(S3=\"Дома\",G3,\"\")","v":""},{"$f":"IF(S3=\"Дома\",E3,\"\")","v":""},{"$f":"IF(S3=\"Дома\",F3,\"\")","v":""},{"$f":"IF(S3=\"В Гостях\",G3,\"\")","v":""},{"$f":"IF(S3=\"В Гостях\",F3,\"\")","v":""},{"$f":"IF(S3=\"В Гостях\",E3,\"\")","v":""},{"$f":"IF(A3=\"\",\"\",IF(D3=$A$1,\"Дома\",IF(C3=$A$1,\"В Гостях\",\"\")))","v":""},{"$f":"IF(Z3=\"Дома\",M3,\"\")","v":""},{"$f":"IF(Z3=\"Дома\",E3,\"\")","v":""},{"$f":"IF(Z3=\"Дома\",F3,\"\")","v":""},{"$f":"IF(Z3=\"В Гостях\",M3,\"\")","v":""},{"$f":"IF(Z3=\"В Гостях\",F3,\"\")","v":""},{"$f":"IF(Z3=\"В Гостях\",E3,\"\")","v":""},{"$f":"IF(E3=\"\",\"\",CONCATENATE(E3,F3))","v":""}]
[null,null,null,null,null,null,"","","",{"$f":"IF(A4=\"\",\"\",IF(G4=\"В\",1+J3,0+J3))","v":""},{"$f":"IF(A4=\"\",\"\",IF(G4=\"Н\",1+K3,0+K3))","v":""},{"$f":"IF(A4=\"\",\"\",IF(G4=\"П\",1+L3,0+L3))","v":""},{"$f":"IF(A4=\"\",\"\",IF($B$1=D4,IF(F4>E4,\"В\",IF(F4=E4,\"Н\",\"П\")),IF(F4<E4,\"В\",IF(F4=E4,\"Н\",\"П\"))))","v":""},{"$f":"IF(A4=\"\",\"\",IF($B$1=D4,F4+N3,E4+N3))","v":""},{"$f":"IF(A4=\"\",\"\",IF($B$1=D4,E4+O3,F4+O3))","v":""},{"$f":"IF(A4=\"\",\"\",IF(M4=\"В\",1+P3,0+P3))","v":""},{"$f":"IF(A4=\"\",\"\",IF(M4=\"Н\",1+Q3,0+Q3))","v":""},{"$f":"IF(A4=\"\",\"\",IF(M4=\"П\",1+R3,0+R3))","v":""},"","","","","","","","","","","","","","",""]
[null,null,null,null,null,null,"","","","","","","","","","","","","","","","","","","","","","","","","","",""]
[null,null,null,null,null,null,"","","","","","","","","","","","","","","","","","","","","","","","","","",""]
[null,null,null,null,null,null,"","","","","","","","","","","","","","","","","","","","","","","","","","",""]
[null,null,null,null,null,null,"","",{"$f":"IF(A8=\"\",\"\",IF($A$1=C8,F8+I7,E8+I7))","v":""},"","","","","","","","","","","","","","","","","","","","","","","",""]
[null,null,null,null,null,null,"","","","","","","","","","","","","","","","","","","","","","","","","","",""]
[null,null,null,null,null,null,"","","","","","","","","","","","","","","","","","","","","","","","","","",""]
[null,null,null,null,null,null,"","","","","","","","","","","","","","","","","","","","","","","","","",""]
[null,null,null,null,null,null,"","","","","","","","","","","","","","","","","","","","","","","","","",""]
[null,null,null,null,null,null,"","","","","","","","","","","","","","","","","","","","","","","","","",""]
[null,null,null,null,null,null,"","","","","","","","","","","","","","","","","","","","","","","","","",""]
[null,null,null,null,null,null,"","","","","","","","","","","","","","","","","","","","","","","","","",""]
[null,null,null,null,null,null,"","","","","","","","","","","","","","","","","","","","","","","","","",""]
[null,null,null,null,null,null,"","","","","","","","","","","","","","","","","","","","","","","","","",""]
[null,null,null,null,null,null,"","","","","","","","","","","","","","","","","","","","","","","","","",""]
[null,null,null,null,null,null,"","","","","","","","","","","","","","","","","","","","","","","","","",""]
[null,null,null,null,null,null,"","","","","","","","","","","","","","","","","","","","","","","","","",""]
[null,null,null,null,null,null,"","","","","","","","","","","","","","","","","","","","","","","","","",""]
[null,null,null,null,null,null,"","","","","","","","","","","","","","","","","","","","","","","","","",""]
[null,null,null,null,null,null,"","","","","","","","","","","","","","","","","","","","","","","","","",""]
[null,null,null,null,null,null,"","","","","","","","","","","","","","","","","","","","","","","","","",""]
[null,null,null,null,null,null,"","","","","","","","","","","","","","","","","","","","","","","","","",""]
[null,null,null,null,null,null,"","","","","","","","","","","","","","","","","","","","","","","","","",""]
[null,null,null,null,null,null,"","","","","","","","","","","","","","","","","","","","","","","","","",""]
[null,null,null,null,null,null,"","","","","","","","","","","","","","","","","","","","","","","","","",""]
[null,null,null,null,null,null,"","","","","","","","","","","","","","","","","","","","","","","","","",""]
[null,null,null,null,null,null,"","","","","","","","","","","","","","","","","","","","","","","","","",""]
[null,null,null,null,null,null,"","","","","","","","","","","","","","","","","","","","","","","","","",""]
[null,null,null,null,null,null,"","","","","","","","","","","","","","","","","","","","","","","","","",""]
[null,null,null,null,null,null,"","","","","","","","","","","","","","","","","","","","","","","","","",""]
[null,null,null,null,null,null,"","","","","","","","","","","","","","","","","","","","","","","","","",""]
[null,null,null,null,null,null,{"$f":"IF(A35=\"\",\"\",IF($A$1=C35,IF(E35>F35,\"В\",IF(E35=F35,\"Н\",\"П\")),IF(E35<F35,\"В\",IF(E35=F35,\"Н\",\"П\"))))","v":""},{"$f":"IF(A35=\"\",\"\",IF($A$1=C35,E35+H34,F35+H34))","v":""},{"$f":"IF(A35=\"\",\"\",IF($A$1=C35,F35+I34,E35+I34))","v":""},"","","","","","","","","","","","","","","","","","","","","","",""]
[null,null,null,null,null,null,"","","","","","","","","","","","","","","","","","","","","","","","","",""]
[null,null,null,null,null,null,"","","","","","","","","","","","","","","","","","","","","","","","","",""]
[null,null,null,null,null,null,"","","","","","","","","","","","","","","","","","","","","","","","","",""]
[null,null,null,null,null,null,"","","","","","","","","","","","","","","","","","","","","","","","","",""]
[null,null,null,null,null,null,"","","","","","","","","","","","","","","","","","","","","","","","","",""]
[null,null,null,null,null,null,"","","","","","","","","","","","","","","","","","","","","","","","","",""]
[null,null,null,null,null,null,"","","","","","","","","","","","","","","","","","","","","","","","","",""]
[null,null,null,null,null,null,"","","","","","","","","","","","","","","","","","","","","","","","","",""]
[null,null,null,null,null,null,"","","","","","","","","","","","","","","","","","","","","","","","","",""]
[null,null,null,null,null,null,"","","","","","","","","","","","","","","","","","","","","","","","","",""]
[null,null,null,null,null,null,"","","","","","","","","","","","","","","","","","","","","","","","","",""]
[null,null,null,null,null,null,"","","","","","","","","","","","","","","","","","","","","","","","","",""]
[null,null,null,null,null,null,"","","","","","","","","","","","","","","","","","","","","","","","","",""]
[null,null,null,null,null,null,"","","","","","","","","","","","","","","","","","","","","","","","","",""]
[null,null,null,null,null,null,"","","","","","","","","","","","","","","","","","","","","","","","","",""]
[null,null,null,null,null,null,"","","","","","","","","","","","","","","","","","","","","","","","","",""]
[null,null,null,null,null,null,"","","","","","","","","","","","","","","","","","","","","","","","","",""]
[null,null,null,null,null,null,"","","","","","","","","","","","","","","","","","","","","","","","","",""]
[null,null,null,null,null,null,"","","","","","","","","","","","","","","","","","","","","","","","","",""]
[null,null,null,null,null,null,"","","","","","","","","","","","","","","","","","","","","","","","","",""]
[null,null,null,null,null,null,"","","","","","","","","","","","","","","","","","","","","","","","","",""]
[null,null,null,null,null,null,"","","","","","","","","","","","","","","","","","","","","","","","","",""]
[null,null,null,null,null,null,"","","","","","","","","","","","","","","","","","","","","","","","","",""]
[null,null,null,null,null,null,"","","","","","","","","","","","","","","","","","","","","","","","","",""]
[null,null,null,null,null,null,"","","","","","","","","","","","","","","","","","","","","","","","","",""]
[null,null,null,null,null,null,"","","","","","","","","","","","","","","","","","","","","","","","","",""]
[null,null,null,null,null,null,"","","","","","","","","","","","","","","","","","","","","","","","","",""]
[null,null,null,null,null,null,"","","","","","","","","","","","","","","","","","","","","","","","","",""]
[null,null,null,null,null,null,"","","","","","","","","","","","","","","","","","","","","","","","","",""]
[null,null,null,null,null,null,"","","","","","","","","","","","","","","","","","","","","","","","","",""]
[null,null,null,null,null,null,"","","","","","","","","","","","","","","","","","","","","","","","","",""]
[null,null,null,null,null,null,{"$f":"IF(A67=\"\",\"\",IF($A$1=C67,IF(E67>F67,\"В\",IF(E67=F67,\"Н\",\"П\")),IF(E67<F67,\"В\",IF(E67=F67,\"Н\",\"П\"))))","v":""},{"$f":"IF(A67=\"\",\"\",IF($A$1=C67,E67+H66,F67+H66))","v":""},{"$f":"IF(A67=\"\",\"\",IF($A$1=C67,F67+I66,E67+I66))","v":""},"","","","","","","","","",{"$f":"IF(A67=\"\",\"\",IF(C67=$A$1,\"Дома\",IF(D67=$A$1,\"В Гостях\",\"\")))","v":""},{"$f":"IF(S67=\"Дома\",G67,\"\")","v":""},{"$f":"IF(S67=\"Дома\",E67,\"\")","v":""},{"$f":"IF(S67=\"Дома\",F67,\"\")","v":""},{"$f":"IF(S67=\"В Гостях\",G67,\"\")","v":""},{"$f":"IF(S67=\"В Гостях\",F67,\"\")","v":""},{"$f":"IF(S67=\"В Гостях\",E67,\"\")","v":""},{"$f":"IF(A67=\"\",\"\",IF(D67=$A$1,\"Дома\",IF(C67=$A$1,\"В Гостях\",\"\")))","v":""},{"$f":"IF(Z67=\"Дома\",M67,\"\")","v":""},{"$f":"IF(Z67=\"Дома\",E67,\"\")","v":""},{"$f":"IF(Z67=\"Дома\",F67,\"\")","v":""},{"$f":"IF(Z67=\"В Гостях\",M67,\"\")","v":""},{"$f":"IF(Z67=\"В Гостях\",F67,\"\")","v":""},{"$f":"IF(Z67=\"В Гостях\",E67,\"\")","v":""}]
[null,null,null,null,null,null,"","","",{"$f":"IF(A68=\"\",\"\",IF(G68=\"В\",1+J67,0+J67))","v":""},{"$f":"IF(A68=\"\",\"\",IF(G68=\"Н\",1+K67,0+K67))","v":""},{"$f":"IF(A68=\"\",\"\",IF(G68=\"П\",1+L67,0+L67))","v":""},{"$f":"IF(A68=\"\",\"\",IF($B$1=D68,IF(F68>E68,\"В\",IF(F68=E68,\"Н\",\"П\")),IF(F68<E68,\"В\",IF(F68=E68,\"Н\",\"П\"))))","v":""},{"$f":"IF(A68=\"\",\"\",IF($B$1=D68,F68+N67,E68+N67))","v":""},{"$f":"IF(A68=\"\",\"\",IF($B$1=D68,E68+O67,F68+O67))","v":""},{"$f":"IF(A68=\"\",\"\",IF(M68=\"В\",1+P67,0+P67))","v":""},{"$f":"IF(A68=\"\",\"\",IF(M68=\"Н\",1+Q67,0+Q67))","v":""},{"$f":"IF(A68=\"\",\"\",IF(M68=\"П\",1+R67,0+R67))","v":""},"","","","","","","","","","","","","",""]
[null,null,null,null,null,null,"","","","","","","","","","","","","","","","","","","","","","","","","",""]
[null,null,null,null,null,null,"","","","","","","","","","","","","","","","","","","","","","","","","",""]
[null,null,null,null,null,null,"","","","","","","","","","","","","","","","","","","","","","","","","",""]
[null,null,null,null,null,null,"","","","","","","","","","","","","","","","","","","","","","","","","",""]
[null,null,null,null,null,null,"","","","","","","","","","","","","","","","","","","","","","","","","",""]
[null,null,null,null,null,null,"","","","","","","","","","","","","","","","","","","","","","","","","",""]
[null,null,null,null,null,null,"","","","","","","","","","","","","","","","","","","","","","","","","",""]
[null,null,null,null,null,null,"","","","","","","","","","","","","","","","","","","","","","","","","",""]
[null,null,null,null,null,null,"","","","","","","","","","","","","","","","","","","","","","","","","",""]
[null,null,null,null,null,null,"","","","","","","","","","","","","","","","","","","","","","","","","",""]
[null,null,null,null,null,null,"","","","","","","","","","","","","","","","","","","","","","","","","",""]
[null,null,null,null,null,null,"","","","","","","","","","","","","","","","","","","","","","","","","",""]
[null,null,null,null,null,null,"","","","","","","","","","","","","","","","","","","","","","","","","",""]
[null,null,null,null,null,null,"","","","","","","","","","","","","","","","","","","","","","","","","",""]
[null,null,null,null,null,null,"","","","","","","","","","","","","","","","","","","","","","","","","",""]
[null,null,null,null,null,null,"","","","","","","","","","","","","","","","","","","","","","","","","",""]
[null,null,null,null,null,null,"","","","","","","","","","","","","","","","","","","","","","","","","",""]
[null,null,null,null,null,null,"","","","","","","","","","","","","","","","","","","","","","","","","",""]
[null,null,null,null,null,null,"","","","","","","","","","","","","","","","","","","","","","","","","",""]
[null,null,null,null,null,null,"","","","","","","","","","","","","","","","","","","","","","","","","",""]
[null,null,null,null,null,null,"","","","","","","","","","","","","","","","","","","","","","","","","",""]
[null,null,null,null,null,null,"","","","","","","","","","","","","","","","","","","","","","","","","",""]
[null,null,null,null,null,null,"","","","","","","","","","","","","","","","","","","","","","","","","",""]
[null,null,null,null,null,null,"","","","","","","","","","","","","","","","","","","","","","","","","",""]
[null,null,null,null,null,null,"","","","","","","","","","","","","","","","","","","","","","","","","",""]
[null,null,null,null,null,null,"","","","","","","","","","","","","","","","","","","","","","","","","",""]
[null,null,null,null,null,null,"","","","","","","","","","","","","","","","","","","","","","","","","",""]
[null,null,null,null,null,null,"","","","","","","","","","","","","","","","","","","","","","","","","",""]
[null,null,null,null,null,null,"","","","","","","","","","","","","","","","","","","","","","","","","",""]
[null,null,null,null,null,null,"","","","","","","","","","","","","","","","","","","","","","","","","",""]
[null,null,null,null,null,null,{"$f":"IF(A99=\"\",\"\",IF($A$1=C99,IF(E99>F99,\"В\",IF(E99=F99,\"Н\",\"П\")),IF(E99<F99,\"В\",IF(E99=F99,\"Н\",\"П\"))))","v":""},{"$f":"IF(A99=\"\",\"\",IF($A$1=C99,E99+H98,F99+H98))","v":""},{"$f":"IF(A99=\"\",\"\",IF($A$1=C99,F99+I98,E99+I98))","v":""},"","","","","","","","","","","","","","","","","","","","","","",""]
[null,null,null,null,null,null,"","","","","","","","","","","","","","","","","","","","","","","","","",""]
[null,null,null,null,null,null,"","","","","","","","","","","","","","","","","","","","","","","","","",""]
[null,null,null,null,null,null,"","","","","","","","","","","","","","","","","","","","","","","","","",""]
[null,null,null,null,null,null,"","","","","","","","","","","","","","","","","","","","","","","","","",""]
[null,null,null,null,null,null,"","","","","","","","","","","","","","","","","","","","","","","","","",""]
[null,null,null,null,null,null,"","","","","","","","","","","","","","","","","","","","","","","","","",""]
[null,null,null,null,null,null,"","","","","","","","","","","","","","","","","","","","","","","","","",""]
[null,null,null,null,null,null,"","","","","","","","","","","","","","","","","","","","","","","","","",""]
[null,null,null,null,null,null,"","","","","","","","","","","","","","","","","","","","","","","","","",""]
[null,null,null,null,null,null,"","","","","","","","","","","","","","","","","","","","","","","","","",""]
[null,null,null,null,null,null,"","","","","","","","","","","","","","","","","","","","","","","","","",""]
[null,null,null,null,null,null,"","","","","","","","","","","","","","","","","","","","","","","","","",""]
[null,null,null,null,null,null,"","","","","","","","","","","","","","","","","","","","","","","","","",""]
[null,null,null,null,null,null,"","","","","","","","","","","","","","","","","","","","","","","","","",""]
[null,null,null,null,null,null,"","","","","","","","","","","","","","","","","","","","","","","","","",""]
[null,null,null,null,null,null,"","","","","","","","","","","","","","","","","","","","","","","","","",""]
[null,null,null,null,null,null,"","","","","","","","","","","","","","","","","","","","","","","","","",""]
[null,null,null,null,null,null,"","","","","","","","","","","","","","","","","","","","","","","","","",""]
[null,null,null,null,null,null,"","","","","","","","","","","","","","","","","","","","","","","","","",""]
[null,null,null,null,null,null,"","","","","","","","","","","","","","","","","","","","","","","","","",""]
[null,null,null,null,null,null,"","","","","","","","","","","","","","","","","","","","","","","","","",""]
[null,null,null,null,null,null,"","","","","","","","","","","","","","","","","","","","","","","","","",""]
[null,null,null,null,null,null,"","","","","","","","","","","","","","","","","","","","","","","","","",""]
[null,null,null,null,null,null,"","","","","","","","","","","","","","","","","","","","","","","","","",""]
[null,null,null,null,null,null,"","","","","","","","","","","","","","","","","","","","","","","","","",""]
[null,null,null,null,null,null,"","","","","","","","","","","","","","","","","","","","","","","","","",""]
[null,null,null,null,null,null,"","","","","","","","","","","","","","","","","","","","","","","","","",""]
[null,null,null,null,null,null,"","","","","","","","","","","","","","","","","","","","","","","","","",""]
[null,null,null,null,null,null,"","","","","","","","","","","","","","","","","","","","","","","","","",""]
[null,null,null,null,null,null,"","","","","","","","","","","","","","","","","","","","","","","","","",""]
[null,null,null,null,null,null,"","","","","","","","","","","","","","","","","","","","","","","","","",""]
[null,null,null,null,null,null,{"$f":"IF(A131=\"\",\"\",IF($A$1=C131,IF(E131>F131,\"В\",IF(E131=F131,\"Н\",\"П\")),IF(E131<F131,\"В\",IF(E131=F131,\"Н\",\"П\"))))","v":""},{"$f":"IF(A131=\"\",\"\",IF($A$1=C131,E131+H130,F131+H130))","v":""},{"$f":"IF(A131=\"\",\"\",IF($A$1=C131,F131+I130,E131+I130))","v":""},"","","","","","","","","",{"$f":"IF(A131=\"\",\"\",IF(C131=$A$1,\"Дома\",IF(D131=$A$1,\"В Гостях\",\"\")))","v":""},{"$f":"IF(S131=\"Дома\",G131,\"\")","v":""},{"$f":"IF(S131=\"Дома\",E131,\"\")","v":""},{"$f":"IF(S131=\"Дома\",F131,\"\")","v":""},{"$f":"IF(S131=\"В Гостях\",G131,\"\")","v":""},{"$f":"IF(S131=\"В Гостях\",F131,\"\")","v":""},{"$f":"IF(S131=\"В Гостях\",E131,\"\")","v":""},{"$f":"IF(A131=\"\",\"\",IF(D131=$A$1,\"Дома\",IF(C131=$A$1,\"В Гостях\",\"\")))","v":""},{"$f":"IF(Z131=\"Дома\",M131,\"\")","v":""},{"$f":"IF(Z131=\"Дома\",E131,\"\")","v":""},{"$f":"IF(Z131=\"Дома\",F131,\"\")","v":""},{"$f":"IF(Z131=\"В Гостях\",M131,\"\")","v":""},{"$f":"IF(Z131=\"В Гостях\",F131,\"\")","v":""},{"$f":"IF(Z131=\"В Гостях\",E131,\"\")","v":""}]
[null,null,null,null,null,null,"","","",{"$f":"IF(A132=\"\",\"\",IF(G132=\"В\",1+J131,0+J131))","v":""},{"$f":"IF(A132=\"\",\"\",IF(G132=\"Н\",1+K131,0+K131))","v":""},{"$f":"IF(A132=\"\",\"\",IF(G132=\"П\",1+L131,0+L131))","v":""},{"$f":"IF(A132=\"\",\"\",IF($B$1=D132,IF(F132>E132,\"В\",IF(F132=E132,\"Н\",\"П\")),IF(F132<E132,\"В\",IF(F132=E132,\"Н\",\"П\"))))","v":""},{"$f":"IF(A132=\"\",\"\",IF($B$1=D132,F132+N131,E132+N131))","v":""},{"$f":"IF(A132=\"\",\"\",IF($B$1=D132,E132+O131,F132+O131))","v":""},{"$f":"IF(A132=\"\",\"\",IF(M132=\"В\",1+P131,0+P131))","v":""},{"$f":"IF(A132=\"\",\"\",IF(M132=\"Н\",1+Q131,0+Q131))","v":""},{"$f":"IF(A132=\"\",\"\",IF(M132=\"П\",1+R131,0+R131))","v":""},"","","","","","","","","","","","","",""]
[null,null,null,null,null,null,"","","","","","","","","","","","","","","","","","","","","","","","","",""]
[null,null,null,null,null,null,"","","","","","","","","","","","","","","","","","","","","","","","","",""]
[null,null,null,null,null,null,"","","","","","","","","","","","","","","","","","","","","","","","","",""]
[null,null,null,null,null,null,"","","","","","","","","","","","","","","","","","","","","","","","","",""]
[null,null,null,null,null,null,"","","","","","","","","","","","","","","","","","","","","","","","","",""]
[null,null,null,null,null,null,"","","","","","","","","","","","","","","","","","","","","","","","","",""]
[null,null,null,null,null,null,"","","","","","","","","","","","","","","","","","","","","","","","","",""]
[null,null,null,null,null,null,"","","","","","","","","","","","","","","","","","","","","","","","","",""]
[null,null,null,null,null,null,"","","","","","","","","","","","","","","","","","","","","","","","","",""]
[null,null,null,null,null,null,"","","","","","","","","","","","","","","","","","","","","","","","","",""]
[null,null,null,null,null,null,"","","","","","","","","","","","","","","","","","","","","","","","","",""]
[null,null,null,null,null,null,"","","","","","","","","","","","","","","","","","","","","","","","","",""]
[null,null,null,null,null,null,"","","","","","","","","","","","","","","","","","","","","","","","","",""]
[null,null,null,null,null,null,"","","","","","","","","","","","","","","","","","","","","","","","","",""]
[null,null,null,null,null,null,"","","","","","","","","","","","","","","","","","","","","","","","","",""]
[null,null,null,null,null,null,"","","","","","","","","","","","","","","","","","","","","","","","","",""]
[null,null,null,null,null,null,"","","","","","","","","","","","","","","","","","","","","","","","","",""]
[null,null,null,null,null,null,"","","","","","","","","","","","","","","","","","","","","","","","","",""]

{"sheet":"ДомаГости","index":11,"n_rows":150,"n_cols":35,"rows_kept":150,"cut":false,"hidden":true,"merged":[]}
["Чемпионат","Дата/Время","Дома","Гости","К1 в 1Т","К2 в 1Т","К1 во 2Т","К2 во 2Т","Где играли","К1 Голов","К2 Голов","Забито","Пропущено","Результат","Всего Игр","Всего выиграно","Всего ничьих","Всего проиграно","Всего забито","Всего пропущено","Всего очков","Дома игр","Дома выиграно","Дома ничьих","Дома проиграно","Дома забито","Дома пропущено","Дома очков","Гости игр","Гости выиграно","Гости ничьих","Гости проиграно","Гости забито","Гости пропущено","Гости очков"]
["ИРАН: Первый дивизион","2021.06.01 18:15","Хуши-Талаи","Бадеран Тегеран",0,0,2,0,"Гости",{"$f":"IF(I2=\"\",\"\",E2+G2)","v":2},{"$f":"IF(I2=\"\",\"\",F2+H2)","v":0},{"$f":"IF(I2=\"\",\"\",IF(I2=\"Дома\",J2,K2))","v":0},{"$f":"IF(I2=\"\",\"\",IF(I2=\"Дома\",K2,J2))","v":2},{"$f":"IF(I2=\"\",\"\",IF(I2=\"Дома\",IF(J2>K2,\"В\",IF(J2=K2,\"Н\",\"П\")),IF(J2<K2,\"В\",IF(J2=K2,\"Н\",\"П\"))))","v":"П"},{"$f":"IF(I2=\"\",\"\",1)","v":1},{"$f":"IF(I2=\"\",\"\",IF(N2=\"В\",1,0))","v":0},{"$f":"IF(I2=\"\",\"\",IF(N2=\"Н\",1,0))","v":0},{"$f":"IF(I2=\"\",\"\",IF(N2=\"П\",1,0))","v":1},{"$f":"IF(I2=\"\",\"\",L2)","v":0},{"$f":"IF(I2=\"\",\"\",M2)","v":2},{"$f":"IF(I2=\"\",\"\",P2*3+Q2)","v":0},{"$f":"IF(I2=\"\",\"\",IF(I2=\"Дома\",1,0))","v":0},{"$f":"IF(I2=\"\",\"\",IF(I2=\"Дома\",IF(N2=\"В\",1,0),0))","v":0},{"$f":"IF(I2=\"\",\"\",IF(I2=\"Дома\",IF(N2=\"Н\",1,0),0))","v":0},{"$f":"IF(I2=\"\",\"\",IF(I2=\"Дома\",IF(N2=\"П\",1,0),0))","v":0},{"$f":"IF(I2=\"\",\"\",IF(I2=\"Дома\",L2,0))","v":0},{"$f":"IF(I2=\"\",\"\",IF(I2=\"Дома\",M2,0))","v":0},{"$f":"IF(I2=\"\",\"\",IF(I2=\"Дома\",W2*3+X2,0))","v":0},{"$f":"IF(I2=\"\",\"\",IF(I2=\"Гости\",1,0))","v":1},{"$f":"IF(I2=\"\",\"\",IF(I2=\"Гости\",IF(N2=\"В\",1,0),0))","v":0},{"$f":"IF(I2=\"\",\"\",IF(I2=\"Гости\",IF(N2=\"Н\",1,0),0))","v":0},{"$f":"IF(I2=\"\",\"\",IF(I2=\"Гости\",IF(N2=\"П\",1,0),0))","v":1},{"$f":"IF(I2=\"\",\"\",IF(I2=\"Гости\",L2,0))","v":0},{"$f":"IF(I2=\"\",\"\",IF(I2=\"Гости\",M2,0))","v":2},{"$f":"IF(I2=\"\",\"\",IF(I2=\"Гости\",AD2*3+AE2,0))","v":0}]
["ИРАН: Первый дивизион","2021.05.20 18:45","Шахин Бушехр","Бадеран Тегеран",1,1,1,0,"Гости",{"$f":"IF(I3=\"\",\"\",E3+G3)","v":2},{"$f":"IF(I3=\"\",\"\",F3+H3)","v":1},{"$f":"IF(I3=\"\",\"\",IF(I3=\"Дома\",J3,K3))","v":1},{"$f":"IF(I3=\"\",\"\",IF(I3=\"Дома\",K3,J3))","v":2},{"$f":"IF(I3=\"\",\"\",IF(I3=\"Дома\",IF(J3>K3,\"В\",IF(J3=K3,\"Н\",\"П\")),IF(J3<K3,\"В\",IF(J3=K3,\"Н\",\"П\"))))","v":"П"},{"$f":"IF(I3=\"\",\"\",O2+1)","v":2},{"$f":"IF(I3=\"\",\"\",IF(N3=\"В\",P2+1,P2))","v":0},{"$f":"IF(I3=\"\",\"\",IF(N3=\"Н\",Q2+1,Q2))","v":0},{"$f":"IF(I3=\"\",\"\",IF(N3=\"П\",R2+1,R2))","v":2},{"$f":"IF(I3=\"\",\"\",S2+L3)","v":1},{"$f":"IF(I3=\"\",\"\",T2+M3)","v":4},{"$f":"IF(I3=\"\",\"\",P3*3+Q3)","v":0},{"$f":"IF(I3=\"\",\"\",IF(I3=\"Дома\",V2+1,V2+0))","v":0},{"$f":"IF(I3=\"\",\"\",IF(I3=\"Дома\",IF(N3=\"В\",W2+1,W2),W2))","v":0},{"$f":"IF(I3=\"\",\"\",IF(I3=\"Дома\",IF(N3=\"Н\",X2+1,X2),X2))","v":0},{"$f":"IF(I3=\"\",\"\",IF(I3=\"Дома\",IF(N3=\"П\",Y2+1,Y2),Y2))","v":0},{"$f":"IF(I3=\"\",\"\",IF(I3=\"Дома\",L3+Z2,Z2))","v":0},{"$f":"IF(I3=\"\",\"\",IF(I3=\"Дома\",M3+AA2,AA2))","v":0},{"$f":"IF(I3=\"\",\"\",IF(I3=\"Дома\",W3*3+X3,AB2))","v":0},{"$f":"IF(I3=\"\",\"\",IF(I3=\"Гости\",AC2+1,AC2+0))","v":2},{"$f":"IF(I3=\"\",\"\",IF(I3=\"Гости\",IF(N3=\"В\",AD2+1,AD2),AD2))","v":0},{"$f":"IF(I3=\"\",\"\",IF(I3=\"Гости\",IF(N3=\"Н\",AE2+1,AE2),AE2))","v":0},{"$f":"IF(I3=\"\",\"\",IF(I3=\"Гости\",IF(N3=\"П\",AF2+1,AF2),AF2))","v":2},{"$f":"IF(I3=\"\",\"\",IF(I3=\"Гости\",L3+AG2,AG2))","v":1},{"$f":"IF(I3=\"\",\"\",IF(I3=\"Гости\",M3+AH2,AH2))","v":4},{"$f":"IF(I3=\"\",\"\",IF(I3=\"Гости\",AD3*3+AE3,AI2))","v":0}]
["ИРАН: Первый дивизион","2021.05.08 18:45","Могхавемат","Бадеран Тегеран",0,1,1,1,"Гости",1,2,2,1,"В",3,{"$f":"IF(I4=\"\",\"\",IF(N4=\"В\",P3+1,P3))","v":1},{"$f":"IF(I4=\"\",\"\",IF(N4=\"Н\",Q3+1,Q3))","v":0},{"$f":"IF(I4=\"\",\"\",IF(N4=\"П\",R3+1,R3))","v":2},{"$f":"IF(I4=\"\",\"\",S3+L4)","v":3},{"$f":"IF(I4=\"\",\"\",T3+M4)","v":5},3,{"$f":"IF(I4=\"\",\"\",IF(I4=\"Дома\",V3+1,V3+0))","v":0},{"$f":"IF(I4=\"\",\"\",IF(I4=\"Дома\",IF(N4=\"В\",W3+1,W3),W3))","v":0},{"$f":"IF(I4=\"\",\"\",IF(I4=\"Дома\",IF(N4=\"Н\",X3+1,X3),X3))","v":0},{"$f":"IF(I4=\"\",\"\",IF(I4=\"Дома\",IF(N4=\"П\",Y3+1,Y3),Y3))","v":0},{"$f":"IF(I4=\"\",\"\",IF(I4=\"Дома\",L4+Z3,Z3))","v":0},{"$f":"IF(I4=\"\",\"\",IF(I4=\"Дома\",M4+AA3,AA3))","v":0},{"$f":"IF(I4=\"\",\"\",IF(I4=\"Дома\",W4*3+X4,AB3))","v":0},{"$f":"IF(I4=\"\",\"\",IF(I4=\"Гости\",AC3+1,AC3+0))","v":3},{"$f":"IF(I4=\"\",\"\",IF(I4=\"Гости\",IF(N4=\"В\",AD3+1,AD3),AD3))","v":1},{"$f":"IF(I4=\"\",\"\",IF(I4=\"Гости\",IF(N4=\"Н\",AE3+1,AE3),AE3))","v":0},{"$f":"IF(I4=\"\",\"\",IF(I4=\"Гости\",IF(N4=\"П\",AF3+1,AF3),AF3))","v":2},{"$f":"IF(I4=\"\",\"\",IF(I4=\"Гости\",L4+AG3,AG3))","v":3},{"$f":"IF(I4=\"\",\"\",IF(I4=\"Гости\",M4+AH3,AH3))","v":5},{"$f":"IF(I4=\"\",\"\",IF(I4=\"Гости\",AD4*3+AE4,AI3))","v":3}]
["ИРАН: Первый дивизион","2021.04.19 18:45","Астара","Бадеран Тегеран",0,1,0,2,"Гости",0,3,3,0,"В",4,2,0,2,6,5,6,0,0,0,0,0,0,0,4,2,0,2,6,5,6]
["ИРАН: Первый дивизион","2021.04.07 15:00","Хейбар Хоррамабад","Бадеран Тегеран",0,0,1,0,"Гости",1,0,0,1,"П",5,2,0,3,6,6,6,0,0,0,0,0,0,0,5,2,0,3,6,6,6]
["ИРАН: Первый дивизион","2021.03.02 14:00","Райка Баболь","Бадеран Тегеран",0,2,3,0,"Гости",3,2,2,3,"П",6,2,0,4,8,9,6,0,0,0,0,0,0,0,6,2,0,4,8,9,6]
["ИРАН: Первый дивизион","2021.02.14 13:30","Чока Талеш","Бадеран Тегеран",1,1,1,3,"Гости",2,4,4,2,"В",7,3,0,4,12,11,9,0,0,0,0,0,0,0,7,3,0,4,12,11,9]
["ИРАН: Первый дивизион","2021.01.25 13:30","Эстеглал Моласани","Бадеран Тегеран",1,0,0,1,"Гости",1,1,1,1,{"$f":"IF(I9=\"\",\"\",IF(I9=\"Дома\",IF(J9>K9,\"В\",IF(J9=K9,\"Н\",\"П\")),IF(J9<K9,\"В\",IF(J9=K9,\"Н\",\"П\"))))","v":"Н"},8,3,1,4,13,12,10,0,0,0,0,0,0,0,8,3,1,4,13,12,10]
["ИРАН: Первый дивизион","2021.01.11 13:30","Навад Урмия","Бадеран Тегеран",0,0,0,2,"Гости",0,2,2,0,{"$f":"IF(I10=\"\",\"\",IF(I10=\"Дома\",IF(J10>K10,\"В\",IF(J10=K10,\"Н\",\"П\")),IF(J10<K10,\"В\",IF(J10=K10,\"Н\",\"П\"))))","v":"В"},9,4,1,4,15,12,13,0,0,0,0,0,0,0,9,4,1,4,15,12,13]
["ИРАН: Первый дивизион","2020.12.28 13:30","Гол Рейхан","Бадеран Тегеран",1,0,0,0,"Гости",1,0,0,1,"П",10,4,1,5,15,13,13,0,0,0,0,0,0,0,10,4,1,5,15,13,13]
["ИРАН: Первый дивизион","2020.12.16 13:30","Хавадар","Бадеран Тегеран",1,0,0,2,"Гости",1,2,2,1,"В",11,5,1,5,17,14,{"$f":"IF(I12=\"\",\"\",P12*3+Q12)","v":16},0,0,0,0,0,0,0,11,5,1,5,17,14,16]
["ИРАН: Первый дивизион","2020.12.05 13:45","Арман Гохар","Бадеран Тегеран",0,0,0,0,"Гости",0,0,0,0,"Н",12,5,2,5,17,14,17,0,0,0,0,0,0,0,12,5,2,5,17,14,17]
["ИРАН: Первый дивизион","2020.11.22 15:00","Эстеглал Хузестан","Бадеран Тегеран",0,0,1,0,"Гости",1,0,0,1,"П",13,5,2,6,17,15,17,0,0,0,0,0,0,0,13,5,2,6,17,15,17]
["ИРАН: Первый дивизион","2020.08.16 18:30","Мес Рафсанжан","Бадеран Тегеран",0,1,1,0,"Гости",1,1,1,1,"Н",14,5,3,6,18,16,18,0,0,0,0,0,0,0,14,5,3,6,18,16,18]
["ИРАН: Первый дивизион","2020.07.25 18:10","Гол Рейхан","Бадеран Тегеран",0,0,1,1,"Гости",1,1,1,1,"Н",15,5,4,6,19,17,19,0,0,0,0,0,0,0,15,5,4,6,19,17,19]
["ИРАН: Первый дивизион","2020.07.12 18:20","Хуши-Талаи","Бадеран Тегеран",2,1,0,2,"Гости",2,3,3,2,"В",16,6,4,6,22,19,22,0,0,0,0,0,0,0,16,6,4,6,22,19,22]
["ИРАН: Первый дивизион","2020.06.30 18:30","Малаван","Бадеран Тегеран",0,0,2,0,"Гости",2,0,0,2,"П",17,6,4,7,22,21,22,0,0,0,0,0,0,0,17,6,4,7,22,21,22]
["ИРАН: Первый дивизион","2020.02.23 13:45","Алюминиум Арак","Бадеран Тегеран",0,0,1,0,"Гости",1,0,0,1,"П",18,6,4,8,22,22,22,0,0,0,0,0,0,0,18,6,4,8,22,22,22]
["ИРАН: Первый дивизион","2020.02.08 13:30","Хавадар","Бадеран Тегеран",0,0,2,1,"Гости",2,1,1,2,"П",19,6,4,9,23,24,22,0,0,0,0,0,0,0,19,6,4,9,23,24,22]
[null,null,null,null,null,null,null,null,null,"","","","","","","","","","","","","","","","","","","","","","","","","",""]
[null,null,null,null,null,null,null,null,null,"","","","","","","","","","","","","","","","","","","","","","","","","",""]
[null,null,null,null,null,null,null,null,null,"","","","","","","","","","","","","","","","","","","","","","","","","",""]
[null,null,null,null,null,null,null,null,null,"","","","","","","","","","","","","","","","","","","","","","","","","",""]
[null,null,null,null,null,null,null,null,null,"","","","","","","","","","","","","","","","","","","","","","","","","",""]
[null,null,null,null,null,null,null,null,null,"","","","","","","","","","","","","","","","","","","","","","","","","",""]
[null,null,null,null,null,null,null,null,null,"","","","","","","","","","","","","","","","","","","","","","","","","",""]
[null,null,null,null,null,null,null,null,null,"","","","","","","","","","","","","","","","","","","","","","","","","",""]
[null,null,null,null,null,null,null,null,null,"","","","","","","","","","","","","","","","","","","","","","","","","",""]
[null,null,null,null,null,null,null,null,null,"","","","","","","","","","","","","","","","","","","","","","","","","",""]
[null,null,null,null,null,null,null,null,null,"","","","","","","","","","","","","","","","","","","","","","","","","",""]
[null,null,null,null,null,null,null,null,null,"","","","","","","","","","","","","","","","","","","","","","","","","",""]
[null,null,null,null,null,null,null,null,null,"","","","","","","","","","","","","","","","","","","","","","","","","",""]
[null,null,null,null,null,null,null,null,null,"","","","","","","","","","","","","","","","","","","","","","","","","",""]
[null,null,null,null,null,null,null,null,null,"","","","","","","","","","","","","","","","","","","","","","","","","",""]
[null,null,null,null,null,null,null,null,null,"","","","","","","","","","","","","","","","","","","","","","","","","",""]
[null,null,null,null,null,null,null,null,null,"","","","","","","","","","","","","","","","","","","","","","","","","",""]
[null,null,null,null,null,null,null,null,null,"","","","","","","","","","","","","","","","","","","","","","","","","",""]
[null,null,null,null,null,null,null,null,null,"","","","","","","","","","","","","","","","","","","","","","","","","",""]
[null,null,null,null,null,null,null,null,null,"","","","","","","","","","","","","","","","","","","","","","","","","",""]
[null,null,null,null,null,null,null,null,null,"","","","","","","","","","","","","","","","","","","","","","","","","",""]
[null,null,null,null,null,null,null,null,null,"","","","","","","","","","","","","","","","","","","","","","","","","",""]
[null,null,null,null,null,null,null,null,null,"","","","","","","","","","","","","","","","","","","","","","","","","",""]
[null,null,null,null,null,null,null,null,null,"","","","","","","","","","","","","","","","","","","","","","","","","",""]
[null,null,null,null,null,null,null,null,null,"","","","","","","","","","","","","","","","","","","","","","","","","",""]
[null,null,null,null,null,null,null,null,null,"","","","","","","","","","","","","","","","","","","","","","","","","",""]
[null,null,null,null,null,null,null,null,null,"","","","","","","","","","","","","","","","","","","","","","","","","",""]
[null,null,null,null,null,null,null,null,null,"","","","","","","","","","","","","","","","","","","","","","","","","",""]
[null,null,null,null,null,null,null,null,null,"","","","","","","","","","","","","","","","","","","","","","","","","",""]
[null,null,null,null,null,null,null,null,null,"","","","","","","","","","","","","","","","","","","","","","","","","",""]
[null,null,null,null,null,null,null,null,null,"","","","","","","","","","","","","","","","","","","","","","","","","",""]
[null,null,null,null,null,null,null,null,null,"","","","","","","","","","","","","","","","","","","","","","","","","",""]
[null,null,null,null,null,null,null,null,null,"","","","","","","","","","","","","","","","","","","","","","","","","",""]
[null,null,null,null,null,null,null,null,null,"","","","","","","","","","","","","","","","","","","","","","","","","",""]
[null,null,null,null,null,null,null,null,null,"","","","","","","","","","","","","","","","","","","","","","","","","",""]
[null,null,null,null,null,null,null,null,null,"","","","","","","","","","","","","","","","","","","","","","","","","",""]
[null,null,null,null,null,null,null,null,null,"","","","","","","","","","","","","","","","","","","","","","","","","",""]
[null,null,null,null,null,null,null,null,null,"","","","","","","","","","","","","","","","","","","","","","","","","",""]
[null,null,null,null,null,null,null,null,null,"","","","","","","","","","","","","","","","","","","","","","","","","",""]
[null,null,null,null,null,null,null,null,null,"","","","","","","","","","","","","","","","","","","","","","","","","",""]
[null,null,null,null,null,null,null,null,null,"","","","","","","","","","","","","","","","","","","","","","","","","",""]
[null,null,null,null,null,null,null,null,null,"","","","","","","","","","","","","","","","","","","","","","","","","",""]
[null,null,null,null,null,null,null,null,null,"","","","","","","","","","","","","","","","","","","","","","","","","",""]
[null,null,null,null,null,null,null,null,null,"","","","","","","","","","","","","","","","","","","","","","","","","",""]
[null,null,null,null,null,null,null,null,null,"","","","","","","","","","","","","","","","","","","","","","","","","",""]
[null,null,null,null,null,null,null,null,null,"","","","","","","","","","","","","","","","","","","","","","","","","",""]
[null,null,null,null,null,null,null,null,null,{"$f":"IF(I67=\"\",\"\",E67+G67)","v":""},{"$f":"IF(I67=\"\",\"\",F67+H67)","v":""},{"$f":"IF(I67=\"\",\"\",IF(I67=\"Дома\",J67,K67))","v":""},{"$f":"IF(I67=\"\",\"\",IF(I67=\"Дома\",K67,J67))","v":""},"",{"$f":"IF(I67=\"\",\"\",O66+1)","v":""},"","","","","",{"$f":"IF(I67=\"\",\"\",P67*3+Q67)","v":""},"","","","","","","","","","","","","",""]
[null,null,null,null,null,null,null,null,null,"","","","","","",{"$f":"IF(I68=\"\",\"\",IF(N68=\"В\",P67+1,P67))","v":""},{"$f":"IF(I68=\"\",\"\",IF(N68=\"Н\",Q67+1,Q67))","v":""},{"$f":"IF(I68=\"\",\"\",IF(N68=\"П\",R67+1,R67))","v":""},{"$f":"IF(I68=\"\",\"\",S67+L68)","v":""},{"$f":"IF(I68=\"\",\"\",T67+M68)","v":""},"",{"$f":"IF(I68=\"\",\"\",IF(I68=\"Дома\",V67+1,V67+0))","v":""},{"$f":"IF(I68=\"\",\"\",IF(I68=\"Дома\",IF(N68=\"В\",W67+1,W67),W67))","v":""},{"$f":"IF(I68=\"\",\"\",IF(I68=\"Дома\",IF(N68=\"Н\",X67+1,X67),X67))","v":""},{"$f":"IF(I68=\"\",\"\",IF(I68=\"Дома\",IF(N68=\"П\",Y67+1,Y67),Y67))","v":""},{"$f":"IF(I68=\"\",\"\",IF(I68=\"Дома\",L68+Z67,Z67))","v":""},{"$f":"IF(I68=\"\",\"\",IF(I68=\"Дома\",M68+AA67,AA67))","v":""},{"$f":"IF(I68=\"\",\"\",IF(I68=\"Дома\",W68*3+X68,AB67))","v":""},{"$f":"IF(I68=\"\",\"\",IF(I68=\"Гости\",AC67+1,AC67+0))","v":""},{"$f":"IF(I68=\"\",\"\",IF(I68=\"Гости\",IF(N68=\"В\",AD67+1,AD67),AD67))","v":""},{"$f":"IF(I68=\"\",\"\",IF(I68=\"Гости\",IF(N68=\"Н\",AE67+1,AE67),AE67))","v":""},{"$f":"IF(I68=\"\",\"\",IF(I68=\"Гости\",IF(N68=\"П\",AF67+1,AF67),AF67))","v":""},{"$f":"IF(I68=\"\",\"\",IF(I68=\"Гости\",L68+AG67,AG67))","v":""},{"$f":"IF(I68=\"\",\"\",IF(I68=\"Гости\",M68+AH67,AH67))","v":""},{"$f":"IF(I68=\"\",\"\",IF(I68=\"Гости\",AD68*3+AE68,AI67))","v":""}]
[null,null,null,null,null,null,null,null,null,"","","","","","","","","","","","","","","","","","","","","","","","","",""]
[null,null,null,null,null,null,null,null,null,"","","","","","","","","","","","","","","","","","","","","","","","","",""]
[null,null,null,null,null,null,null,null,null,"","","","","","","","","","","","","","","","","","","","","","","","","",""]
[null,null,null,null,null,null,null,null,null,"","","","","","","","","","","","","","","","","","","","","","","","","",""]
[null,null,null,null,null,null,null,null,null,"","","","","","","","","","","","","","","","","","","","","","","","","",""]
[null,null,null,null,null,null,null,null,null,"","","","",{"$f":"IF(I74=\"\",\"\",IF(I74=\"Дома\",IF(J74>K74,\"В\",IF(J74=K74,\"Н\",\"П\")),IF(J74<K74,\"В\",IF(J74=K74,\"Н\",\"П\"))))","v":""},"","","","","","","","","","","","","","","","","","","","",""]
[null,null,null,null,null,null,null,null,null,"","","","","","","","","","","","","","","","","","","","","","","","","",""]
[null,null,null,null,null,null,null,null,null,"","","","","","","","","","","","","","","","","","","","","","","","","",""]
[null,null,null,null,null,null,null,null,null,"","","","","","","","","","","","","","","","","","","","","","","","","",""]
[null,null,null,null,null,null,null,null,null,"","","","","","","","","","","","","","","","","","","","","","","","","",""]
[null,null,null,null,null,null,null,null,null,"","","","","","","","","","","","","","","","","","","","","","","","","",""]
[null,null,null,null,null,null,null,null,null,"","","","","","","","","","","","","","","","","","","","","","","","","",""]
[null,null,null,null,null,null,null,null,null,"","","","","","","","","","","","","","","","","","","","","","","","","",""]
[null,null,null,null,null,null,null,null,null,"","","","","","","","","","","","","","","","","","","","","","","","","",""]
[null,null,null,null,null,null,null,null,null,"","","","","","","","","","","","","","","","","","","","","","","","","",""]
[null,null,null,null,null,null,null,null,null,"","","","","","","","","","","","","","","","","","","","","","","","","",""]
[null,null,null,null,null,null,null,null,null,"","","","","","","","","","","","","","","","","","","","","","","","","",""]
[null,null,null,null,null,null,null,null,null,"","","","","","","","","","","","","","","","","","","","","","","","","",""]
[null,null,null,null,null,null,null,null,null,"","","","","","","","","","","","","","","","","","","","","","","","","",""]
[null,null,null,null,null,null,null,null,null,"","","","","","","","","","","","","","","","","","","","","","","","","",""]
[null,null,null,null,null,null,null,null,null,"","","","","","","","","","","","","","","","","","","","","","","","","",""]
[null,null,null,null,null,null,null,null,null,"","","","","","","","","","","","","","","","","","","","","","","","","",""]
[null,null,null,null,null,null,null,null,null,"","","","","","","","","","","","","","","","","","","","","","","","","",""]
[null,null,null,null,null,null,null,null,null,"","","","","","","","","","","","","","","","","","","","","","","","","",""]
[null,null,null,null,null,null,null,null,null,"","","","","","","","","","","","","","","","","","","","","","","","","",""]
[null,null,null,null,null,null,null,null,null,"","","","","","","","","","","","","","","","","","","","","","","","","",""]
[null,null,null,null,null,null,null,null,null,"","","","","","","","","","","","","","","","","","","","","","","","","",""]
[null,null,null,null,null,null,null,null,null,"","","","","","","","","","","","","","","","","","","","","","","","","",""]
[null,null,null,null,null,null,null,null,null,"","","","","","","","","","","","","","","","","","","","","","","","","",""]
[null,null,null,null,null,null,null,null,null,"","","","","","","","","","","","","","","","","","","","","","","","","",""]
[null,null,null,null,null,null,null,null,null,"","","","","","","","","","","","","","","","","","","","","","","","","",""]
[null,null,null,null,null,null,null,null,null,"","","","","","","","","","","","","","","","","","","","","","","","","",""]
[null,null,null,null,null,null,null,null,null,"","","","","","","","","","","","","","","","","","","","","","","","","",""]
[null,null,null,null,null,null,null,null,null,"","","","","","","","","","","","","","","","","","","","","","","","","",""]
[null,null,null,null,null,null,null,null,null,"","","","","","","","","","","","","","","","","","","","","","","","","",""]
[null,null,null,null,null,null,null,null,null,"","","","","","","","","","","","","","","","","","","","","","","","","",""]
[null,null,null,null,null,null,null,null,null,"","","","","","","","","","","","","","","","","","","","","","","","","",""]
[null,null,null,null,null,null,null,null,null,"","","","","","","","","","","","","","","","","","","","","","","","","",""]
[null,null,null,null,null,null,null,null,null,"","","","","","","","","","","","","","","","","","","","","","","","","",""]
[null,null,null,null,null,null,null,null,null,"","","","","","","","","","","","","","","","","","","","","","","","","",""]
[null,null,null,null,null,null,null,null,null,"","","","","","","","","","","","","","","","","","","","","","","","","",""]
[null,null,null,null,null,null,null,null,null,"","","","","","","","","","","","","","","","","","","","","","","","","",""]
[null,null,null,null,null,null,null,null,null,"","","","","","","","","","","","","","","","","","","","","","","","","",""]
[null,null,null,null,null,null,null,null,null,"","","","","","","","","","","","","","","","","","","","","","","","","",""]
[null,null,null,null,null,null,null,null,null,"","","","","","","","","","","","","","","","","","","","","","","","","",""]
[null,null,null,null,null,null,null,null,null,"","","","","","","","","","","","","","","","","","","","","","","","","",""]
[null,null,null,null,null,null,null,null,null,"","","","","","","","","","","","","","","","","","","","","","","","","",""]
[null,null,null,null,null,null,null,null,null,"","","","","","","","","","","","","","","","","","","","","","","","","",""]
[null,null,null,null,null,null,null,null,null,"","","","","","","","","","","","","","","","","","","","","","","","","",""]
[null,null,null,null,null,null,null,null,null,"","","","","","","","","","","","","","","","","","","","","","","","","",""]
[null,null,null,null,null,null,null,null,null,"","","","","","","","","","","","","","","","","","","","","","","","","",""]
[null,null,null,null,null,null,null,null,null,"","","","","","","","","","","","","","","","","","","","","","","","","",""]
[null,null,null,null,null,null,null,null,null,"","","","","","","","","","","","","","","","","","","","","","","","","",""]
[null,null,null,null,null,null,null,null,null,"","","","","","","","","","","","","","","","","","","","","","","","","",""]
[null,null,null,null,null,null,null,null,null,"","","","","","","","","","","","","","","","","","","","","","","","","",""]
[null,null,null,null,null,null,null,null,null,"","","","","","","","","","","","","","","","","","","","","","","","","",""]
[null,null,null,null,null,null,null,null,null,"","","","","","","","","","","","","","","","","","","","","","","","","",""]
[null,null,null,null,null,null,null,null,null,"","","","","","","","","","","","","","","","","","","","","","","","","",""]
[null,null,null,null,null,null,null,null,null,"","","","","","","","","","","","","","","","","","","","","","","","","",""]
[null,null,null,null,null,null,null,null,null,"","","","","","","","","","","","","","","","","","","","","","","","","",""]
[null,null,null,null,null,null,null,null,null,"","","","","","","","","","","","","","","","","","","","","","","","","",""]
[null,null,null,null,null,null,null,null,null,"","","","","","","","","","","","","","","","","","","","","","","","","",""]
[null,null,null,null,null,null,null,null,null,{"$f":"IF(I131=\"\",\"\",E131+G131)","v":""},{"$f":"IF(I131=\"\",\"\",F131+H131)","v":""},{"$f":"IF(I131=\"\",\"\",IF(I131=\"Дома\",J131,K131))","v":""},{"$f":"IF(I131=\"\",\"\",IF(I131=\"Дома\",K131,J131))","v":""},"",{"$f":"IF(I131=\"\",\"\",O130+1)","v":""},"","","","","",{"$f":"IF(I131=\"\",\"\",P131*3+Q131)","v":""},"","","","","","","","","","","","","",""]
[null,null,null,null,null,null,null,null,null,"","","","","","",{"$f":"IF(I132=\"\",\"\",IF(N132=\"В\",P131+1,P131))","v":""},{"$f":"IF(I132=\"\",\"\",IF(N132=\"Н\",Q131+1,Q131))","v":""},{"$f":"IF(I132=\"\",\"\",IF(N132=\"П\",R131+1,R131))","v":""},{"$f":"IF(I132=\"\",\"\",S131+L132)","v":""},{"$f":"IF(I132=\"\",\"\",T131+M132)","v":""},"",{"$f":"IF(I132=\"\",\"\",IF(I132=\"Дома\",V131+1,V131+0))","v":""},{"$f":"IF(I132=\"\",\"\",IF(I132=\"Дома\",IF(N132=\"В\",W131+1,W131),W131))","v":""},{"$f":"IF(I132=\"\",\"\",IF(I132=\"Дома\",IF(N132=\"Н\",X131+1,X131),X131))","v":""},{"$f":"IF(I132=\"\",\"\",IF(I132=\"Дома\",IF(N132=\"П\",Y131+1,Y131),Y131))","v":""},{"$f":"IF(I132=\"\",\"\",IF(I132=\"Дома\",L132+Z131,Z131))","v":""},{"$f":"IF(I132=\"\",\"\",IF(I132=\"Дома\",M132+AA131,AA131))","v":""},{"$f":"IF(I132=\"\",\"\",IF(I132=\"Дома\",W132*3+X132,AB131))","v":""},{"$f":"IF(I132=\"\",\"\",IF(I132=\"Гости\",AC131+1,AC131+0))","v":""},{"$f":"IF(I132=\"\",\"\",IF(I132=\"Гости\",IF(N132=\"В\",AD131+1,AD131),AD131))","v":""},{"$f":"IF(I132=\"\",\"\",IF(I132=\"Гости\",IF(N132=\"Н\",AE131+1,AE131),AE131))","v":""},{"$f":"IF(I132=\"\",\"\",IF(I132=\"Гости\",IF(N132=\"П\",AF131+1,AF131),AF131))","v":""},{"$f":"IF(I132=\"\",\"\",IF(I132=\"Гости\",L132+AG131,AG131))","v":""},{"$f":"IF(I132=\"\",\"\",IF(I132=\"Гости\",M132+AH131,AH131))","v":""},{"$f":"IF(I132=\"\",\"\",IF(I132=\"Гости\",AD132*3+AE132,AI131))","v":""}]
[null,null,null,null,null,null,null,null,null,"","","","","","","","","","","","","","","","","","","","","","","","","",""]
[null,null,null,null,null,null,null,null,null,"","","","","","","","","","","","","","","","","","","","","","","","","",""]
[null,null,null,null,null,null,null,null,null,"","","","","","","","","","","","","","","","","","","","","","","","","",""]
[null,null,null,null,null,null,null,null,null,"","","","","","","","","","","","","","","","","","","","","","","","","",""]
[null,null,null,null,null,null,null,null,null,"","","","","","","","","","","","","","","","","","","","","","","","","",""]
[null,null,null,null,null,null,null,null,null,"","","","",{"$f":"IF(I138=\"\",\"\",IF(I138=\"Дома\",IF(J138>K138,\"В\",IF(J138=K138,\"Н\",\"П\")),IF(J138<K138,\"В\",IF(J138=K138,\"Н\",\"П\"))))","v":""},"","","","","","","","","","","","","","","","","","","","",""]
[null,null,null,null,null,null,null,null,null,"","","","","","","","","","","","","","","","","","","","","","","","","",""]
[null,null,null,null,null,null,null,null,null,"","","","","","","","","","","","","","","","","","","","","","","","","",""]
[null,null,null,null,null,null,null,null,null,"","","","","","","","","","","","","","","","","","","","","","","","","",""]
[null,null,null,null,null,null,null,null,null,"","","","","","","","","","","","","","","","","","","","","","","","","",""]
[null,null,null,null,null,null,null,null,null,"","","","","","","","","","","","","","","","","","","","","","","","","",""]
[null,null,null,null,null,null,null,null,null,"","","","","","","","","","","","","","","","","","","","","","","","","",""]
[null,null,null,null,null,null,null,null,null,"","","","","","","","","","","","","","","","","","","","","","","","","",""]
[null,null,null,null,null,null,null,null,null,"","","","","","","","","","","","","","","","","","","","","","","","","",""]
[null,null,null,null,null,null,null,null,null,"","","","","","","","","","","","","","","","","","","","","","","","","",""]
[null,null,null,null,null,null,null,null,null,"","","","","","","","","","","","","","","","","","","","","","","","","",""]
[null,null,null,null,null,null,null,null,null,"","","","","","","","","","","","","","","","","","","","","","","","","",""]
[null,null,null,null,null,null,null,null,null,"","","","","","","","","","","","","","","","","","","","","","","","","",""]

{"sheet":"ГостиДома","index":12,"n_rows":150,"n_cols":35,"rows_kept":150,"cut":false,"hidden":true,"merged":[]}
["Чемпионат","Дата/Время","Дома","Гости","К1 в 1Т","К2 в 1Т","К1 во 2Т","К2 во 2Т","Где играли","К1 Голов","К2 Голов","Забито","Пропущено","Результат","Всего Игр","Всего выиграно","Всего ничьих","Всего проиграно","Всего забито","Всего пропущено","Всего очков","Дома игр","Дома выиграно","Дома ничьих","Дома проиграно","Дома забито","Дома пропущено","Дома очков","Гости игр","Гости выиграно","Гости ничьих","Гости проиграно","Гости забито","Гости пропущено","Гости очков"]
["ИРАН: Первый дивизион","2021.05.26 19:10","Эстеглал Моласани","Хуши-Талаи",0,1,1,1,"Дома",{"$f":"IF(I2=\"\",\"\",E2+G2)","v":1},{"$f":"IF(I2=\"\",\"\",F2+H2)","v":2},{"$f":"IF(I2=\"\",\"\",IF(I2=\"Дома\",J2,K2))","v":1},{"$f":"IF(I2=\"\",\"\",IF(I2=\"Дома\",K2,J2))","v":2},{"$f":"IF(I2=\"\",\"\",IF(I2=\"Дома\",IF(J2>K2,\"В\",IF(J2=K2,\"Н\",\"П\")),IF(J2<K2,\"В\",IF(J2=K2,\"Н\",\"П\"))))","v":"П"},{"$f":"IF(I2=\"\",\"\",1)","v":1},{"$f":"IF(I2=\"\",\"\",IF(N2=\"В\",1,0))","v":0},{"$f":"IF(I2=\"\",\"\",IF(N2=\"Н\",1,0))","v":0},{"$f":"IF(I2=\"\",\"\",IF(N2=\"П\",1,0))","v":1},{"$f":"IF(I2=\"\",\"\",L2)","v":1},{"$f":"IF(I2=\"\",\"\",M2)","v":2},{"$f":"IF(I2=\"\",\"\",P2*3+Q2)","v":0},{"$f":"IF(I2=\"\",\"\",IF(I2=\"Дома\",1,0))","v":1},{"$f":"IF(I2=\"\",\"\",IF(I2=\"Дома\",IF(N2=\"В\",1,0),0))","v":0},{"$f":"IF(I2=\"\",\"\",IF(I2=\"Дома\",IF(N2=\"Н\",1,0),0))","v":0},{"$f":"IF(I2=\"\",\"\",IF(I2=\"Дома\",IF(N2=\"П\",1,0),0))","v":1},{"$f":"IF(I2=\"\",\"\",IF(I2=\"Дома\",L2,0))","v":1},{"$f":"IF(I2=\"\",\"\",IF(I2=\"Дома\",M2,0))","v":2},{"$f":"IF(I2=\"\",\"\",IF(I2=\"Дома\",W2*3+X2,0))","v":0},{"$f":"IF(I2=\"\",\"\",IF(I2=\"Гости\",1,0))","v":0},{"$f":"IF(I2=\"\",\"\",IF(I2=\"Гости\",IF(N2=\"В\",1,0),0))","v":0},{"$f":"IF(I2=\"\",\"\",IF(I2=\"Гости\",IF(N2=\"Н\",1,0),0))","v":0},{"$f":"IF(I2=\"\",\"\",IF(I2=\"Гости\",IF(N2=\"П\",1,0),0))","v":0},{"$f":"IF(I2=\"\",\"\",IF(I2=\"Гости\",L2,0))","v":0},{"$f":"IF(I2=\"\",\"\",IF(I2=\"Гости\",M2,0))","v":0},{"$f":"IF(I2=\"\",\"\",IF(I2=\"Гости\",AD2*3+AE2,0))","v":0}]
["ИРАН: Первый дивизион","2021.05.14 19:00","Эстеглал Моласани","Навад Урмия",0,0,1,0,"Дома",{"$f":"IF(I3=\"\",\"\",E3+G3)","v":1},{"$f":"IF(I3=\"\",\"\",F3+H3)","v":0},{"$f":"IF(I3=\"\",\"\",IF(I3=\"Дома\",J3,K3))","v":1},{"$f":"IF(I3=\"\",\"\",IF(I3=\"Дома\",K3,J3))","v":0},{"$f":"IF(I3=\"\",\"\",IF(I3=\"Дома\",IF(J3>K3,\"В\",IF(J3=K3,\"Н\",\"П\")),IF(J3<K3,\"В\",IF(J3=K3,\"Н\",\"П\"))))","v":"В"},{"$f":"IF(I3=\"\",\"\",O2+1)","v":2},{"$f":"IF(I3=\"\",\"\",IF(N3=\"В\",P2+1,P2))","v":1},{"$f":"IF(I3=\"\",\"\",IF(N3=\"Н\",Q2+1,Q2))","v":0},{"$f":"IF(I3=\"\",\"\",IF(N3=\"П\",R2+1,R2))","v":1},{"$f":"IF(I3=\"\",\"\",S2+L3)","v":2},{"$f":"IF(I3=\"\",\"\",T2+M3)","v":2},{"$f":"IF(I3=\"\",\"\",P3*3+Q3)","v":3},{"$f":"IF(I3=\"\",\"\",IF(I3=\"Дома\",V2+1,V2+0))","v":2},{"$f":"IF(I3=\"\",\"\",IF(I3=\"Дома\",IF(N3=\"В\",W2+1,W2),W2))","v":1},{"$f":"IF(I3=\"\",\"\",IF(I3=\"Дома\",IF(N3=\"Н\",X2+1,X2),X2))","v":0},{"$f":"IF(I3=\"\",\"\",IF(I3=\"Дома\",IF(N3=\"П\",Y2+1,Y2),Y2))","v":1},{"$f":"IF(I3=\"\",\"\",IF(I3=\"Дома\",L3+Z2,Z2))","v":2},{"$f":"IF(I3=\"\",\"\",IF(I3=\"Дома\",M3+AA2,AA2))","v":2},{"$f":"IF(I3=\"\",\"\",IF(I3=\"Дома\",W3*3+X3,AB2))","v":3},{"$f":"IF(I3=\"\",\"\",IF(I3=\"Гости\",AC2+1,AC2+0))","v":0},{"$f":"IF(I3=\"\",\"\",IF(I3=\"Гости\",IF(N3=\"В\",AD2+1,AD2),AD2))","v":0},{"$f":"IF(I3=\"\",\"\",IF(I3=\"Гости\",IF(N3=\"Н\",AE2+1,AE2),AE2))","v":0},{"$f":"IF(I3=\"\",\"\",IF(I3=\"Гости\",IF(N3=\"П\",AF2+1,AF2),AF2))","v":0},{"$f":"IF(I3=\"\",\"\",IF(I3=\"Гости\",L3+AG2,AG2))","v":0},{"$f":"IF(I3=\"\",\"\",IF(I3=\"Гости\",M3+AH2,AH2))","v":0},{"$f":"IF(I3=\"\",\"\",IF(I3=\"Гости\",AD3*3+AE3,AI2))","v":0}]
["ИРАН: Первый дивизион","2021.04.26 18:45","Эстеглал Моласани","Астара",1,0,0,0,"Дома",1,0,1,0,"В",3,{"$f":"IF(I4=\"\",\"\",IF(N4=\"В\",P3+1,P3))","v":2},{"$f":"IF(I4=\"\",\"\",IF(N4=\"Н\",Q3+1,Q3))","v":0},{"$f":"IF(I4=\"\",\"\",IF(N4=\"П\",R3+1,R3))","v":1},{"$f":"IF(I4=\"\",\"\",S3+L4)","v":3},{"$f":"IF(I4=\"\",\"\",T3+M4)","v":2},6,{"$f":"IF(I4=\"\",\"\",IF(I4=\"Дома\",V3+1,V3+0))","v":3},{"$f":"IF(I4=\"\",\"\",IF(I4=\"Дома\",IF(N4=\"В\",W3+1,W3),W3))","v":2},{"$f":"IF(I4=\"\",\"\",IF(I4=\"Дома\",IF(N4=\"Н\",X3+1,X3),X3))","v":0},{"$f":"IF(I4=\"\",\"\",IF(I4=\"Дома\",IF(N4=\"П\",Y3+1,Y3),Y3))","v":1},{"$f":"IF(I4=\"\",\"\",IF(I4=\"Дома\",L4+Z3,Z3))","v":3},{"$f":"IF(I4=\"\",\"\",IF(I4=\"Дома\",M4+AA3,AA3))","v":2},{"$f":"IF(I4=\"\",\"\",IF(I4=\"Дома\",W4*3+X4,AB3))","v":6},{"$f":"IF(I4=\"\",\"\",IF(I4=\"Гости\",AC3+1,AC3+0))","v":0},{"$f":"IF(I4=\"\",\"\",IF(I4=\"Гости\",IF(N4=\"В\",AD3+1,AD3),AD3))","v":0},{"$f":"IF(I4=\"\",\"\",IF(I4=\"Гости\",IF(N4=\"Н\",AE3+1,AE3),AE3))","v":0},{"$f":"IF(I4=\"\",\"\",IF(I4=\"Гости\",IF(N4=\"П\",AF3+1,AF3),AF3))","v":0},{"$f":"IF(I4=\"\",\"\",IF(I4=\"Гости\",L4+AG3,AG3))","v":0},{"$f":"IF(I4=\"\",\"\",IF(I4=\"Гости\",M4+AH3,AH3))","v":0},{"$f":"IF(I4=\"\",\"\",IF(I4=\"Гости\",AD4*3+AE4,AI3))","v":0}]
["ИРАН: Первый дивизион","2021.04.13 15:30","Эстеглал Моласани","Хейбар Хоррамабад",0,1,0,0,"Дома",0,1,0,1,"П",4,2,0,2,3,3,6,4,2,0,2,3,3,6,0,0,0,0,0,0,0]
["ИРАН: Первый дивизион","2021.03.17 15:00","Эстеглал Моласани","Райка Баболь",0,0,1,0,"Дома",1,0,1,0,"В",5,3,0,2,4,3,9,5,3,0,2,4,3,9,0,0,0,0,0,0,0]
["ИРАН: Кубок Ирана","2021.03.12 14:30","Эстеглал Моласани","Shahin Bandar Ameri",0,0,0,0,"Дома",0,0,0,0,"Н",6,3,1,2,4,3,10,6,3,1,2,4,3,10,0,0,0,0,0,0,0]
["ИРАН: Первый дивизион","2021.03.07 14:45","Эстеглал Моласани","Шахин Бушехр",1,1,0,0,"Дома",1,1,1,1,"Н",7,3,2,2,5,4,11,7,3,2,2,5,4,11,0,0,0,0,0,0,0]
["ИРАН: Первый дивизион","2021.02.20 14:30","Эстеглал Моласани","Малаван",0,0,0,0,"Дома",0,0,0,0,{"$f":"IF(I9=\"\",\"\",IF(I9=\"Дома\",IF(J9>K9,\"В\",IF(J9=K9,\"Н\",\"П\")),IF(J9<K9,\"В\",IF(J9=K9,\"Н\",\"П\"))))","v":"Н"},8,3,3,2,5,4,12,8,3,3,2,5,4,12,0,0,0,0,0,0,0]
["ИРАН: Первый дивизион","2021.02.08 14:30","Эстеглал Моласани","Чока Талеш",0,0,0,0,"Дома",0,0,0,0,{"$f":"IF(I10=\"\",\"\",IF(I10=\"Дома\",IF(J10>K10,\"В\",IF(J10=K10,\"Н\",\"П\")),IF(J10<K10,\"В\",IF(J10=K10,\"Н\",\"П\"))))","v":"Н"},9,3,4,2,5,4,13,9,3,4,2,5,4,13,0,0,0,0,0,0,0]
["ИРАН: Первый дивизион","2021.01.25 13:30","Эстеглал Моласани","Бадеран Тегеран",1,0,0,1,"Дома",1,1,1,1,"Н",10,3,5,2,6,5,14,10,3,5,2,6,5,14,0,0,0,0,0,0,0]
["ИРАН: Первый дивизион","2021.01.18 13:30","Эстеглал Моласани","Мес Керман",0,0,1,0,"Дома",1,0,1,0,"В",11,4,5,2,7,5,{"$f":"IF(I12=\"\",\"\",P12*3+Q12)","v":17},11,4,5,2,7,5,17,0,0,0,0,0,0,0]
["ИРАН: Первый дивизион","2021.01.04 13:30","Эстеглал Моласани","Могхавемат",1,0,0,1,"Дома",1,1,1,1,"Н",12,4,6,2,8,6,18,12,4,6,2,8,6,18,0,0,0,0,0,0,0]
["ИРАН: Первый дивизион","2020.12.22 13:30","Эстеглал Моласани","Гол Рейхан",0,0,1,0,"Дома",1,0,1,0,"В",13,5,6,2,9,6,21,13,5,6,2,9,6,21,0,0,0,0,0,0,0]
["ИРАН: Первый дивизион","2020.12.10 14:00","Эстеглал Моласани","Эстеглал Хузестан",1,1,0,3,"Дома",1,4,1,4,"П",14,5,6,3,10,10,21,14,5,6,3,10,10,21,0,0,0,0,0,0,0]
["ИРАН: Первый дивизион","2020.02.02 13:30","Бадеран Тегеран","Арман Гохар",1,0,3,0,"Дома",4,0,4,0,"В",15,6,6,3,14,10,24,15,6,6,3,14,10,24,0,0,0,0,0,0,0]
[null,null,null,null,null,null,null,null,null,"","","","","","","","","","","","","","","","","","","","","","","","","",""]
[null,null,null,null,null,null,null,null,null,"","","","","","","","","","","","","","","","","","","","","","","","","",""]
[null,null,null,null,null,null,null,null,null,"","","","","","","","","","","","","","","","","","","","","","","","","",""]
[null,null,null,null,null,null,null,null,null,"","","","","","","","","","","","","","","","","","","","","","","","","",""]
[null,null,null,null,null,null,null,null,null,"","","","","","","","","","","","","","","","","","","","","","","","","",""]
[null,null,null,null,null,null,null,null,null,"","","","","","","","","","","","","","","","","","","","","","","","","",""]
[null,null,null,null,null,null,null,null,null,"","","","","","","","","","","","","","","","","","","","","","","","","",""]
[null,null,null,null,null,null,null,null,null,"","","","","","","","","","","","","","","","","","","","","","","","","",""]
[null,null,null,null,null,null,null,null,null,"","","","","","","","","","","","","","","","","","","","","","","","","",""]
[null,null,null,null,null,null,null,null,null,"","","","","","","","","","","","","","","","","","","","","","","","","",""]
[null,null,null,null,null,null,null,null,null,"","","","","","","","","","","","","","","","","","","","","","","","","",""]
[null,null,null,null,null,null,null,null,null,"","","","","","","","","","","","","","","","","","","","","","","","","",""]
[null,null,null,null,null,null,null,null,null,"","","","","","","","","","","","","","","","","","","","","","","","","",""]
[null,null,null,null,null,null,null,null,null,"","","","","","","","","","","","","","","","","","","","","","","","","",""]
[null,null,null,null,null,null,null,null,null,"","","","","","","","","","","","","","","","","","","","","","","","","",""]
[null,null,null,null,null,null,null,null,null,"","","","","","","","","","","","","","","","","","","","","","","","","",""]
[null,null,null,null,null,null,null,null,null,"","","","","","","","","","","","","","","","","","","","","","","","","",""]
[null,null,null,null,null,null,null,null,null,"","","","","","","","","","","","","","","","","","","","","","","","","",""]
[null,null,null,null,null,null,null,null,null,"","","","","","","","","","","","","","","","","","","","","","","","","",""]
[null,null,null,null,null,null,null,null,null,"","","","","","","","","","","","","","","","","","","","","","","","","",""]
[null,null,null,null,null,null,null,null,null,"","","","","","","","","","","","","","","","","","","","","","","","","",""]
[null,null,null,null,null,null,null,null,null,"","","","","","","","","","","","","","","","","","","","","","","","","",""]
[null,null,null,null,null,null,null,null,null,"","","","","","","","","","","","","","","","","","","","","","","","","",""]
[null,null,null,null,null,null,null,null,null,"","","","","","","","","","","","","","","","","","","","","","","","","",""]
[null,null,null,null,null,null,null,null,null,"","","","","","","","","","","","","","","","","","","","","","","","","",""]
[null,null,null,null,null,null,null,null,null,"","","","","","","","","","","","","","","","","","","","","","","","","",""]
[null,null,null,null,null,null,null,null,null,"","","","","","","","","","","","","","","","","","","","","","","","","",""]
[null,null,null,null,null,null,null,null,null,"","","","","","","","","","","","","","","","","","","","","","","","","",""]
[null,null,null,null,null,null,null,null,null,"","","","","","","","","","","","","","","","","","","","","","","","","",""]
[null,null,null,null,null,null,null,null,null,"","","","","","","","","","","","","","","","","","","","","","","","","",""]
[null,null,null,null,null,null,null,null,null,"","","","","","","","","","","","","","","","","","","","","","","","","",""]
[null,null,null,null,null,null,null,null,null,"","","","","","","","","","","","","","","","","","","","","","","","","",""]
[null,null,null,null,null,null,null,null,null,"","","","","","","","","","","","","","","","","","","","","","","","","",""]
[null,null,null,null,null,null,null,null,null,"","","","","","","","","","","","","","","","","","","","","","","","","",""]
[null,null,null,null,null,null,null,null,null,"","","","","","","","","","","","","","","","","","","","","","","","","",""]
[null,null,null,null,null,null,null,null,null,"","","","","","","","","","","","","","","","","","","","","","","","","",""]
[null,null,null,null,null,null,null,null,null,"","","","","","","","","","","","","","","","","","","","","","","","","",""]
[null,null,null,null,null,null,null,null,null,"","","","","","","","","","","","","","","","","","","","","","","","","",""]
[null,null,null,null,null,null,null,null,null,"","","","","","","","","","","","","","","","","","","","","","","","","",""]
[null,null,null,null,null,null,null,null,null,"","","","","","","","","","","","","","","","","","","","","","","","","",""]
[null,null,null,null,null,null,null,null,null,"","","","","","","","","","","","","","","","","","","","","","","","","",""]
[null,null,null,null,null,null,null,null,null,"","","","","","","","","","","","","","","","","","","","","","","","","",""]
[null,null,null,null,null,null,null,null,null,"","","","","","","","","","","","","","","","","","","","","","","","","",""]
[null,null,null,null,null,null,null,null,null,"","","","","","","","","","","","","","","","","","","","","","","","","",""]
[null,null,null,null,null,null,null,null,null,"","","","","","","","","","","","","","","","","","","","","","","","","",""]
[null,null,null,null,null,null,null,null,null,"","","","","","","","","","","","","","","","","","","","","","","","","",""]
[null,null,null,null,null,null,null,null,null,"","","","","","","","","","","","","","","","","","","","","","","","","",""]
[null,null,null,null,null,null,null,null,null,"","","","","","","","","","","","","","","","","","","","","","","","","",""]
[null,null,null,null,null,null,null,null,null,"","","","","","","","","","","","","","","","","","","","","","","","","",""]
[null,null,null,null,null,null,null,null,null,"","","","","","","","","","","","","","","","","","","","","","","","","",""]
[null,null,null,null,null,null,null,null,null,{"$f":"IF(I67=\"\",\"\",E67+G67)","v":""},{"$f":"IF(I67=\"\",\"\",F67+H67)","v":""},{"$f":"IF(I67=\"\",\"\",IF(I67=\"Дома\",J67,K67))","v":""},{"$f":"IF(I67=\"\",\"\",IF(I67=\"Дома\",K67,J67))","v":""},"",{"$f":"IF(I67=\"\",\"\",O66+1)","v":""},"","","","","",{"$f":"IF(I67=\"\",\"\",P67*3+Q67)","v":""},"","","","","","","","","","","","","",""]
[null,null,null,null,null,null,null,null,null,"","","","","","",{"$f":"IF(I68=\"\",\"\",IF(N68=\"В\",P67+1,P67))","v":""},{"$f":"IF(I68=\"\",\"\",IF(N68=\"Н\",Q67+1,Q67))","v":""},{"$f":"IF(I68=\"\",\"\",IF(N68=\"П\",R67+1,R67))","v":""},{"$f":"IF(I68=\"\",\"\",S67+L68)","v":""},{"$f":"IF(I68=\"\",\"\",T67+M68)","v":""},"",{"$f":"IF(I68=\"\",\"\",IF(I68=\"Дома\",V67+1,V67+0))","v":""},{"$f":"IF(I68=\"\",\"\",IF(I68=\"Дома\",IF(N68=\"В\",W67+1,W67),W67))","v":""},{"$f":"IF(I68=\"\",\"\",IF(I68=\"Дома\",IF(N68=\"Н\",X67+1,X67),X67))","v":""},{"$f":"IF(I68=\"\",\"\",IF(I68=\"Дома\",IF(N68=\"П\",Y67+1,Y67),Y67))","v":""},{"$f":"IF(I68=\"\",\"\",IF(I68=\"Дома\",L68+Z67,Z67))","v":""},{"$f":"IF(I68=\"\",\"\",IF(I68=\"Дома\",M68+AA67,AA67))","v":""},{"$f":"IF(I68=\"\",\"\",IF(I68=\"Дома\",W68*3+X68,AB67))","v":""},{"$f":"IF(I68=\"\",\"\",IF(I68=\"Гости\",AC67+1,AC67+0))","v":""},{"$f":"IF(I68=\"\",\"\",IF(I68=\"Гости\",IF(N68=\"В\",AD67+1,AD67),AD67))","v":""},{"$f":"IF(I68=\"\",\"\",IF(I68=\"Гости\",IF(N68=\"Н\",AE67+1,AE67),AE67))","v":""},{"$f":"IF(I68=\"\",\"\",IF(I68=\"Гости\",IF(N68=\"П\",AF67+1,AF67),AF67))","v":""},{"$f":"IF(I68=\"\",\"\",IF(I68=\"Гости\",L68+AG67,AG67))","v":""},{"$f":"IF(I68=\"\",\"\",IF(I68=\"Гости\",M68+AH67,AH67))","v":""},{"$f":"IF(I68=\"\",\"\",IF(I68=\"Гости\",AD68*3+AE68,AI67))","v":""}]
[null,null,null,null,null,null,null,null,null,"","","","","","","","","","","","","","","","","","","","","","","","","",""]
[null,null,null,null,null,null,null,null,null,"","","","","","","","","","","","","","","","","","","","","","","","","",""]
[null,null,null,null,null,null,null,null,null,"","","","","","","","","","","","","","","","","","","","","","","","","",""]
[null,null,null,null,null,null,null,null,null,"","","","","","","","","","","","","","","","","","","","","","","","","",""]
[null,null,null,null,null,null,null,null,null,"","","","","","","","","","","","","","","","","","","","","","","","","",""]
[null,null,null,null,null,null,null,null,null,"","","","",{"$f":"IF(I74=\"\",\"\",IF(I74=\"Дома\",IF(J74>K74,\"В\",IF(J74=K74,\"Н\",\"П\")),IF(J74<K74,\"В\",IF(J74=K74,\"Н\",\"П\"))))","v":""},"","","","","","","","","","","","","","","","","","","","",""]
[null,null,null,null,null,null,null,null,null,"","","","","","","","","","","","","","","","","","","","","","","","","",""]
[null,null,null,null,null,null,null,null,null,"","","","","","","","","","","","","","","","","","","","","","","","","",""]
[null,null,null,null,null,null,null,null,null,"","","","","","","","","","","","","","","","","","","","","","","","","",""]
[null,null,null,null,null,null,null,null,null,"","","","","","","","","","","","","","","","","","","","","","","","","",""]
[null,null,null,null,null,null,null,null,null,"","","","","","","","","","","","","","","","","","","","","","","","","",""]
[null,null,null,null,null,null,null,null,null,"","","","","","","","","","","","","","","","","","","","","","","","","",""]
[null,null,null,null,null,null,null,null,null,"","","","","","","","","","","","","","","","","","","","","","","","","",""]
[null,null,null,null,null,null,null,null,null,"","","","","","","","","","","","","","","","","","","","","","","","","",""]
[null,null,null,null,null,null,null,null,null,"","","","","","","","","","","","","","","","","","","","","","","","","",""]
[null,null,null,null,null,null,null,null,null,"","","","","","","","","","","","","","","","","","","","","","","","","",""]
[null,null,null,null,null,null,null,null,null,"","","","","","","","","","","","","","","","","","","","","","","","","",""]
[null,null,null,null,null,null,null,null,null,"","","","","","","","","","","","","","","","","","","","","","","","","",""]
[null,null,null,null,null,null,null,null,null,"","","","","","","","","","","","","","","","","","","","","","","","","",""]
[null,null,null,null,null,null,null,null,null,"","","","","","","","","","","","","","","","","","","","","","","","","",""]
[null,null,null,null,null,null,null,null,null,"","","","","","","","","","","","","","","","","","","","","","","","","",""]
[null,null,null,null,null,null,null,null,null,"","","","","","","","","","","","","","","","","","","","","","","","","",""]
[null,null,null,null,null,null,null,null,null,"","","","","","","","","","","","","","","","","","","","","","","","","",""]
[null,null,null,null,null,null,null,null,null,"","","","","","","","","","","","","","","","","","","","","","","","","",""]
[null,null,null,null,null,null,null,null,null,"","","","","","","","","","","","","","","","","","","","","","","","","",""]
[null,null,null,null,null,null,null,null,null,"","","","","","","","","","","","","","","","","","","","","","","","","",""]
[null,null,null,null,null,null,null,null,null,"","","","","","","","","","","","","","","","","","","","","","","","","",""]
[null,null,null,null,null,null,null,null,null,"","","","","","","","","","","","","","","","","","","","","","","","","",""]
[null,null,null,null,null,null,null,null,null,"","","","","","","","","","","","","","","","","","","","","","","","","",""]
[null,null,null,null,null,null,null,null,null,"","","","","","","","","","","","","","","","","","","","","","","","","",""]
[null,null,null,null,null,null,null,null,null,"","","","","","","","","","","","","","","","","","","","","","","","","",""]
[null,null,null,null,null,null,null,null,null,"","","","","","","","","","","","","","","","","","","","","","","","","",""]
[null,null,null,null,null,null,null,null,null,"","","","","","","","","","","","","","","","","","","","","","","","","",""]
[null,null,null,null,null,null,null,null,null,"","","","","","","","","","","","","","","","","","","","","","","","","",""]
[null,null,null,null,null,null,null,null,null,"","","","","","","","","","","","","","","","","","","","","","","","","",""]
[null,null,null,null,null,null,null,null,null,"","","","","","","","","","","","","","","","","","","","","","","","","",""]
[null,null,null,null,null,null,null,null,null,"","","","","","","","","","","","","","","","","","","","","","","","","",""]
[null,null,null,null,null,null,null,null,null,"","","","","","","","","","","","","","","","","","","","","","","","","",""]
[null,null,null,null,null,null,null,null,null,"","","","","","","","","","","","","","","","","","","","","","","","","",""]
[null,null,null,null,null,null,null,null,null,"","","","","","","","","","","","","","","","","","","","","","","","","",""]
[null,null,null,null,null,null,null,null,null,"","","","","","","","","","","","","","","","","","","","","","","","","",""]
[null,null,null,null,null,null,null,null,null,"","","","","","","","","","","","","","","","","","","","","","","","","",""]
[null,null,null,null,null,null,null,null,null,"","","","","","","","","","","","","","","","","","","","","","","","","",""]
[null,null,null,null,null,null,null,null,null,"","","","","","","","","","","","","","","","","","","","","","","","","",""]
[null,null,null,null,null,null,null,null,null,"","","","","","","","","","","","","","","","","","","","","","","","","",""]
[null,null,null,null,null,null,null,null,null,"","","","","","","","","","","","","","","","","","","","","","","","","",""]
[null,null,null,null,null,null,null,null,null,"","","","","","","","","","","","","","","","","","","","","","","","","",""]
[null,null,null,null,null,null,null,null,null,"","","","","","","","","","","","","","","","","","","","","","","","","",""]
[null,null,null,null,null,null,null,null,null,"","","","","","","","","","","","","","","","","","","","","","","","","",""]
[null,null,null,null,null,null,null,null,null,"","","","","","","","","","","","","","","","","","","","","","","","","",""]
[null,null,null,null,null,null,null,null,null,"","","","","","","","","","","","","","","","","","","","","","","","","",""]
[null,null,null,null,null,null,null,null,null,"","","","","","","","","","","","","","","","","","","","","","","","","",""]
[null,null,null,null,null,null,null,null,null,"","","","","","","","","","","","","","","","","","","","","","","","","",""]
[null,null,null,null,null,null,null,null,null,"","","","","","","","","","","","","","","","","","","","","","","","","",""]
[null,null,null,null,null,null,null,null,null,"","","","","","","","","","","","","","","","","","","","","","","","","",""]
[null,null,null,null,null,null,null,null,null,"","","","","","","","","","","","","","","","","","","","","","","","","",""]
[null,null,null,null,null,null,null,null,null,"","","","","","","","","","","","","","","","","","","","","","","","","",""]
[null,null,null,null,null,null,null,null,null,"","","","","","","","","","","","","","","","","","","","","","","","","",""]
[null,null,null,null,null,null,null,null,null,"","","","","","","","","","","","","","","","","","","","","","","","","",""]
[null,null,null,null,null,null,null,null,null,"","","","","","","","","","","","","","","","","","","","","","","","","",""]
[null,null,null,null,null,null,null,null,null,"","","","","","","","","","","","","","","","","","","","","","","","","",""]
[null,null,null,null,null,null,null,null,null,"","","","","","","","","","","","","","","","","","","","","","","","","",""]
[null,null,null,null,null,null,null,null,null,{"$f":"IF(I131=\"\",\"\",E131+G131)","v":""},{"$f":"IF(I131=\"\",\"\",F131+H131)","v":""},{"$f":"IF(I131=\"\",\"\",IF(I131=\"Дома\",J131,K131))","v":""},{"$f":"IF(I131=\"\",\"\",IF(I131=\"Дома\",K131,J131))","v":""},"",{"$f":"IF(I131=\"\",\"\",O130+1)","v":""},"","","","","",{"$f":"IF(I131=\"\",\"\",P131*3+Q131)","v":""},"","","","","","","","","","","","","",""]
[null,null,null,null,null,null,null,null,null,"","","","","","",{"$f":"IF(I132=\"\",\"\",IF(N132=\"В\",P131+1,P131))","v":""},{"$f":"IF(I132=\"\",\"\",IF(N132=\"Н\",Q131+1,Q131))","v":""},{"$f":"IF(I132=\"\",\"\",IF(N132=\"П\",R131+1,R131))","v":""},{"$f":"IF(I132=\"\",\"\",S131+L132)","v":""},{"$f":"IF(I132=\"\",\"\",T131+M132)","v":""},"",{"$f":"IF(I132=\"\",\"\",IF(I132=\"Дома\",V131+1,V131+0))","v":""},{"$f":"IF(I132=\"\",\"\",IF(I132=\"Дома\",IF(N132=\"В\",W131+1,W131),W131))","v":""},{"$f":"IF(I132=\"\",\"\",IF(I132=\"Дома\",IF(N132=\"Н\",X131+1,X131),X131))","v":""},{"$f":"IF(I132=\"\",\"\",IF(I132=\"Дома\",IF(N132=\"П\",Y131+1,Y131),Y131))","v":""},{"$f":"IF(I132=\"\",\"\",IF(I132=\"Дома\",L132+Z131,Z131))","v":""},{"$f":"IF(I132=\"\",\"\",IF(I132=\"Дома\",M132+AA131,AA131))","v":""},{"$f":"IF(I132=\"\",\"\",IF(I132=\"Дома\",W132*3+X132,AB131))","v":""},{"$f":"IF(I132=\"\",\"\",IF(I132=\"Гости\",AC131+1,AC131+0))","v":""},{"$f":"IF(I132=\"\",\"\",IF(I132=\"Гости\",IF(N132=\"В\",AD131+1,AD131),AD131))","v":""},{"$f":"IF(I132=\"\",\"\",IF(I132=\"Гости\",IF(N132=\"Н\",AE131+1,AE131),AE131))","v":""},{"$f":"IF(I132=\"\",\"\",IF(I132=\"Гости\",IF(N132=\"П\",AF131+1,AF131),AF131))","v":""},{"$f":"IF(I132=\"\",\"\",IF(I132=\"Гости\",L132+AG131,AG131))","v":""},{"$f":"IF(I132=\"\",\"\",IF(I132=\"Гости\",M132+AH131,AH131))","v":""},{"$f":"IF(I132=\"\",\"\",IF(I132=\"Гости\",AD132*3+AE132,AI131))","v":""}]
[null,null,null,null,null,null,null,null,null,"","","","","","","","","","","","","","","","","","","","","","","","","",""]
[null,null,null,null,null,null,null,null,null,"","","","","","","","","","","","","","","","","","","","","","","","","",""]
[null,null,null,null,null,null,null,null,null,"","","","","","","","","","","","","","","","","","","","","","","","","",""]
[null,null,null,null,null,null,null,null,null,"","","","","","","","","","","","","","","","","","","","","","","","","",""]
[null,null,null,null,null,null,null,null,null,"","","","","","","","","","","","","","","","","","","","","","","","","",""]
[null,null,null,null,null,null,null,null,null,"","","","",{"$f":"IF(I138=\"\",\"\",IF(I138=\"Дома\",IF(J138>K138,\"В\",IF(J138=K138,\"Н\",\"П\")),IF(J138<K138,\"В\",IF(J138=K138,\"Н\",\"П\"))))","v":""},"","","","","","","","","","","","","","","","","","","","",""]
[null,null,null,null,null,null,null,null,null,"","","","","","","","","","","","","","","","","","","","","","","","","",""]
[null,null,null,null,null,null,null,null,null,"","","","","","","","","","","","","","","","","","","","","","","","","",""]
[null,null,null,null,null,null,null,null,null,"","","","","","","","","","","","","","","","","","","","","","","","","",""]
[null,null,null,null,null,null,null,null,null,"","","","","","","","","","","","","","","","","","","","","","","","","",""]
[null,null,null,null,null,null,null,null,null,"","","","","","","","","","","","","","","","","","","","","","","","","",""]
[null,null,null,null,null,null,null,null,null,"","","","","","","","","","","","","","","","","","","","","","","","","",""]
[null,null,null,null,null,null,null,null,null,"","","","","","","","","","","","","","","","","","","","","","","","","",""]
[null,null,null,null,null,null,null,null,null,"","","","","","","","","","","","","","","","","","","","","","","","","",""]
[null,null,null,null,null,null,null,null,null,"","","","","","","","","","","","","","","","","","","","","","","","","",""]
[null,null,null,null,null,null,null,null,null,"","","","","","","","","","","","","","","","","","","","","","","","","",""]
[null,null,null,null,null,null,null,null,null,"","","","","","","","","","","","","","","","","","","","","","","","","",""]
[null,null,null,null,null,null,null,null,null,"","","","","","","","","","","","","","","","","","","","","","","","","",""]

{"sheet":"Лист1","index":13,"n_rows":15,"n_cols":35,"rows_kept":15,"cut":false,"hidden":true,"merged":[[8,21,8,22],[8,24,8,25],[8,27,8,28],[8,30,8,31],[8,33,8,34],[2,21,2,22],[2,24,2,25],[2,27,2,28],[2,30,2,31],[2,33,2,34],[5,21,5,22],[5,24,5,25],[5,27,5,28],[5,30,5,31],[5,33,5,34],[5,12,5,13],[2,12,2,13],[2,15,2,16],[5,15,5,16],[8,3,8,4],[8,6,8,7],[8,9,8,10],[8,12,8,13],[8,15,8,16],[2,3,2,4],[5,3,5,4],[2,6,2,7],[5,6,5,7],[2,9,2,10],[5,9,5,10]]}
[]
[]
[null,null,null,"Дома\\Дома",null,null,"Дома\\Гости",null,null,"Дома",null,null,"5 матчей дома",null,null,"Форма 5",null,null,null,null,null,"Гости\\Гости",null,null,"Гости\\Дома",null,null,"Гости",null,null,"5 матчей гости",null,null,"Форма 5"]
[null,null,null,{"$f":"COUNT(ДомаДома!L2:L83)","v":21},{"$f":"SUM(ДомаДома!L2:L57)","v":32},null,{"$f":"COUNT(ДомаГости!L2:L108)","v":19},{"$f":"SUM(ДомаГости!L2:L77)","v":23},null,{"$f":"COUNT(Дома!L2:L140)","v":40},{"$f":"SUM(Дома!L2:L84)","v":55},null,{"$f":"COUNT(ДомаДома!L2:L6)","v":5},{"$f":"SUM(ДомаДома!L2:L6)","v":5},null,{"$f":"COUNT(Дома!L2:L6)","v":5},{"$f":"SUM(Дома!L2:L6)","v":6},null,null,null,null,{"$f":"COUNT(ГостиГости!L2:L76)","v":11},{"$f":"SUM(ГостиГости!L2:L76)","v":12},null,{"$f":"COUNT(ГостиДома!L2:L53)","v":15},{"$f":"SUM(ГостиДома!L2:L66)","v":14},null,{"$f":"COUNT(Гости!L2:L144)","v":26},{"$f":"SUM(Гости!L2:L140)","v":26},null,{"$f":"COUNT(ГостиГости!L2:L6)","v":5},{"$f":"SUM(ГостиГости!L2:L6)","v":5},null,{"$f":"COUNT(Гости!L2:L6)","v":5},{"$f":"SUM(Гости!L2:L6)","v":5}]
[]
[null,null,null,"Среднее\\Вес",null,null,"Среднее\\Вес",null,null,"Среднее\\Вес",null,null,"Среднее\\Вес",null,null,"Среднее\\Вес",null,null,null,null,null,"Среднее\\Вес",null,null,"Среднее\\Вес",null,null,"Среднее\\Вес",null,null,"Среднее\\Вес",null,null,"Среднее\\Вес"]
[null,null,null,{"$f":"E4/D4","v":1.5238095238095237},0.35,null,{"$f":"H4/G4","v":1.2105263157894737},0.05,null,{"$f":"K4/J4","v":1.375},0.15,null,{"$f":"N4/M4","v":1},0.2,null,{"$f":"Q4/P4","v":1.2},0.25,null,null,null,null,{"$f":"W4/V4","v":1.0909090909090908},0.35,null,{"$f":"Z4/Y4","v":0.93333333333333335},0.05,null,{"$f":"AC4/AB4","v":1},0.15,null,{"$f":"AF4/AE4","v":1},0.2,null,{"$f":"AI4/AH4","v":1},0.25]
[]
[null,null,null,{"$f":"D7*E7","v":0.53333333333333321},null,null,{"$f":"G7*H7","v":6.0526315789473685E-2},null,null,{"$f":"J7*K7","v":0.20624999999999999},null,null,{"$f":"M7*N7","v":0.2},null,null,{"$f":"P7*Q7","v":0.3},null,null,null,null,null,{"$f":"V7*W7","v":0.38181818181818178},null,null,{"$f":"Y7*Z7","v":4.6666666666666669E-2},null,null,{"$f":"AB7*AC7","v":0.15},null,null,{"$f":"AE7*AF7","v":0.2},null,null,{"$f":"AH7*AI7","v":0.25}]
[]
[]
[]
[]
[]
[null,null,null,null,null,null,null,null,{"$f":"D9*1+J9*1+M9*1+P9*1","v":1.2395833333333333},null,null,null,null,null,null,null,null,{"$f":"1*I15/(I15*1+AA15*1)","v":0.55801858640975366},{"$f":"1*AA15/(I15*1+AA15*1)","v":0.4419814135902464},null,null,null,null,null,null,null,{"$f":"V9*1+AB9*1+AE9*1+AH9*1","v":0.9818181818181817}]

{"sheet":"Data","index":14,"n_rows":42,"n_cols":29,"rows_kept":42,"cut":false,"hidden":true,"merged":[[5,14,5,15],[2,7,2,8],[10,7,10,8],[2,10,2,11],[10,10,10,11],[2,24,2,25],[2,27,2,28],[10,24,10,25],[10,27,10,28],[23,4,23,5],[13,8,14,10],[17,3,17,4],[18,3,18,4],[19,3,19,4],[13,11,14,13],[15,8,16,10],[15,11,16,13],[17,8,18,10],[17,11,18,13],[19,8,20,10],[19,11,20,13],[28,3,28,4],[31,8,31,9],[32,8,32,9],[30,26,30,27],[31,26,31,27],[19,14,20,14],[19,15,20,15],[13,14,14,14],[15,14,16,14],[17,14,18,14],[21,8,22,10],[21,11,22,11],[21,12,22,12],[21,13,22,13],[23,8,24,13],[25,8,25,10],[25,11,25,13],[26,10,26,11],[27,10,27,11],[26,8,26,9],[27,8,27,9],[26,12,26,13],[27,12,27,13]]}
[]
[]
[null,null,null,null,null,null,null,"Забито",null,null,"Пропущенно",null,null,null,null,null,null,null,null,null,null,null,null,null,"Забито",null,null,"Пропущенно"]
[null,null,null,null,null,null,null,"Дома","Гости",null,"Дома","Гости",null,null,{"$f":"IF(O6>2.6,(\"Over2.5\"),(\"\"))","v":""},{"$f":"IF(O6<2.4,(\"Under2.5\"),(\"\"))","v":"Under2.5"},{"$f":"IF(AND(O6>2.4,O6<=2.6),(\"Over1.5-Under3.5\"),(\"\"))","v":""},null,null,null,null,null,null,null,"Дома","Гости",null,"Дома","Гости"]
[null,null,null,{"$f":"Дома!I2","v":"Гости"},{"$f":"Дома!L2","v":0},{"$f":"Дома!M2","v":2},null,{"$f":"IF(D5=\"Дома\",E5,\"\")","v":""},{"$f":"IF(D5=\"Гости\",E5,\"\")","v":0},null,{"$f":"IF(D5=\"Дома\",F5,\"\")","v":""},{"$f":"IF(D5=\"Гости\",F5,\"\")","v":2},null,null,{"$f":"(H11+AB11)/2","v":1.9500000000000002},{"$f":"(Y11+K11)/2","v":1.55},null,null,null,null,{"$f":"Гости!I2","v":"Гости"},{"$f":"Гости!L2","v":2},{"$f":"Гости!M2","v":3},null,{"$f":"IF(U5=\"Дома\",V5,\"\")","v":""},{"$f":"IF(U5=\"Гости\",V5,\"\")","v":2},null,{"$f":"IF(U5=\"Дома\",W5,\"\")","v":""},{"$f":"IF(U5=\"Гости\",W5,\"\")","v":3}]
[null,null,null,{"$f":"Дома!I3","v":"Дома"},{"$f":"Дома!L3","v":1},{"$f":"Дома!M3","v":0},null,{"$f":"IF(D6=\"Дома\",E6,\"\")","v":1},{"$f":"IF(D6=\"Гости\",E6,\"\")","v":""},null,{"$f":"IF(D6=\"Дома\",F6,\"\")","v":0},{"$f":"IF(D6=\"Гости\",F6,\"\")","v":""},null,null,{"$f":"SUM(O5:P5)/1.5","v":2.3333333333333335},null,null,null,null,null,{"$f":"Гости!I3","v":"Дома"},{"$f":"Гости!L3","v":1},{"$f":"Гости!M3","v":2},null,{"$f":"IF(U6=\"Дома\",V6,\"\")","v":1},{"$f":"IF(U6=\"Гости\",V6,\"\")","v":""},null,{"$f":"IF(U6=\"Дома\",W6,\"\")","v":2},{"$f":"IF(U6=\"Гости\",W6,\"\")","v":""}]
[null,null,null,{"$f":"Дома!I4","v":"Гости"},{"$f":"Дома!L4","v":1},{"$f":"Дома!M4","v":2},null,{"$f":"IF(D7=\"Дома\",E7,\"\")","v":""},1,null,"",2,null,null,null,null,null,null,null,null,{"$f":"Гости!I4","v":"Гости"},{"$f":"Гости!L4","v":1},{"$f":"Гости!M4","v":2},null,{"$f":"IF(U7=\"Дома\",V7,\"\")","v":""},1,null,"",2]
[null,null,null,{"$f":"Дома!I5","v":"Дома"},{"$f":"Дома!L5","v":2},{"$f":"Дома!M5","v":1},null,2,"",null,1,"",null,null,null,null,null,null,null,null,{"$f":"Гости!I5","v":"Дома"},{"$f":"Гости!L5","v":1},{"$f":"Гости!M5","v":0},null,{"$f":"IF(U8=\"Дома\",V8,\"\")","v":1},"",null,0,""]
[null,null,null,{"$f":"Дома!I6","v":"Гости"},{"$f":"Дома!L6","v":2},{"$f":"Дома!M6","v":1},null,"",2,null,"",1,null,null,null,null,null,null,null,null,{"$f":"Гости!I6","v":"Гости"},{"$f":"Гости!L6","v":0},{"$f":"Гости!M6","v":1},null,"",0,null,"",1]
[null,null,null,null,null,null,null,{"$f":"SUM(H5:H9)*1.5","v":4.5},{"$f":"SUM(I5:I9)*2","v":6},null,{"$f":"SUM(K5:K9)*1.5","v":1.5},{"$f":"SUM(L5:L9)*1","v":5},null,null,null,null,null,null,null,null,null,null,null,null,{"$f":"SUM(Y5:Y9)*1.5","v":3},{"$f":"SUM(Z5:Z9)*2","v":6},null,{"$f":"SUM(AB5:AB9)*1.5","v":3},{"$f":"SUM(AC5:AC9)*1","v":6}]
[null,null,null,null,null,null,null,{"$f":"SUM(H10:I10)/5","v":2.1},null,null,{"$f":"SUM(K10:L10)/5","v":1.3},null,null,null,null,null,null,null,null,null,null,null,null,null,{"$f":"SUM(Y10:Z10)/5","v":1.8},null,null,{"$f":"SUM(AB10:AC10)/5","v":1.8}]
[]
[]
[null,null,null,null,null,null,null,null,"Прогноз №1",null,null,{"$f":"O4&P4&Q4","v":"Under2.5"},null,null,{"$f":"O6","v":2.3333333333333335}]
[null,null,{"$f":"SUM(E5:E9)","v":6},{"$f":"MIN(C15:C16)","v":6},{"$f":"MIN(F15:F16)","v":5},{"$f":"SUM(V5:V9)","v":5}]
[null,null,{"$f":"SUM(F5:F9)","v":6},{"$f":"MAX(C15:C16)","v":6},{"$f":"MAX(F15:F16)","v":8},{"$f":"SUM(W5:W9)","v":8},null,null,"Прогноз №2",null,null,{"$f":"D22","v":"Under2.5"},null,null,{"$f":"D20","v":2.5}]
[]
[null,null,null,{"$f":"SUM(D15:E15)/5","v":2.2000000000000002},null,null,null,null,"Прогноз №3",null,null,{"$f":"D29","v":"Over2.5"},null,null,{"$f":"D27","v":2.6883116883116882}]
[null,null,null,{"$f":"SUM(D16:E16)/5","v":2.8}]
[null,null,null,{"$f":"AVERAGEA(D18:E19)","v":2.5},null,null,null,null,"Прогноз №4",null,null,{"$f":"P33","v":"Under2.5"},null,null,{"$f":"O32","v":1.5},{"$f":"P32","v":0.83333333333333304}]
[null,null,null,{"$f":"IF(D20>=2.6,(\"Over2.5\"),(\"\"))","v":""},{"$f":"IF(D20<2.6,(\"Under2.5\"),(\"\"))","v":"Under2.5"}]
[null,null,null,{"$f":"D21&E21","v":"Under2.5"},null,null,null,null,"Прогноз №5",null,null,{"$f":"1-N22","v":0.4},"Un/Ov",{"$f":"G42","v":0.6}]
[]
[null,null,null,null,null,null,null,null,"Коэффициент на ТМ/ТБ 2.5",null,null,null,null,null,null,null,null,null,null,null,null,null,null,{"$f":"(Y24+Z24)/2","v":0.92640692640692635},{"$f":"AVERAGE(ГостиГости!L2:L37)","v":1.0909090909090908},{"$f":"AVERAGE(ДомаДома!M2:M37)","v":0.76190476190476186}]
[null,null,null,{"$f":"AVERAGE(ДомаДома!L2:L38)","v":1.5238095238095237},{"$f":"AVERAGE(ГостиГости!M2:M36)","v":2},{"$f":"(D25+E25)/2","v":1.7619047619047619}]
[null,null,null,null,null,null,null,null,"Стартовый",null,null,"Текущий"]
[null,null,null,{"$f":"(F25+X24)","v":2.6883116883116882},null,null,null,null,{"$f":"Коэффициенты!B6","v":1.48},null,"Under 2.5",null,{"$f":"Коэффициенты!C6","v":1.66},null,{"$f":"1/M27","v":0.60240963855421692}]
[null,null,null,{"$f":"IF(D27>=2.6,(\"Over2.5\"),(\"\"))","v":"Over2.5"},{"$f":"IF(D27<2.6,(\"Under2.5\"),(\"\"))","v":""},null,null,null,{"$f":"Коэффициенты!B5","v":2.6},null,"Over 2.5",null,{"$f":"Коэффициенты!C5","v":2.2200000000000002},null,{"$f":"1/M28","v":0.4504504504504504}]
[null,null,null,{"$f":"D28&E28","v":"Over2.5"}]
[]
[null,null,null,null,null,null,null,null,null,null,null,null,null,null,null,null,null,null,null,null,null,null,null,{"$f":"SUM(V5:V9)","v":5},{"$f":"SUM(W5:W9)","v":8},{"$f":"(X31-X32-X33)/3","v":1},"рейтинг атаки"]
[null,null,null,{"$f":"SUM(E5:E9)","v":6},{"$f":"SUM(F5:F9)","v":6},null,null,{"$f":"(D32-D33-D34)/3","v":1.3333333333333333},"рейтинг атаки",null,null,null,null,null,{"$f":"(H32+Z32)-1.5","v":1.5},{"$f":"(Z31+H33)-1.5","v":0.83333333333333304},null,null,null,null,null,null,null,{"$f":"MIN(V5:V9)","v":0},{"$f":"MIN(W5:W9)","v":0},{"$f":"(Y31-Y32-Y33)/3","v":1.6666666666666667},"рейтинг защиты"]
[null,null,null,{"$f":"MIN(E5:E9)","v":0},{"$f":"MIN(F5:F9)","v":0},null,null,{"$f":"(E32-E33-E34)/3","v":1.3333333333333333},"рейтинг защиты",null,null,null,null,null,{"$f":"SUM(O32:P32)","v":2.333333333333333},{"$f":"P36&Q36","v":"Under2.5"},null,null,null,null,null,null,null,{"$f":"MAX(V5:V9)","v":2},{"$f":"MAX(W5:W9)","v":3}]
[null,null,null,{"$f":"MAX(E5:E9)","v":2},{"$f":"MAX(F5:F9)","v":2}]
[]
[null,null,null,null,null,null,null,null,null,null,null,null,null,null,null,{"$f":"IF(O33>=2.6,(\"Over2.5\"),(\"\"))","v":""},{"$f":"IF(O33<2.6,(\"Under2.5\"),(\"\"))","v":"Under2.5"}]
[null,null,null,{"$f":"SUM(E5:F5)","v":2},{"$f":"SUM(V5:W5)","v":5},{"$f":"IF(D37>2.5,1,\"\")","v":""},{"$f":"IF(E37>2.5,1,\"\")","v":1}]
[null,null,null,{"$f":"SUM(E6:F6)","v":1},{"$f":"SUM(V6:W6)","v":3},{"$f":"IF(D38>2.5,1,\"\")","v":""},{"$f":"IF(E38>2.5,1,\"\")","v":1}]
[null,null,null,3,3,1,1]
[null,null,null,3,1,1,""]
[null,null,null,3,1,1,""]
[null,null,null,null,null,{"$f":"SUM(F37:G41)","v":6},{"$f":"F42/10","v":0.6}]

{"sheet":"Arhiv","index":15,"n_rows":6,"n_cols":13,"rows_kept":6,"cut":false,"hidden":false,"merged":[[0,8,0,9],[0,10,0,11],[0,0,1,0],[0,1,1,1],[0,2,1,2],[0,3,1,3],[0,4,1,4],[0,5,1,5],[0,6,0,7]]}
["Home","Away","Прогноз 1","Прогноз 2","Прогноз 3","Прогноз 4","Прогноз 5",null,"Кэф Букмекера на ТМ",null,"Кэф Букмекера на ТБ",null,"Количество"]
[null,null,null,null,null,null,"Under","Over","Стартовый","Текущий","Стартовый","Текущий","Голов"]
["Америка МГ","Ферровиарио","Under2.5","Under2.5","Under2.5","Under2.5",0.5,0.5,1.65,1.72,2.2000000000000002,2.0699999999999998]
["Shirak Gyumri","Noah","Under2.5","Under2.5","Under2.5","Under2.5",0.7,0.3,1.85,1.7,1.85,2.19]
["BW Linz","A. Klagenfurt","Over1.5-Under3.5","Over2.5","Over2.5","Under2.5",0.7,0.3,2.42,2.6,1.52,1.47,3]
["Universitarios","Saprissa","Over2.5","Over2.5","Over2.5","Over2.5",9.9999999999999978E-2,0.9,2.85,3.6,1.4,1.28]

{"sheet":"ОчныеДГ","index":16,"n_rows":150,"n_cols":18,"rows_kept":150,"cut":false,"hidden":true,"merged":[]}
["Бадеран Тегеран","Эстеглал Моласани",null,null,null,null,"Результат К1","Забито К1","Пропущено К1","Выиграно К1","Ничьих К1","Проиграно К1","РезультатК2","Забито К2","Пропущено К2","Выиграно К2","Ничьих К2","Пропущено К2"]
[null,null,null,null,null,null,{"$f":"IF(A2=\"\",\"\",IF($A$1=C2,IF(E2>F2,\"В\",IF(E2=F2,\"Н\",\"П\")),IF(E2<F2,\"В\",IF(E2=F2,\"Н\",\"П\"))))","v":""},{"$f":"IF(A2=\"\",\"\",IF($A$1=C2,E2,F2))","v":""},{"$f":"IF(A2=\"\",\"\",IF($A$1=C2,F2,E2))","v":""},{"$f":"IF(A2=\"\",\"\",IF(G2=\"В\",1,0))","v":""},{"$f":"IF(A2=\"\",\"\",IF(G2=\"Н\",1,0))","v":""},{"$f":"IF(A2=\"\",\"\",IF(G2=\"П\",1,0))","v":""},{"$f":"IF(A2=\"\",\"\",IF(B1=D2,IF(F2>E2,\"В\",IF(F2=E2,\"Н\",\"П\")),IF(F2<E2,\"В\",IF(F2=E2,\"Н\",\"П\"))))","v":""},{"$f":"IF(A2=\"\",\"\",IF(B1=D2,F2,E2))","v":""},{"$f":"IF(A2=\"\",\"\",IF(B1=D2,E2,F2))","v":""},{"$f":"IF(A2=\"\",\"\",IF(M2=\"В\",1,0))","v":""},{"$f":"IF(A2=\"\",\"\",IF(M2=\"Н\",1,0))","v":""},{"$f":"IF(A2=\"\",\"\",IF(M2=\"П\",1,0))","v":""}]
[null,null,null,null,null,null,"",{"$f":"IF(A3=\"\",\"\",IF($A$1=C3,E3+H2,F3+H2))","v":""},{"$f":"IF(A3=\"\",\"\",IF($A$1=C3,F3+I2,E3+I2))","v":""},{"$f":"IF(A3=\"\",\"\",IF(G3=\"В\",1+J2,0+J2))","v":""},{"$f":"IF(A3=\"\",\"\",IF(G3=\"Н\",1+K2,0+K2))","v":""},{"$f":"IF(A3=\"\",\"\",IF(G3=\"П\",1+L2,0+L2))","v":""},{"$f":"IF(A3=\"\",\"\",IF($B$1=D3,IF(F3>E3,\"В\",IF(F3=E3,\"Н\",\"П\")),IF(F3<E3,\"В\",IF(F3=E3,\"Н\",\"П\"))))","v":""},{"$f":"IF(A3=\"\",\"\",IF($B$1=D3,F3+N2,E3+N2))","v":""},{"$f":"IF(A3=\"\",\"\",IF($B$1=D3,E3+O2,F3+O2))","v":""},{"$f":"IF(A3=\"\",\"\",IF(M3=\"В\",1+P2,0+P2))","v":""},{"$f":"IF(A3=\"\",\"\",IF(M3=\"Н\",1+Q2,0+Q2))","v":""},{"$f":"IF(A3=\"\",\"\",IF(M3=\"П\",1+R2,0+R2))","v":""}]
[null,null,null,null,null,null,"",{"$f":"IF(A4=\"\",\"\",IF($A$1=C4,E4+H3,F4+H3))","v":""},{"$f":"IF(A4=\"\",\"\",IF($A$1=C4,F4+I3,E4+I3))","v":""},{"$f":"IF(A4=\"\",\"\",IF(G4=\"В\",1+J3,0+J3))","v":""},{"$f":"IF(A4=\"\",\"\",IF(G4=\"Н\",1+K3,0+K3))","v":""},{"$f":"IF(A4=\"\",\"\",IF(G4=\"П\",1+L3,0+L3))","v":""},{"$f":"IF(A4=\"\",\"\",IF($B$1=D4,IF(F4>E4,\"В\",IF(F4=E4,\"Н\",\"П\")),IF(F4<E4,\"В\",IF(F4=E4,\"Н\",\"П\"))))","v":""},{"$f":"IF(A4=\"\",\"\",IF($B$1=D4,F4+N3,E4+N3))","v":""},{"$f":"IF(A4=\"\",\"\",IF($B$1=D4,E4+O3,F4+O3))","v":""},{"$f":"IF(A4=\"\",\"\",IF(M4=\"В\",1+P3,0+P3))","v":""},{"$f":"IF(A4=\"\",\"\",IF(M4=\"Н\",1+Q3,0+Q3))","v":""},{"$f":"IF(A4=\"\",\"\",IF(M4=\"П\",1+R3,0+R3))","v":""}]
[null,null,null,null,null,null,"","","","","","","","","","","",""]
[null,null,null,null,null,null,"","","","","","","","","","","",""]
[null,null,null,null,null,null,"","","",{"$f":"IF(A7=\"\",\"\",IF(G7=\"В\",1+J6,0+J6))","v":""},{"$f":"IF(A7=\"\",\"\",IF(G7=\"Н\",1+K6,0+K6))","v":""},{"$f":"IF(A7=\"\",\"\",IF(G7=\"П\",1+L6,0+L6))","v":""},{"$f":"IF(A7=\"\",\"\",IF($B$1=D7,IF(F7>E7,\"В\",IF(F7=E7,\"Н\",\"П\")),IF(F7<E7,\"В\",IF(F7=E7,\"Н\",\"П\"))))","v":""},{"$f":"IF(A7=\"\",\"\",IF($B$1=D7,F7+N6,E7+N6))","v":""},{"$f":"IF(A7=\"\",\"\",IF($B$1=D7,E7+O6,F7+O6))","v":""},{"$f":"IF(A7=\"\",\"\",IF(M7=\"В\",1+P6,0+P6))","v":""},{"$f":"IF(A7=\"\",\"\",IF(M7=\"Н\",1+Q6,0+Q6))","v":""},{"$f":"IF(A7=\"\",\"\",IF(M7=\"П\",1+R6,0+R6))","v":""}]
[null,null,null,null,null,null,"","","","","","","","","","","",""]
[null,null,null,null,null,null,"","","","","","","","","","","",""]
[null,null,null,null,null,null,"","","","","","","","","","","",""]
[null,null,null,null,null,null,"","","","","","","","","","","",""]
[null,null,null,null,null,null,"","","","","","","","","","","",""]
[null,null,null,null,null,null,"","","","","","","","","","","",""]
[null,null,null,null,null,null,"","","","","","","","","","","",""]
[null,null,null,null,null,null,"","","","","","","","","","","",""]
[null,null,null,null,null,null,"","","","","","","","","","","",""]
[null,null,null,null,null,null,"","","","","","","","","","","",""]
[null,null,null,null,null,null,"","","","","","","","","","","",""]
[null,null,null,null,null,null,"","","","","","","","","","","",""]
[null,null,null,null,null,null,"","","","","","","","","","","",""]
[null,null,null,null,null,null,"","","","","","","","","","","",""]
[null,null,null,null,null,null,"","","","","","","","","","","",""]
[null,null,null,null,null,null,"","","","","","","","","","","",""]
[null,null,null,null,null,null,"","","","","","","","","","","",""]
[null,null,null,null,null,null,"","","","","","","","","","","",""]
[null,null,null,null,null,null,"","","","","","","","","","","",""]
[null,null,null,null,null,null,"","","","","","","","","","","",""]
[null,null,null,null,null,null,"","","","","","","","","","","",""]
[null,null,null,null,null,null,"","","","","","","","","","","",""]
[null,null,null,null,null,null,"","","","","","","","","","","",""]
[null,null,null,null,null,null,"","","","","","","","","","","",""]
[null,null,null,null,null,null,"","","","","","","","","","","",""]
[null,null,null,null,null,null,"","","","","","","","","","","",""]
[null,null,null,null,null,null,{"$f":"IF(A34=\"\",\"\",IF($A$1=C34,IF(E34>F34,\"В\",IF(E34=F34,\"Н\",\"П\")),IF(E34<F34,\"В\",IF(E34=F34,\"Н\",\"П\"))))","v":""},"","","","","","","","","","",""]
[null,null,null,null,null,null,"","","","","","","","","","","",""]
[null,null,null,null,null,null,"","","","","","","","","","","",""]
[null,null,null,null,null,null,"","","","","","","","","","","",""]
[null,null,null,null,null,null,"","","","","","","","","","","",""]
[null,null,null,null,null,null,"","","","","","","","","","","",""]
[null,null,null,null,null,null,"","","","","","","","","","","",""]
[null,null,null,null,null,null,"","","","","","","","","","","",""]
[null,null,null,null,null,null,"","","","","","","","","","","",""]
[null,null,null,null,null,null,"","","","","","","","","","","",""]
[null,null,null,null,null,null,"","","","","","","","","","","",""]
[null,null,null,null,null,null,"","","","","","","","","","","",""]
[null,null,null,null,null,null,"","","","","","","","","","","",""]
[null,null,null,null,null,null,"","","","","","","","","","","",""]
[null,null,null,null,null,null,"","","","","","","","","","","",""]
[null,null,null,null,null,null,"","","","","","","","","","","",""]
[null,null,null,null,null,null,"","","","","","","","","","","",""]
[null,null,null,null,null,null,"","","","","","","","","","","",""]
[null,null,null,null,null,null,"","","","","","","","","","","",""]
[null,null,null,null,null,null,"","","","","","","","","","","",""]
[null,null,null,null,null,null,"","","","","","","","","","","",""]
[null,null,null,null,null,null,"","","","","","","","","","","",""]
[null,null,null,null,null,null,"","","","","","","","","","","",""]
[null,null,null,null,null,null,"","","","","","","","","","","",""]
[null,null,null,null,null,null,"","","","","","","","","","","",""]
[null,null,null,null,null,null,"","","","","","","","","","","",""]
[null,null,null,null,null,null,"","","","","","","","","","","",""]
[null,null,null,null,null,null,"","","","","","","","","","","",""]
[null,null,null,null,null,null,"","","","","","","","","","","",""]
[null,null,null,null,null,null,"","","","","","","","","","","",""]
[null,null,null,null,null,null,"","","","","","","","","","","",""]
[null,null,null,null,null,null,"","","","","","","","","","","",""]
[null,null,null,null,null,null,{"$f":"IF(A66=\"\",\"\",IF($A$1=C66,IF(E66>F66,\"В\",IF(E66=F66,\"Н\",\"П\")),IF(E66<F66,\"В\",IF(E66=F66,\"Н\",\"П\"))))","v":""},"","","","","","","","","","",""]
[null,null,null,null,null,null,"","","","","","","","","","","",""]
[null,null,null,null,null,null,"",{"$f":"IF(A68=\"\",\"\",IF($A$1=C68,E68+H67,F68+H67))","v":""},{"$f":"IF(A68=\"\",\"\",IF($A$1=C68,F68+I67,E68+I67))","v":""},"","","","","","","","",""]
[null,null,null,null,null,null,"","","","","","","","","","","",""]
[null,null,null,null,null,null,"","","","","","","","","","","",""]
[null,null,null,null,null,null,"","","",{"$f":"IF(A71=\"\",\"\",IF(G71=\"В\",1+J70,0+J70))","v":""},{"$f":"IF(A71=\"\",\"\",IF(G71=\"Н\",1+K70,0+K70))","v":""},{"$f":"IF(A71=\"\",\"\",IF(G71=\"П\",1+L70,0+L70))","v":""},{"$f":"IF(A71=\"\",\"\",IF($B$1=D71,IF(F71>E71,\"В\",IF(F71=E71,\"Н\",\"П\")),IF(F71<E71,\"В\",IF(F71=E71,\"Н\",\"П\"))))","v":""},{"$f":"IF(A71=\"\",\"\",IF($B$1=D71,F71+N70,E71+N70))","v":""},{"$f":"IF(A71=\"\",\"\",IF($B$1=D71,E71+O70,F71+O70))","v":""},{"$f":"IF(A71=\"\",\"\",IF(M71=\"В\",1+P70,0+P70))","v":""},{"$f":"IF(A71=\"\",\"\",IF(M71=\"Н\",1+Q70,0+Q70))","v":""},{"$f":"IF(A71=\"\",\"\",IF(M71=\"П\",1+R70,0+R70))","v":""}]
[null,null,null,null,null,null,"","","","","","","","","","","",""]
[null,null,null,null,null,null,"","","","","","","","","","","",""]
[null,null,null,null,null,null,"","","","","","","","","","","",""]
[null,null,null,null,null,null,"","","","","","","","","","","",""]
[null,null,null,null,null,null,"","","","","","","","","","","",""]
[null,null,null,null,null,null,"","","","","","","","","","","",""]
[null,null,null,null,null,null,"","","","","","","","","","","",""]
[null,null,null,null,null,null,"","","","","","","","","","","",""]
[null,null,null,null,null,null,"","","","","","","","","","","",""]
[null,null,null,null,null,null,"","","","","","","","","","","",""]
[null,null,null,null,null,null,"","","","","","","","","","","",""]
[null,null,null,null,null,null,"","","","","","","","","","","",""]
[null,null,null,null,null,null,"","","","","","","","","","","",""]
[null,null,null,null,null,null,"","","","","","","","","","","",""]
[null,null,null,null,null,null,"","","","","","","","","","","",""]
[null,null,null,null,null,null,"","","","","","","","","","","",""]
[null,null,null,null,null,null,"","","","","","","","","","","",""]
[null,null,null,null,null,null,"","","","","","","","","","","",""]
[null,null,null,null,null,null,"","","","","","","","","","","",""]
[null,null,null,null,null,null,"","","","","","","","","","","",""]
[null,null,null,null,null,null,"","","","","","","","","","","",""]
[null,null,null,null,null,null,"","","","","","","","","","","",""]
[null,null,null,null,null,null,"","","","","","","","","","","",""]
[null,null,null,null,null,null,"","","","","","","","","","","",""]
[null,null,null,null,null,null,"","","","","","","","","","","",""]
[null,null,null,null,null,null,"","","","","","","","","","","",""]
[null,null,null,null,null,null,{"$f":"IF(A98=\"\",\"\",IF($A$1=C98,IF(E98>F98,\"В\",IF(E98=F98,\"Н\",\"П\")),IF(E98<F98,\"В\",IF(E98=F98,\"Н\",\"П\"))))","v":""},"","","","","","","","","","",""]
[null,null,null,null,null,null,"","","","","","","","","","","",""]
[null,null,null,null,null,null,"","","","","","","","","","","",""]
[null,null,null,null,null,null,"","","","","","","","","","","",""]
[null,null,null,null,null,null,"","","","","","","","","","","",""]
[null,null,null,null,null,null,"","","","","","","","","","","",""]
[null,null,null,null,null,null,"","","","","","","","","","","",""]
[null,null,null,null,null,null,"","","","","","","","","","","",""]
[null,null,null,null,null,null,"","","","","","","","","","","",""]
[null,null,null,null,null,null,"","","","","","","","","","","",""]
[null,null,null,null,null,null,"","","","","","","","","","","",""]
[null,null,null,null,null,null,"","","","","","","","","","","",""]
[null,null,null,null,null,null,"","","","","","","","","","","",""]
[null,null,null,null,null,null,"","","","","","","","","","","",""]
[null,null,null,null,null,null,"","","","","","","","","","","",""]
[null,null,null,null,null,null,"","","","","","","","","","","",""]
[null,null,null,null,null,null,"","","","","","","","","","","",""]
[null,null,null,null,null,null,"","","","","","","","","","","",""]
[null,null,null,null,null,null,"","","","","","","","","","","",""]
[null,null,null,null,null,null,"","","","","","","","","","","",""]
[null,null,null,null,null,null,"","","","","","","","","","","",""]
[null,null,null,null,null,null,"","","","","","","","","","","",""]
[null,null,null,null,null,null,"","","","","","","","","","","",""]
[null,null,null,null,null,null,"","","","","","","","","","","",""]
[null,null,null,null,null,null,"","","","","","","","","","","",""]
[null,null,null,null,null,null,"","","","","","","","","","","",""]
[null,null,null,null,null,null,"","","","","","","","","","","",""]
[null,null,null,null,null,null,"","","","","","","","","","","",""]
[null,null,null,null,null,null,"","","","","","","","","","","",""]
[null,null,null,null,null,null,"","","","","","","","","","","",""]
[null,null,null,null,null,null,"","","","","","","","","","","",""]
[null,null,null,null,null,null,"","","","","","","","","","","",""]
[null,null,null,null,null,null,{"$f":"IF(A130=\"\",\"\",IF($A$1=C130,IF(E130>F130,\"В\",IF(E130=F130,\"Н\",\"П\")),IF(E130<F130,\"В\",IF(E130=F130,\"Н\",\"П\"))))","v":""},"","","","","","","","","","",""]
[null,null,null,null,null,null,"","","","","","","","","","","",""]
[null,null,null,null,null,null,"",{"$f":"IF(A132=\"\",\"\",IF($A$1=C132,E132+H131,F132+H131))","v":""},{"$f":"IF(A132=\"\",\"\",IF($A$1=C132,F132+I131,E132+I131))","v":""},"","","","","","","","",""]
[null,null,null,null,null,null,"","","","","","","","","","","",""]
[null,null,null,null,null,null,"","","","","","","","","","","",""]
[null,null,null,null,null,null,"","","",{"$f":"IF(A135=\"\",\"\",IF(G135=\"В\",1+J134,0+J134))","v":""},{"$f":"IF(A135=\"\",\"\",IF(G135=\"Н\",1+K134,0+K134))","v":""},{"$f":"IF(A135=\"\",\"\",IF(G135=\"П\",1+L134,0+L134))","v":""},{"$f":"IF(A135=\"\",\"\",IF($B$1=D135,IF(F135>E135,\"В\",IF(F135=E135,\"Н\",\"П\")),IF(F135<E135,\"В\",IF(F135=E135,\"Н\",\"П\"))))","v":""},{"$f":"IF(A135=\"\",\"\",IF($B$1=D135,F135+N134,E135+N134))","v":""},{"$f":"IF(A135=\"\",\"\",IF($B$1=D135,E135+O134,F135+O134))","v":""},{"$f":"IF(A135=\"\",\"\",IF(M135=\"В\",1+P134,0+P134))","v":""},{"$f":"IF(A135=\"\",\"\",IF(M135=\"Н\",1+Q134,0+Q134))","v":""},{"$f":"IF(A135=\"\",\"\",IF(M135=\"П\",1+R134,0+R134))","v":""}]
[null,null,null,null,null,null,"","","","","","","","","","","",""]
[null,null,null,null,null,null,"","","","","","","","","","","",""]
[null,null,null,null,null,null,"","","","","","","","","","","",""]
[null,null,null,null,null,null,"","","","","","","","","","","",""]
[null,null,null,null,null,null,"","","","","","","","","","","",""]
[null,null,null,null,null,null,"","","","","","","","","","","",""]
[null,null,null,null,null,null,"","","","","","","","","","","",""]
[null,null,null,null,null,null,"","","","","","","","","","","",""]
[null,null,null,null,null,null,"","","","","","","","","","","",""]
[null,null,null,null,null,null,"","","","","","","","","","","",""]
[null,null,null,null,null,null,"","","","","","","","","","","",""]
[null,null,null,null,null,null,"","","","","","","","","","","",""]
[null,null,null,null,null,null,"","","","","","","","","","","",""]
[null,null,null,null,null,null,"","","","","","","","","","","",""]
[null,null,null,null,null,null,"","","","","","","","","","","",""]

{"sheet":"Коэффициенты","index":17,"n_rows":8,"n_cols":7,"rows_kept":8,"cut":false,"hidden":true,"merged":[]}
["Идентификатор","Стартовый","Текущий"]
["П1",1.64,1.54,null,{"$f":"1/C2","v":0.64935064935064934},{"$f":"1/C3","v":0.26595744680851063},{"$f":"1/C4","v":0.16528925619834711}]
["X",3.2,3.76]
["П2",5.6,6.05]
["ТБ2.5",2.6,2.2200000000000002]
["ТМ2.5",1.48,1.66]
["ОЗ",2.4,2.66]
["ОНЗ",1.5,1.45]

{"sheet":"Расчеты","index":18,"n_rows":123,"n_cols":73,"rows_kept":123,"cut":false,"hidden":true,"merged":[[115,21,115,22],[115,27,115,28],[116,21,116,22],[116,27,116,28],[117,22,118,22],[117,21,118,21],[119,22,120,22],[110,21,110,22],[110,23,110,24],[110,25,110,26],[110,27,110,28],[111,21,113,21],[111,22,113,22],[111,23,113,23],[111,24,113,24],[111,25,113,26],[111,27,113,28],[119,21,120,21],[114,21,114,22],[114,27,114,28],[14,51,14,53],[2,67,2,72],[2,61,2,66],[2,55,2,60],[2,51,2,54],[110,15,111,16],[112,15,113,16],[122,8,122,9],[121,8,121,9],[80,27,80,28],[101,27,101,35],[38,35,43,35],[43,37,43,38],[44,31,44,32],[72,36,72,38],[72,39,72,41],[72,42,72,44],[72,45,72,47],[49,42,49,44],[49,45,49,47],[49,36,49,38],[49,39,49,41],[49,35,60,35],[72,35,83,35],[115,5,116,7],[115,8,115,9],[117,8,117,9],[119,8,119,9],[107,2,107,3],[107,4,107,5],[107,6,107,8],[111,2,111,3],[111,4,111,5],[111,6,111,7],[111,8,111,9],[49,2,49,3],[50,7,52,7],[54,3,55,6],[54,7,55,10],[54,11,55,15],[67,2,67,3],[67,5,67,6],[68,2,68,3],[68,5,68,6],[100,2,100,4],[100,5,100,7],[100,8,100,10],[100,11,100,12],[104,2,104,4],[104,5,104,7],[104,8,104,10],[104,11,104,12],[82,19,82,26],[83,19,88,19],[83,21,88,21],[83,23,88,23],[83,25,88,25],[101,18,101,26],[96,19,96,20],[86,2,86,5],[86,6,86,9],[95,15,95,16],[95,17,95,18],[91,3,91,9],[91,10,91,16],[91,17,91,23],[95,19,95,20],[75,14,75,15],[37,19,37,22],[37,23,37,26],[45,19,45,21],[45,23,45,25],[46,19,46,24],[45,35,45,37],[45,38,45,39],[66,24,66,25],[61,24,61,25],[73,19,73,28],[74,19,74,20],[74,21,74,22],[74,23,74,24],[74,26,74,27],[55,29,55,32],[46,25,48,26],[49,25,51,26],[51,19,51,20],[37,30,37,35],[37,37,37,39],[38,29,43,29],[38,31,43,31],[38,33,43,33],[77,25,77,26],[77,27,77,28],[63,21,63,23],[60,19,60,20],[59,19,59,20],[59,21,59,23],[64,24,64,25],[65,24,65,25],[61,19,61,20],[61,21,61,23],[63,24,63,25],[63,26,63,28],[63,19,63,20],[2,32,2,37],[2,38,2,43],[2,28,2,31],[2,44,2,49],[14,28,14,30],[29,11,29,14],[30,11,30,13],[31,11,31,12],[32,11,32,12],[17,13,18,13],[19,13,20,13],[17,14,18,14],[19,14,20,14],[2,17,2,23],[6,10,6,11],[7,10,7,11],[8,10,8,11],[15,4,15,14],[16,10,16,12],[17,12,18,12],[19,12,20,12],[29,16,29,23],[2,3,2,9],[2,10,2,16],[8,3,8,4],[6,5,6,6],[7,5,7,6],[8,5,8,6],[22,12,22,17],[6,19,6,20],[7,19,7,20],[8,19,8,20],[15,16,15,25],[6,12,6,13],[7,12,7,13],[8,12,8,13],[6,17,6,18],[7,17,7,18],[8,17,8,18],[6,3,6,4],[7,3,7,4],[22,8,23,8],[22,9,22,11],[13,5,13,6],[13,8,13,9],[15,2,16,3],[19,2,19,3],[20,2,20,3],[17,2,17,3],[18,2,18,3],[22,3,22,6],[37,2,37,7],[27,2,27,6],[22,2,23,2],[26,2,26,6],[33,2,33,3],[34,2,34,3],[29,7,29,10],[30,7,30,9],[31,7,31,8],[32,7,32,8],[33,7,33,8],[34,7,34,8],[29,2,29,5],[30,2,30,3],[37,10,37,16],[30,4,30,5],[31,2,31,3],[32,2,32,3],[34,11,34,12],[33,11,33,12],[73,2,73,3],[63,2,64,7],[63,12,63,16],[65,2,65,3],[65,5,65,6],[66,2,66,3],[66,5,66,6],[65,12,65,13],[66,12,66,13],[46,12,46,13],[60,11,60,12],[64,19,64,23],[62,19,62,20],[62,24,62,25],[61,26,61,28],[62,21,62,23],[62,26,62,28],[59,24,59,25],[59,26,59,28],[60,24,60,25],[56,11,56,12],[57,11,57,12],[58,11,58,12],[59,11,59,12]]}
["29bnCyUr"]
[]
[null,null,null,"Всего",null,null,null,null,null,null,"Дома",null,null,null,null,null,null,"На выезде",null,null,null,null,null,null,null,null,null,null,"Пуассон",null,null,null,"Дома",null,null,null,null,null,"Гости",null,null,null,null,null,"Ничья",null,null,null,null,null,null,"Пуассон",null,null,null,"Дома",null,null,null,null,null,"Гости",null,null,null,null,null,"Ничья"]
[null,null,null,"Игр","В","Н","П","Забито","Проп","Очки","Игр","В","Н","П","Забито","Проп","Очки","Игр","В","Н","П","Забито","Проп","Очки",null,null,null,null,{"$f":"D12","v":1.6875},"HG","AG",{"$f":"D13","v":0.53749999999999987},"Г1","Г2","Д","Г","%","КФ","К1","К2","Д","Г","%","КФ","К1","К2","Д","Гости","%","КФ",null,{"$f":"U112","v":{"$error":"#REF!"}},"HG","AG",{"$f":"U114","v":{"$error":"#REF!"}},"Г1","Г2","Д","Г","%","КФ","К1","К2","Д","Г","%","КФ","К1","К2","Д","Гости","%","КФ"]
[null,null,"Хозяева",{"$f":"Дома!O11","v":10},{"$f":"Дома!P11","v":5},{"$f":"Дома!Q11","v":1},{"$f":"Дома!R11","v":4},{"$f":"Дома!S11","v":11},{"$f":"Дома!T11","v":9},{"$f":"Дома!U11","v":16},{"$f":"Дома!V11","v":5},{"$f":"Дома!W11","v":3},{"$f":"Дома!X11","v":1},{"$f":"Дома!Y11","v":1},{"$f":"Дома!Z11","v":5},{"$f":"Дома!AA11","v":3},{"$f":"Дома!AB11","v":10},{"$f":"Дома!AC11","v":5},{"$f":"Дома!AD11","v":2},{"$f":"Дома!AE11","v":0},{"$f":"Дома!AF11","v":3},{"$f":"Дома!AG11","v":6},{"$f":"Дома!AH11","v":6},{"$f":"Дома!AI11","v":6},null,null,null,null,0,{"$f":"POISSON(AC5,AC4,FALSE)*100","v":18.498139990730429},{"$f":"POISSON(AC5,AF4,FALSE)*100","v":58.42069456117359},0,7,0,{"$f":"VLOOKUP(AG5,AC5:AE12,2)","v":0.14302237839037371},{"$f":"VLOOKUP(AH5,AC5:AE12,3)","v":58.42069456117359},{"$f":"(AI5*AJ5)/100","v":8.3554666833566174E-2},{"$f":"100/AK5","v":1196.8212403885416},0,7,{"$f":"VLOOKUP(AM5,AC5:AE12,2)","v":18.498139990730429},{"$f":"VLOOKUP(AN5,AC5:AE12,3)","v":1.5023996012101533E-4},{"$f":"(AO5*AP5)/100","v":2.7791598145202987E-5},{"$f":"100/AQ5","v":3598209.7710800651},0,0,{"$f":"VLOOKUP(AS5,AC5:AE12,2)","v":18.498139990730429},{"$f":"VLOOKUP(AT5,AC5:AE12,3)","v":58.42069456117359},{"$f":"(AU5*AV5)/100","v":10.806741863482928},{"$f":"100/AW5","v":9.2534828039068913},null,0,{"$f":"POISSON(AZ5,AZ4,FALSE)*100","v":{"$error":"#REF!"}},{"$f":"POISSON(AZ5,BC4,FALSE)*100","v":{"$error":"#REF!"}},0,7,0,{"$f":"VLOOKUP(BD5,AZ5:BB12,2)","v":{"$error":"#REF!"}},{"$f":"VLOOKUP(BE5,AZ5:BB12,3)","v":{"$error":"#REF!"}},{"$f":"(BF5*BG5)/100","v":{"$error":"#REF!"}},{"$f":"100/BH5","v":{"$error":"#REF!"}},0,7,{"$f":"VLOOKUP(BJ5,AZ5:BB12,2)","v":{"$error":"#REF!"}},{"$f":"VLOOKUP(BK5,AZ5:BB12,3)","v":{"$error":"#REF!"}},{"$f":"(BL5*BM5)/100","v":{"$error":"#REF!"}},{"$f":"100/BN5","v":{"$error":"#REF!"}},0,0,{"$f":"VLOOKUP(BP5,AZ5:BB12,2)","v":{"$error":"#REF!"}},{"$f":"VLOOKUP(BQ5,AZ5:BB12,3)","v":{"$error":"#REF!"}},{"$f":"(BR5*BS5)/100","v":{"$error":"#REF!"}},{"$f":"100/BT5","v":{"$error":"#REF!"}}]
[null,null,"Гости",{"$f":"Гости!O11","v":10},{"$f":"Гости!P11","v":3},{"$f":"Гости!Q11","v":0},{"$f":"Гости!R11","v":7},{"$f":"Гости!S11","v":9},{"$f":"Гости!T11","v":14},{"$f":"Гости!U11","v":9},{"$f":"Гости!V11","v":5},{"$f":"Гости!W11","v":3},{"$f":"Гости!X11","v":0},{"$f":"Гости!Y11","v":2},{"$f":"Гости!Z11","v":4},{"$f":"Гости!AA11","v":3},{"$f":"Гости!AB11","v":9},{"$f":"Гости!AC11","v":5},{"$f":"Гости!AD11","v":0},{"$f":"Гости!AE11","v":0},{"$f":"Гости!AF11","v":5},{"$f":"Гости!AG11","v":5},{"$f":"Гости!AH11","v":11},{"$f":"Гости!AI11","v":0},null,null,null,null,1,{"$f":"POISSON(AC6,AC4,FALSE)*100","v":31.215611234357599},{"$f":"POISSON(AC6,AF4,FALSE)*100","v":31.401123326630799},1,7,1,{"$f":"VLOOKUP(AG6,AC5:AE12,2)","v":0.14302237839037371},{"$f":"VLOOKUP(AH6,AC5:AE12,3)","v":31.401123326630799},4.4910633423041808E-2,2226.6441681647289,1,7,{"$f":"VLOOKUP(AM6,AC5:AE12,2)","v":31.215611234357599},{"$f":"VLOOKUP(AN6,AC5:AE12,3)","v":1.5023996012101533E-4},4.6898321870030036E-5,2132272.4569363352,1,1,{"$f":"VLOOKUP(AS6,AC5:AE12,2)","v":31.215611234357599},{"$f":"VLOOKUP(AT6,AC5:AE12,3)","v":31.401123326630799},9.8020525808622487,10.201944865633784,null,1,{"$f":"POISSON(AZ6,AZ4,FALSE)*100","v":{"$error":"#REF!"}},{"$f":"POISSON(AZ6,BC4,FALSE)*100","v":{"$error":"#REF!"}},1,7,1,{"$f":"VLOOKUP(BD6,AZ5:BB12,2)","v":{"$error":"#REF!"}},{"$f":"VLOOKUP(BE6,AZ5:BB12,3)","v":{"$error":"#REF!"}},{"$error":"#REF!"},{"$error":"#REF!"},1,7,{"$f":"VLOOKUP(BJ6,AZ5:BB12,2)","v":{"$error":"#REF!"}},{"$f":"VLOOKUP(BK6,AZ5:BB12,3)","v":{"$error":"#REF!"}},{"$error":"#REF!"},{"$error":"#REF!"},1,1,{"$f":"VLOOKUP(BP6,AZ5:BB12,2)","v":{"$error":"#REF!"}},{"$f":"VLOOKUP(BQ6,AZ5:BB12,3)","v":{"$error":"#REF!"}},{"$error":"#REF!"},{"$error":"#REF!"}]
[null,null,null,"Забивают",null,"Пропускают",null,"В/Н/П","З/П",null,"Забивают",null,"Пропускают",null,"В/Н/П","З/П",null,"Забивают",null,"Пропускают",null,"В/Н/П","З/П",null,null,null,null,null,2,{"$f":"POISSON(AC7,AC4,FALSE)*100","v":26.338171978989227},{"$f":"POISSON(AC7,AF4,FALSE)*100","v":8.4390518940320227},2,7,2,{"$f":"VLOOKUP(AG7,AC5:AE12,2)","v":0.14302237839037371},{"$f":"VLOOKUP(AH7,AC5:AE12,3)","v":8.4390518940320227},1.206973273244248E-2,8285.1876024734138,2,7,{"$f":"VLOOKUP(AM7,AC5:AE12,2)","v":26.338171978989227},{"$f":"VLOOKUP(AN7,AC5:AE12,3)","v":1.5023996012101533E-4},3.9570459077837847E-5,2527137.72673936,2,2,{"$f":"VLOOKUP(AS7,AC5:AE12,2)","v":26.338171978989227},{"$f":"VLOOKUP(AT7,AC5:AE12,3)","v":8.4390518940320227},2.2226920012463016,44.990488985396212,null,2,{"$f":"POISSON(AZ7,AZ4,FALSE)*100","v":{"$error":"#REF!"}},{"$f":"POISSON(AZ7,BC4,FALSE)*100","v":{"$error":"#REF!"}},2,7,2,{"$f":"VLOOKUP(BD7,AZ5:BB12,2)","v":{"$error":"#REF!"}},{"$f":"VLOOKUP(BE7,AZ5:BB12,3)","v":{"$error":"#REF!"}},{"$error":"#REF!"},{"$error":"#REF!"},2,7,{"$f":"VLOOKUP(BJ7,AZ5:BB12,2)","v":{"$error":"#REF!"}},{"$f":"VLOOKUP(BK7,AZ5:BB12,3)","v":{"$error":"#REF!"}},{"$error":"#REF!"},{"$error":"#REF!"},2,2,{"$f":"VLOOKUP(BP7,AZ5:BB12,2)","v":{"$error":"#REF!"}},{"$f":"VLOOKUP(BQ7,AZ5:BB12,3)","v":{"$error":"#REF!"}},{"$error":"#REF!"},{"$error":"#REF!"}]
[null,null,"Хозяева",{"$f":"H5/D5","v":1.1000000000000001},null,{"$f":"I5/D5","v":0.9},null,{"$f":"CONCATENATE(E5,\"/\",F5,\"/\",G5)","v":"5/1/4"},{"$f":"CONCATENATE(H5,\"/\",I5)","v":"11/9"},null,{"$f":"O5/K5","v":1},null,{"$f":"P5/K5","v":0.6},null,{"$f":"CONCATENATE(L5,\"/\",M5,\"/\",N5)","v":"3/1/1"},{"$f":"CONCATENATE(O5,\"/\",P5)","v":"5/3"},null,{"$f":"V5/R5","v":1.2},null,{"$f":"W5/R5","v":1.2},null,{"$f":"CONCATENATE(S5,\"/\",T5,\"/\",U5)","v":"2/0/3"},{"$f":"CONCATENATE(V5,\"/\",W5)","v":"6/6"},null,null,null,null,null,3,{"$f":"POISSON(AC8,AC4,FALSE)*100","v":14.815221738181444},{"$f":"POISSON(AC8,AF4,FALSE)*100","v":1.5119967976807374},3,7,3,{"$f":"VLOOKUP(AG8,AC5:AE12,2)","v":0.14302237839037371},{"$f":"VLOOKUP(AH8,AC5:AE12,3)","v":1.5119967976807374},2.1624937812292776E-3,46242.907548688825,3,7,{"$f":"VLOOKUP(AM8,AC5:AE12,2)","v":14.815221738181444},{"$f":"VLOOKUP(AN8,AC5:AE12,3)","v":1.5023996012101533E-4},2.2258383231283793E-5,4492689.2919810833,3,3,{"$f":"VLOOKUP(AS8,AC5:AE12,2)","v":14.815221738181444},{"$f":"VLOOKUP(AT8,AC5:AE12,3)","v":1.5119967976807374},0.22400567825060391,446.41725504889251,null,3,{"$f":"POISSON(AZ8,AZ4,FALSE)*100","v":{"$error":"#REF!"}},{"$f":"POISSON(AZ8,BC4,FALSE)*100","v":{"$error":"#REF!"}},3,7,3,{"$f":"VLOOKUP(BD8,AZ5:BB12,2)","v":{"$error":"#REF!"}},{"$f":"VLOOKUP(BE8,AZ5:BB12,3)","v":{"$error":"#REF!"}},{"$error":"#REF!"},{"$error":"#REF!"},3,7,{"$f":"VLOOKUP(BJ8,AZ5:BB12,2)","v":{"$error":"#REF!"}},{"$f":"VLOOKUP(BK8,AZ5:BB12,3)","v":{"$error":"#REF!"}},{"$error":"#REF!"},{"$error":"#REF!"},3,3,{"$f":"VLOOKUP(BP8,AZ5:BB12,2)","v":{"$error":"#REF!"}},{"$f":"VLOOKUP(BQ8,AZ5:BB12,3)","v":{"$error":"#REF!"}},{"$error":"#REF!"},{"$error":"#REF!"}]
[null,null,"Гости",{"$f":"H6/D6","v":0.9},null,{"$f":"I6/D6","v":1.4},null,{"$f":"CONCATENATE(E6,\"/\",F6,\"/\",G6)","v":"3/0/7"},{"$f":"CONCATENATE(H6,\"/\",I6)","v":"9/14"},null,{"$f":"O6/K6","v":0.8},null,{"$f":"P6/K6","v":0.6},null,{"$f":"CONCATENATE(L6,\"/\",M6,\"/\",N6)","v":"3/0/2"},{"$f":"CONCATENATE(O6,\"/\",P6)","v":"4/3"},null,{"$f":"V6/R6","v":1},null,{"$f":"W6/R6","v":2.2000000000000002},null,{"$f":"CONCATENATE(S6,\"/\",T6,\"/\",U6)","v":"0/0/5"},{"$f":"CONCATENATE(V6,\"/\",W6)","v":"5/11"},null,null,null,null,null,4,{"$f":"POISSON(AC9,AC4,FALSE)*100","v":6.2501716707952975},{"$f":"POISSON(AC9,AF4,FALSE)*100","v":0.20317456968834899},4,7,4,{"$f":"VLOOKUP(AG9,AC5:AE12,2)","v":0.14302237839037371},{"$f":"VLOOKUP(AH9,AC5:AE12,3)","v":0.20317456968834899},2.90585101852684E-4,344133.26547861472,4,7,{"$f":"VLOOKUP(AM9,AC5:AE12,2)","v":6.2501716707952975},{"$f":"VLOOKUP(AN9,AC5:AE12,3)","v":1.5023996012101533E-4},9.3902554256978519E-6,10649337.580992196,4,4,{"$f":"VLOOKUP(AS9,AC5:AE12,2)","v":6.2501716707952975},{"$f":"VLOOKUP(AT9,AC5:AE12,3)","v":0.20317456968834899},1.2698759396921437E-2,7874.7849986230167,null,4,{"$f":"POISSON(AZ9,AZ4,FALSE)*100","v":{"$error":"#REF!"}},{"$f":"POISSON(AZ9,BC4,FALSE)*100","v":{"$error":"#REF!"}},4,7,4,{"$f":"VLOOKUP(BD9,AZ5:BB12,2)","v":{"$error":"#REF!"}},{"$f":"VLOOKUP(BE9,AZ5:BB12,3)","v":{"$error":"#REF!"}},{"$error":"#REF!"},{"$error":"#REF!"},4,7,{"$f":"VLOOKUP(BJ9,AZ5:BB12,2)","v":{"$error":"#REF!"}},{"$f":"VLOOKUP(BK9,AZ5:BB12,3)","v":{"$error":"#REF!"}},{"$error":"#REF!"},{"$error":"#REF!"},4,4,{"$f":"VLOOKUP(BP9,AZ5:BB12,2)","v":{"$error":"#REF!"}},{"$f":"VLOOKUP(BQ9,AZ5:BB12,3)","v":{"$error":"#REF!"}},{"$error":"#REF!"},{"$error":"#REF!"}]
[null,null,null,null,null,null,null,null,null,null,null,null,null,null,null,null,null,null,null,null,null,null,null,null,null,null,null,null,5,{"$f":"POISSON(AC10,AC4,FALSE)*100","v":2.1094329388934128},{"$f":"POISSON(AC10,AF4,FALSE)*100","v":2.1841266241497518E-2},5,7,5,{"$f":"VLOOKUP(AG10,AC5:AE12,2)","v":0.14302237839037371},{"$f":"VLOOKUP(AH10,AC5:AE12,3)","v":2.1841266241497518E-2},3.1237898449163536E-5,3201239.6788708339,5,7,{"$f":"VLOOKUP(AM10,AC5:AE12,2)","v":2.1094329388934128},{"$f":"VLOOKUP(AN10,AC5:AE12,3)","v":1.5023996012101533E-4},3.169211206173025E-6,31553592.832569469,5,5,{"$f":"VLOOKUP(AS10,AC5:AE12,2)","v":2.1094329388934128},{"$f":"VLOOKUP(AT10,AC5:AE12,3)","v":2.1841266241497518E-2},4.6072686436955592E-4,217048.3376020125,null,5,{"$f":"POISSON(AZ10,AZ4,FALSE)*100","v":{"$error":"#REF!"}},{"$f":"POISSON(AZ10,BC4,FALSE)*100","v":{"$error":"#REF!"}},5,7,5,{"$f":"VLOOKUP(BD10,AZ5:BB12,2)","v":{"$error":"#REF!"}},{"$f":"VLOOKUP(BE10,AZ5:BB12,3)","v":{"$error":"#REF!"}},{"$error":"#REF!"},{"$error":"#REF!"},5,7,{"$f":"VLOOKUP(BJ10,AZ5:BB12,2)","v":{"$error":"#REF!"}},{"$f":"VLOOKUP(BK10,AZ5:BB12,3)","v":{"$error":"#REF!"}},{"$error":"#REF!"},{"$error":"#REF!"},5,5,{"$f":"VLOOKUP(BP10,AZ5:BB12,2)","v":{"$error":"#REF!"}},{"$f":"VLOOKUP(BQ10,AZ5:BB12,3)","v":{"$error":"#REF!"}},{"$error":"#REF!"},{"$error":"#REF!"}]
[null,null,{"$f":"AVERAGE(Дома!L2:M11,Гости!L2:M11)","v":1.075},"Ср.Тот","Заб","Счет1","Счет2","Счет5","Счет6","Итог","1й Гол","ОЗ","Тотал1","Серия","ТБ2.5","Рейтинг","Мощь","Голы","Счет7",null,null,null,null,null,null,null,null,null,6,{"$f":"POISSON(AC11,AC4,FALSE)*100","v":0.59327801406377167},{"$f":"POISSON(AC11,AF4,FALSE)*100","v":1.9566134341341508E-3},6,7,6,{"$f":"VLOOKUP(AG11,AC5:AE12,2)","v":0.14302237839037371},{"$f":"VLOOKUP(AH11,AC5:AE12,3)","v":1.9566134341341508E-3},2.7983950694042308E-6,35734768.508325621,6,7,{"$f":"VLOOKUP(AM11,AC5:AE12,2)","v":0.59327801406377167},{"$f":"VLOOKUP(AN11,AC5:AE12,3)","v":1.5023996012101533E-4},8.9134065173616239E-7,112190552.29358044,6,6,{"$f":"VLOOKUP(AS11,AC5:AE12,2)","v":0.59327801406377167},{"$f":"VLOOKUP(AT11,AC5:AE12,3)","v":1.9566134341341508E-3},1.1608157324936053E-5,8614631.6939713676,null,6,{"$f":"POISSON(AZ11,AZ4,FALSE)*100","v":{"$error":"#REF!"}},{"$f":"POISSON(AZ11,BC4,FALSE)*100","v":{"$error":"#REF!"}},6,7,6,{"$f":"VLOOKUP(BD11,AZ5:BB12,2)","v":{"$error":"#REF!"}},{"$f":"VLOOKUP(BE11,AZ5:BB12,3)","v":{"$error":"#REF!"}},{"$error":"#REF!"},{"$error":"#REF!"},6,7,{"$f":"VLOOKUP(BJ11,AZ5:BB12,2)","v":{"$error":"#REF!"}},{"$f":"VLOOKUP(BK11,AZ5:BB12,3)","v":{"$error":"#REF!"}},{"$error":"#REF!"},{"$error":"#REF!"},6,6,{"$f":"VLOOKUP(BP11,AZ5:BB12,2)","v":{"$error":"#REF!"}},{"$f":"VLOOKUP(BQ11,AZ5:BB12,3)","v":{"$error":"#REF!"}},{"$error":"#REF!"},{"$error":"#REF!"}]
[null,null,"Хозяева",{"$f":"AVERAGE(K8,D8)+AVERAGE(T9,F9)-AVERAGE(1.25,C11)","v":1.6875},{"$f":"AVERAGE(K8,D8)","v":1.05},{"$f":"ROUND(AVERAGE(D12,E12),0)","v":1},{"$f":"ROUND(D12,0)","v":2},{"$f":"ROUND(SUM(Дома!L2:L8)/7,0)","v":1},{"$f":"ROUND(SUM(Дома!L2:L8)/7,0)","v":1},{"$f":"Дома!S11/Дома!T11","v":1.2222222222222223},{"$f":"IF(J12>J13,\"К1\",\"К2\")","v":"К1"},{"$f":"IF(M18>0.6,\"1\",\"0\")","v":"1"},{"$f":"((100/3.5)*D14)/100","v":0.63571428571428568},{"$f":"CONCATENATE(Дома!N2,Дома!N3,Дома!N4,Дома!N5,Дома!N6)","v":"ПВПВВ"},{"$f":"CONCATENATE(Q21,R21,S21,T21,U21)","v":"--+++"},{"$f":"(Q5/K5+X5/R5*1.1+K8-M8*1.1+R8*1.1-T8)/12.6","v":0.30000000000000004},{"$f":"(K8-M8+D8-F8)/2","v":0.3},{"$f":"IF(E12>0.6,\"Да\",\"Нет\")","v":"Да"},{"$f":"AC13-1","v":1},null,null,null,null,null,null,null,null,null,7,{"$f":"POISSON(AC12,AC4,FALSE)*100","v":0.14302237839037371},{"$f":"POISSON(AC12,AF4,FALSE)*100","v":1.5023996012101533E-4},7,6,0,{"$f":"VLOOKUP(AG12,AC5:AE12,2)","v":0.59327801406377167},{"$f":"VLOOKUP(AH12,AC5:AE12,3)","v":58.42069456117359},0.34659713649479257,288.51940616509523,0,6,{"$f":"VLOOKUP(AM12,AC5:AE12,2)","v":18.498139990730429},{"$f":"VLOOKUP(AN12,AC5:AE12,3)","v":1.9566134341341508E-3},3.6193709212357331E-4,276291.10742221965,7,7,{"$f":"VLOOKUP(AS12,AC5:AE12,2)","v":0.14302237839037371},{"$f":"VLOOKUP(AT12,AC5:AE12,3)","v":1.5023996012101533E-4},{"$f":"(AU12*AV12)/100","v":2.1487676425782512E-7},{"$f":"100/AW12","v":465383031.73633313},null,7,{"$f":"POISSON(AZ12,AZ4,FALSE)*100","v":{"$error":"#REF!"}},{"$f":"POISSON(AZ12,BC4,FALSE)*100","v":{"$error":"#REF!"}},7,6,0,{"$f":"VLOOKUP(BD12,AZ5:BB12,2)","v":{"$error":"#REF!"}},{"$f":"VLOOKUP(BE12,AZ5:BB12,3)","v":{"$error":"#REF!"}},{"$error":"#REF!"},{"$error":"#REF!"},0,6,{"$f":"VLOOKUP(BJ12,AZ5:BB12,2)","v":{"$error":"#REF!"}},{"$f":"VLOOKUP(BK12,AZ5:BB12,3)","v":{"$error":"#REF!"}},{"$error":"#REF!"},{"$error":"#REF!"},7,7,{"$f":"VLOOKUP(BP12,AZ5:BB12,2)","v":{"$error":"#REF!"}},{"$f":"VLOOKUP(BQ12,AZ5:BB12,3)","v":{"$error":"#REF!"}},{"$error":"#REF!"},{"$error":"#REF!"}]
[null,null,"Гости",{"$f":"AVERAGE(R9,D9)+AVERAGE(M8,F8)-AVERAGE(1.25,C11)","v":0.53749999999999987},{"$f":"AVERAGE(R9,D9)","v":0.95},{"$f":"ROUND(AVERAGE(D13,E13),0)","v":1},{"$f":"ROUND(D13,0)","v":1},{"$f":"ROUND(SUM(Гости!L2:L8)/7-1,0)","v":0},{"$f":"ROUND(SUM(Гости!L2:L8)/7,0)","v":1},{"$f":"Гости!S11/Гости!T11","v":0.6428571428571429},{"$f":"IF(M18>M20,\"К1\",\"К2\")","v":"К1"},{"$f":"IF(ROUND((V6/R6+P5/K5)/2,0)+M20>0.6,\"1\",\"0\")","v":"1"},{"$f":"IF(D14>2.85,IF(F12+F13>2,\"ТБ 2\",\"Нет\"),IF(D14<2.2,IF(F12+F13<3,\"ТМ 3\",\"Нет\"),\"Нет\"))","v":"Нет"},{"$f":"CONCATENATE(Гости!N2,Гости!N3,Гости!N4,Гости!N5,Гости!N6)","v":"ПППВП"},{"$f":"CONCATENATE(V21,W21,X21,Y21,Z21)","v":"+++--"},{"$f":"(Q6/K6+X6/R6*1.1+K9-M9*1.1+R9*1.1-T9)/12.6","v":6.6666666666666652E-2},{"$f":"(R9-T9+D8-F8)/2","v":-0.5},{"$f":"IF(E13>0.6,\"Да\",\"Нет\")","v":"Да"},{"$f":"AF13-1","v":0},null,null,null,null,null,null,null,null,null,{"$f":"MATCH(AD13,AD5:AD12,0)","v":2},{"$f":"MAX(AD5:AD12)","v":31.215611234357599},{"$f":"MAX(AE5:AE12)","v":58.42069456117359},{"$f":"MATCH(AE13,AE5:AE12,0)","v":1},6,1,{"$f":"VLOOKUP(AG13,AC5:AE12,2)","v":0.59327801406377167},{"$f":"VLOOKUP(AH13,AC5:AE12,3)","v":31.401123326630799},0.18629596086595096,536.78029053971215,1,6,{"$f":"VLOOKUP(AM13,AC5:AE12,2)","v":31.215611234357599},{"$f":"VLOOKUP(AN13,AC5:AE12,3)","v":1.9566134341341508E-3},6.1076884295853005E-4,163728.06365761161,null,null,null,null,null,null,null,{"$f":"MATCH(BA13,BA5:BA12,0)","v":{"$error":"#REF!"}},{"$f":"MAX(BA5:BA12)","v":{"$error":"#REF!"}},{"$f":"MAX(BB5:BB12)","v":{"$error":"#REF!"}},{"$f":"MATCH(BB13,BB5:BB12,0)","v":{"$error":"#REF!"}},6,1,{"$f":"VLOOKUP(BD13,AZ5:BB12,2)","v":{"$error":"#REF!"}},{"$f":"VLOOKUP(BE13,AZ5:BB12,3)","v":{"$error":"#REF!"}},{"$error":"#REF!"},{"$error":"#REF!"},1,6,{"$f":"VLOOKUP(BJ13,AZ5:BB12,2)","v":{"$error":"#REF!"}},{"$f":"VLOOKUP(BK13,AZ5:BB12,3)","v":{"$error":"#REF!"}},{"$error":"#REF!"},{"$error":"#REF!"}]
[null,null,null,{"$f":"D12+D13","v":2.2249999999999996},{"$f":"MATCH(F14,#REF!,0)","v":{"$error":"#REF!"}},{"$f":"Очные!A1","v":"Бадеран Тегеран"},null,{"$f":"COUNT(#REF!)","v":0},{"$f":"Очные!B1","v":"Эстеглал Моласани"},null,{"$f":"MATCH(I14,#REF!,0)","v":{"$error":"#REF!"}},{"$f":"IF(L12+L13=2,\"Да\",\"Нет\")","v":"Да"},null,null,null,{"$f":"(COUNTIF(Гости!AJ2:AJ11,\">2,5\")+COUNTIF(Дома!AJ2:AJ11,\">2,5\"))/COUNT(Дома!AJ2:AJ11,Гости!AJ2:AJ11)","v":0.5},null,null,null,null,null,null,null,null,null,null,null,null,null,null,null,null,6,2,{"$f":"VLOOKUP(AG14,AC5:AE12,2)","v":0.59327801406377167},{"$f":"VLOOKUP(AH14,AC5:AE12,3)","v":8.4390518940320227},5.0067039482724292E-2,1997.3220113105579,2,6,{"$f":"VLOOKUP(AM14,AC5:AE12,2)","v":26.338171978989227},{"$f":"VLOOKUP(AN14,AC5:AE12,3)","v":1.9566134341341508E-3},5.1533621124625966E-4,194048.07544605824,null,null,null,null,null,null,null,null,null,null,null,6,2,{"$f":"VLOOKUP(BD14,AZ5:BB12,2)","v":{"$error":"#REF!"}},{"$f":"VLOOKUP(BE14,AZ5:BB12,3)","v":{"$error":"#REF!"}},{"$error":"#REF!"},{"$error":"#REF!"},2,6,{"$f":"VLOOKUP(BJ14,AZ5:BB12,2)","v":{"$error":"#REF!"}},{"$f":"VLOOKUP(BK14,AZ5:BB12,3)","v":{"$error":"#REF!"}},{"$error":"#REF!"},{"$error":"#REF!"}]
[null,null,null,null,null,null,null,null,null,null,null,null,null,null,null,null,null,null,null,null,null,null,null,null,null,null,null,null,"Пуассон",null,null,null,6,3,{"$f":"VLOOKUP(AG15,AC5:AE12,2)","v":0.59327801406377167},{"$f":"VLOOKUP(AH15,AC5:AE12,3)","v":1.5119967976807374},8.9703445739881035E-3,11147.843784058927,3,6,{"$f":"VLOOKUP(AM15,AC5:AE12,2)","v":14.815221738181444},{"$f":"VLOOKUP(AN15,AC5:AE12,3)","v":1.9566134341341508E-3},2.8987661882602119E-4,344974.35634854785,null,null,null,null,null,null,null,"Пуассон",null,null,null,6,3,{"$f":"VLOOKUP(BD15,AZ5:BB12,2)","v":{"$error":"#REF!"}},{"$f":"VLOOKUP(BE15,AZ5:BB12,3)","v":{"$error":"#REF!"}},{"$error":"#REF!"},{"$error":"#REF!"},3,6,{"$f":"VLOOKUP(BJ15,AZ5:BB12,2)","v":{"$error":"#REF!"}},{"$f":"VLOOKUP(BK15,AZ5:BB12,3)","v":{"$error":"#REF!"}},{"$error":"#REF!"},{"$error":"#REF!"}]
[null,null,null,null,"Миллер",null,null,null,null,null,null,null,null,null,null,null,"EW-легкая победа, W-победа простая, D-ничья, L-проигрыш, HL-позорный проигрыш",null,null,null,null,null,null,null,null,null,null,null,"ИД","%","КФ",null,6,4,{"$f":"VLOOKUP(AG16,AC5:AE12,2)","v":0.59327801406377167},{"$f":"VLOOKUP(AH16,AC5:AE12,3)","v":0.20317456968834899},1.2053900521296506E-3,82960.697927880436,4,6,{"$f":"VLOOKUP(AM16,AC5:AE12,2)","v":6.2501716707952975},{"$f":"VLOOKUP(AN16,AC5:AE12,3)","v":1.9566134341341508E-3},1.222916985672277E-4,817716.99282618728,null,null,null,null,null,null,null,"ИД","%","КФ",null,6,4,{"$f":"VLOOKUP(BD16,AZ5:BB12,2)","v":{"$error":"#REF!"}},{"$f":"VLOOKUP(BE16,AZ5:BB12,3)","v":{"$error":"#REF!"}},{"$error":"#REF!"},{"$error":"#REF!"},4,6,{"$f":"VLOOKUP(BJ16,AZ5:BB12,2)","v":{"$error":"#REF!"}},{"$f":"VLOOKUP(BK16,AZ5:BB12,3)","v":{"$error":"#REF!"}},{"$error":"#REF!"},{"$error":"#REF!"}]
[null,null,null,null,1,2,3,4,"Max","Min","Расчет",null,null,"Счет3","Счет4",null,1,2,3,4,5,1,2,3,4,5,null,null,1,{"$f":"SUM(AK5:AK32)","v":65.532558088778842},{"$f":"100/AD17","v":1.5259590486995354},null,6,5,{"$f":"VLOOKUP(AG17,AC5:AE12,2)","v":0.59327801406377167},{"$f":"VLOOKUP(AH17,AC5:AE12,3)","v":2.1841266241497518E-2},1.2957943060393746E-4,771727.42258493416,5,6,{"$f":"VLOOKUP(AM17,AC5:AE12,2)","v":2.1094329388934128},{"$f":"VLOOKUP(AN17,AC5:AE12,3)","v":1.9566134341341508E-3},4.1273448266439345E-5,2422865.1639294443,null,null,null,null,null,null,null,1,{"$f":"SUM(BH5:BH32)","v":{"$error":"#REF!"}},{"$f":"100/BA17","v":{"$error":"#REF!"}},null,6,5,{"$f":"VLOOKUP(BD17,AZ5:BB12,2)","v":{"$error":"#REF!"}},{"$f":"VLOOKUP(BE17,AZ5:BB12,3)","v":{"$error":"#REF!"}},{"$error":"#REF!"},{"$error":"#REF!"},5,6,{"$f":"VLOOKUP(BJ17,AZ5:BB12,2)","v":{"$error":"#REF!"}},{"$f":"VLOOKUP(BK17,AZ5:BB12,3)","v":{"$error":"#REF!"}},{"$error":"#REF!"},{"$error":"#REF!"}]
[null,null,"Сила Атаки1",null,{"$f":"Дома!L2","v":0},{"$f":"Дома!L3","v":1},{"$f":"Дома!L4","v":1},{"$f":"Дома!L5","v":2},{"$f":"MAX(E18:H18)","v":2},{"$f":"MIN(E18:H18)","v":0},{"$f":"E18+F18+G18+H18-I18-J18","v":2},{"$f":"K18/2","v":1},{"$f":"L18+L21-1.5","v":1.5},{"$f":"ROUNDDOWN(M18,0)","v":1},{"$f":"ROUNDUP(M18,0)","v":2},null,{"$f":"IF(Дома!N2=\"В\",IF(Дома!L2-Дома!M2>1,\"EW\",\"W\"),\"\")","v":""},{"$f":"IF(Дома!N3=\"В\",IF(Дома!L3-Дома!M3>1,\"EW\",\"W\"),\"\")","v":"W"},{"$f":"IF(Дома!N4=\"В\",IF(Дома!L4-Дома!M4>1,\"EW\",\"W\"),\"\")","v":""},{"$f":"IF(Дома!N5=\"В\",IF(Дома!L5-Дома!M5>1,\"EW\",\"W\"),\"\")","v":"W"},{"$f":"IF(Дома!N6=\"В\",IF(Дома!L6-Дома!M6>1,\"EW\",\"W\"),\"\")","v":"W"},{"$f":"IF(Гости!N2=\"В\",IF(Гости!L2-Гости!M2>1,\"EW\",\"W\"),\"\")","v":""},{"$f":"IF(Гости!N3=\"В\",IF(Гости!L3-Гости!M3>1,\"EW\",\"W\"),\"\")","v":""},{"$f":"IF(Гости!N4=\"В\",IF(Гости!L4-Гости!M4>1,\"EW\",\"W\"),\"\")","v":""},{"$f":"IF(Гости!N5=\"В\",IF(Гости!L5-Гости!M5>1,\"EW\",\"W\"),\"\")","v":"W"},{"$f":"IF(Гости!N6=\"В\",IF(Гости!L6-Гости!M6>1,\"EW\",\"W\"),\"\")","v":""},null,null,"Х",{"$f":"SUM(AW5:AW12)","v":23.068663433137463},4.3348848662100172,null,5,0,{"$f":"VLOOKUP(AG18,AC5:AE12,2)","v":2.1094329388934128},{"$f":"VLOOKUP(AH18,AC5:AE12,3)","v":58.42069456117359},1.2323453742037083,81.146082983932942,0,5,{"$f":"VLOOKUP(AM18,AC5:AE12,2)","v":18.498139990730429},{"$f":"VLOOKUP(AN18,AC5:AE12,3)","v":2.1841266241497518E-2},4.0402280051003575E-3,24751.078373240482,null,null,null,null,null,null,null,"Х",{"$f":"SUM(BT5:BT12)","v":{"$error":"#REF!"}},{"$error":"#REF!"},null,5,0,{"$f":"VLOOKUP(BD18,AZ5:BB12,2)","v":{"$error":"#REF!"}},{"$f":"VLOOKUP(BE18,AZ5:BB12,3)","v":{"$error":"#REF!"}},{"$error":"#REF!"},{"$error":"#REF!"},0,5,{"$f":"VLOOKUP(BJ18,AZ5:BB12,2)","v":{"$error":"#REF!"}},{"$f":"VLOOKUP(BK18,AZ5:BB12,3)","v":{"$error":"#REF!"}},{"$error":"#REF!"},{"$error":"#REF!"}]
[null,null,"Сила Обороны1",null,{"$f":"Дома!M2","v":2},{"$f":"Дома!M3","v":0},{"$f":"Дома!M4","v":2},{"$f":"Дома!M5","v":1},{"$f":"MAX(E19:H19)","v":2},{"$f":"MIN(E19:H19)","v":0},{"$f":"E19+F19+G19+H19-I19-J19","v":3},{"$f":"K19/2","v":1.5},null,null,null,null,{"$f":"IF(Дома!N2=\"П\",IF(Дома!L2-Дома!M2<1,\"HL\",\"L\"),\"D\")","v":"HL"},{"$f":"IF(Дома!N3=\"П\",IF(Дома!L3-Дома!M3<1,\"HL\",\"L\"),\"D\")","v":"D"},{"$f":"IF(Дома!N4=\"П\",IF(Дома!L4-Дома!M4<1,\"HL\",\"L\"),\"D\")","v":"HL"},{"$f":"IF(Дома!N5=\"П\",IF(Дома!L5-Дома!M5<1,\"HL\",\"L\"),\"D\")","v":"D"},{"$f":"IF(Дома!N6=\"П\",IF(Дома!L6-Дома!M6<1,\"HL\",\"L\"),\"D\")","v":"D"},{"$f":"IF(Гости!N2=\"П\",IF(Гости!L2-Гости!M2<1,\"HL\",\"L\"),\"D\")","v":"HL"},{"$f":"IF(Гости!N3=\"П\",IF(Гости!L3-Гости!M3<1,\"HL\",\"L\"),\"D\")","v":"HL"},{"$f":"IF(Гости!N4=\"П\",IF(Гости!L4-Гости!M4<1,\"HL\",\"L\"),\"D\")","v":"HL"},{"$f":"IF(Гости!N5=\"П\",IF(Гости!L5-Гости!M5<1,\"HL\",\"L\"),\"D\")","v":"D"},{"$f":"IF(Гости!N6=\"П\",IF(Гости!L6-Гости!M6<1,\"HL\",\"L\"),\"D\")","v":"HL"},null,null,2,{"$f":"SUM(AQ5:AQ32)","v":11.361817695291666},8.8014086022027946,null,5,1,{"$f":"VLOOKUP(AG19,AC5:AE12,2)","v":2.1094329388934128},{"$f":"VLOOKUP(AH19,AC5:AE12,3)","v":31.401123326630799},0.66238563863449296,150.9694567142939,1,5,{"$f":"VLOOKUP(AM19,AC5:AE12,2)","v":31.215611234357599},{"$f":"VLOOKUP(AN19,AC5:AE12,3)","v":2.1841266241497518E-2},6.8178847586068524E-3,14667.305702661029,null,null,null,null,null,null,null,2,{"$f":"SUM(BN5:BN32)","v":{"$error":"#REF!"}},{"$error":"#REF!"},null,5,1,{"$f":"VLOOKUP(BD19,AZ5:BB12,2)","v":{"$error":"#REF!"}},{"$f":"VLOOKUP(BE19,AZ5:BB12,3)","v":{"$error":"#REF!"}},{"$error":"#REF!"},{"$error":"#REF!"},1,5,{"$f":"VLOOKUP(BJ19,AZ5:BB12,2)","v":{"$error":"#REF!"}},{"$f":"VLOOKUP(BK19,AZ5:BB12,3)","v":{"$error":"#REF!"}},{"$error":"#REF!"},{"$error":"#REF!"}]
[null,null,"Сила Атаки2",null,{"$f":"Гости!L2","v":2},{"$f":"Гости!L3","v":1},{"$f":"Гости!L4","v":1},{"$f":"Гости!L5","v":1},{"$f":"MAX(E20:H20)","v":2},{"$f":"MIN(E20:H20)","v":1},{"$f":"E20+F20+G20+H20-I20-J20","v":2},{"$f":"K20/2","v":1},{"$f":"L20+L19-1.5","v":1},{"$f":"ROUNDDOWN(M20,0)","v":1},{"$f":"ROUNDUP(M20,0)","v":1},null,{"$f":"IF(Q18=\"\",Q19,Q18)","v":"HL"},"W","HL","W","W","HL","HL","HL","W","HL",null,null,"ТБ1.5",{"$f":"100-AD21","v":65.148257490267554},1.5349604709679137,null,5,2,{"$f":"VLOOKUP(AG20,AC5:AE12,2)","v":2.1094329388934128},{"$f":"VLOOKUP(AH20,AC5:AE12,3)","v":8.4390518940320227},0.17801614038301991,561.74681568109372,2,5,{"$f":"VLOOKUP(AM20,AC5:AE12,2)","v":26.338171978989227},{"$f":"VLOOKUP(AN20,AC5:AE12,3)","v":2.1841266241497518E-2},5.7525902650745328E-3,17383.473425376033,null,null,null,null,null,null,null,"ТБ1.5",{"$f":"100-BA21","v":{"$error":"#REF!"}},{"$error":"#REF!"},null,5,2,{"$f":"VLOOKUP(BD20,AZ5:BB12,2)","v":{"$error":"#REF!"}},{"$f":"VLOOKUP(BE20,AZ5:BB12,3)","v":{"$error":"#REF!"}},{"$error":"#REF!"},{"$error":"#REF!"},2,5,{"$f":"VLOOKUP(BJ20,AZ5:BB12,2)","v":{"$error":"#REF!"}},{"$f":"VLOOKUP(BK20,AZ5:BB12,3)","v":{"$error":"#REF!"}},{"$error":"#REF!"},{"$error":"#REF!"}]
[null,null,"Сила Обороны2",null,{"$f":"Гости!M2","v":3},{"$f":"Гости!M3","v":2},{"$f":"Гости!M4","v":2},{"$f":"Гости!M5","v":0},{"$f":"MAX(E21:H21)","v":3},{"$f":"MIN(E21:H21)","v":0},{"$f":"E21+F21+G21+H21-I21-J21","v":4},{"$f":"K21/2","v":2},null,null,null,null,{"$f":"IF(Дома!L2+Дома!M2>2,\"+\",\"-\")","v":"-"},{"$f":"IF(Дома!L3+Дома!M3>2,\"+\",\"-\")","v":"-"},{"$f":"IF(Дома!L4+Дома!M4>2,\"+\",\"-\")","v":"+"},{"$f":"IF(Дома!L5+Дома!M5>2,\"+\",\"-\")","v":"+"},{"$f":"IF(Дома!L6+Дома!M6>2,\"+\",\"-\")","v":"+"},{"$f":"IF(Гости!L2+Гости!M2>2,\"+\",\"-\")","v":"+"},{"$f":"IF(Гости!L3+Гости!M3>2,\"+\",\"-\")","v":"+"},{"$f":"IF(Гости!L4+Гости!M4>2,\"+\",\"-\")","v":"+"},{"$f":"IF(Гости!L5+Гости!M5>2,\"+\",\"-\")","v":"-"},{"$f":"IF(Гости!L6+Гости!M6>2,\"+\",\"-\")","v":"-"},null,null,"ТМ1.5",{"$f":"SUM(AK32+AQ32+AW5)","v":34.851742509732439},2.8692969934595016,null,5,3,{"$f":"VLOOKUP(AG21,AC5:AE12,2)","v":2.1094329388934128},{"$f":"VLOOKUP(AH21,AC5:AE12,3)","v":1.5119967976807374},3.1894558485291068E-2,3135.3310642665697,3,5,{"$f":"VLOOKUP(AM21,AC5:AE12,2)","v":14.815221738181444},{"$f":"VLOOKUP(AN21,AC5:AE12,3)","v":2.1841266241497518E-2},3.235832024104426E-3,30903.952756224044,null,null,null,null,null,null,null,"ТМ1.5",{"$f":"SUM(BH32+BN32+BT5)","v":{"$error":"#REF!"}},{"$error":"#REF!"},null,5,3,{"$f":"VLOOKUP(BD21,AZ5:BB12,2)","v":{"$error":"#REF!"}},{"$f":"VLOOKUP(BE21,AZ5:BB12,3)","v":{"$error":"#REF!"}},{"$error":"#REF!"},{"$error":"#REF!"},3,5,{"$f":"VLOOKUP(BJ21,AZ5:BB12,2)","v":{"$error":"#REF!"}},{"$f":"VLOOKUP(BK21,AZ5:BB12,3)","v":{"$error":"#REF!"}},{"$error":"#REF!"},{"$error":"#REF!"}]
[null,null,null,null,null,null,null,null,null,null,null,null,null,null,null,null,null,null,null,null,null,null,null,null,null,null,null,null,"ТБ2.5",{"$f":"100-AD23","v":38.398194271314978},2.6042891312392804,null,5,4,{"$f":"VLOOKUP(AG22,AC5:AE12,2)","v":2.1094329388934128},{"$f":"VLOOKUP(AH22,AC5:AE12,3)","v":0.20317456968834899},4.2858312964609855E-3,23332.696292216344,4,5,{"$f":"VLOOKUP(AM22,AC5:AE12,2)","v":6.2501716707952975},{"$f":"VLOOKUP(AN22,AC5:AE12,3)","v":2.1841266241497518E-2},1.3651166351690547E-3,73253.813940679218,null,null,null,null,null,null,null,"ТБ2.5",{"$f":"100-BA23","v":{"$error":"#REF!"}},{"$error":"#REF!"},null,5,4,{"$f":"VLOOKUP(BD22,AZ5:BB12,2)","v":{"$error":"#REF!"}},{"$f":"VLOOKUP(BE22,AZ5:BB12,3)","v":{"$error":"#REF!"}},{"$error":"#REF!"},{"$error":"#REF!"},4,5,{"$f":"VLOOKUP(BJ22,AZ5:BB12,2)","v":{"$error":"#REF!"}},{"$f":"VLOOKUP(BK22,AZ5:BB12,3)","v":{"$error":"#REF!"}},{"$error":"#REF!"},{"$error":"#REF!"}]
[null,null,null,"Индикатор ТБ2.5",null,null,null,null,null,"Среднее за 5 матчей Д/Г",null,null,"Расчет силы атаки/обороны 10 матчей",null,null,null,null,null,null,1,{"$f":"L5/K5/(L5/K5+M5/K5+S6/R6+T6/R6)","v":0.74999999999999989},{"$f":"E5/D5/(E5/D5+F5/D5+E6/D6+F6/D6)","v":0.55555555555555558},{"$f":"AVERAGE(U23,V23)","v":0.65277777777777768},null,null,null,null,null,"ТМ2.5",{"$f":"SUM(AK32+AK30+AQ30+AQ32+AW5+AW6)","v":61.601805728685022},1.6233290374706462,null,4,0,{"$f":"VLOOKUP(AG23,AC5:AE12,2)","v":6.2501716707952975},{"$f":"VLOOKUP(AH23,AC5:AE12,3)","v":58.42069456117359},3.651393701344321,27.386803007077365,0,4,{"$f":"VLOOKUP(AM23,AC5:AE12,2)","v":18.498139990730429},{"$f":"VLOOKUP(AN23,AC5:AE12,3)","v":0.20317456968834899},3.7583516326514951E-2,2660.7409251233521,null,null,null,null,null,null,null,"ТМ2.5",{"$f":"SUM(BH32+BH30+BN30+BN32+BT5+BT6)","v":{"$error":"#REF!"}},{"$error":"#REF!"},null,4,0,{"$f":"VLOOKUP(BD23,AZ5:BB12,2)","v":{"$error":"#REF!"}},{"$f":"VLOOKUP(BE23,AZ5:BB12,3)","v":{"$error":"#REF!"}},{"$error":"#REF!"},{"$error":"#REF!"},0,4,{"$f":"VLOOKUP(BJ23,AZ5:BB12,2)","v":{"$error":"#REF!"}},{"$f":"VLOOKUP(BK23,AZ5:BB12,3)","v":{"$error":"#REF!"}},{"$error":"#REF!"},{"$error":"#REF!"}]
[null,null,null,"Заб","Проп","Набр","Потер",null,null,"Тотал","Заб","Проп","ЗабО","ЗабДГ","ПропО","ПропДГ","Атака","Оборона",null,"X",{"$f":"(M5/K5+T6/R6)/(L5/K5+M5/K5+S6/R6+T6/R6)","v":0.25},{"$f":"(F5/D5+F6/D6)/(E5/D5+F5/D5+E6/D6+F6/D6)","v":0.11111111111111113},{"$f":"AVERAGE(U24,V24)","v":0.18055555555555558},null,null,null,null,null,"ТБ3.5",{"$f":"100-AD25","v":18.558564050591798},5.3883479199895961,null,4,1,{"$f":"VLOOKUP(AG24,AC5:AE12,2)","v":6.2501716707952975},{"$f":"VLOOKUP(AH24,AC5:AE12,3)","v":31.401123326630799},1.9626241144725722,50.952191641074172,1,4,{"$f":"VLOOKUP(AM24,AC5:AE12,2)","v":31.215611234357599},{"$f":"VLOOKUP(AN24,AC5:AE12,3)","v":0.20317456968834899},6.3422183800993973E-2,1576.7353630360608,null,null,null,null,null,null,null,"ТБ3.5",{"$f":"100-BA25","v":{"$error":"#REF!"}},{"$error":"#REF!"},null,4,1,{"$f":"VLOOKUP(BD24,AZ5:BB12,2)","v":{"$error":"#REF!"}},{"$f":"VLOOKUP(BE24,AZ5:BB12,3)","v":{"$error":"#REF!"}},{"$error":"#REF!"},{"$error":"#REF!"},1,4,{"$f":"VLOOKUP(BJ24,AZ5:BB12,2)","v":{"$error":"#REF!"}},{"$f":"VLOOKUP(BK24,AZ5:BB12,3)","v":{"$error":"#REF!"}},{"$error":"#REF!"},{"$error":"#REF!"}]
[null,null,"Хозяева",{"$f":"Дома!Z6*1.5+Дома!AG6*2","v":10.5},{"$f":"Дома!AA6*1.5+Дома!AH6","v":6.5},{"$f":"D25/5","v":2.1},{"$f":"E25/5","v":1.3},null,"Хозяева",{"$f":"SUM(ДомаДома!L2:M6)/5","v":1.6},{"$f":"SUM(ДомаДома!L2:L6)/5","v":1},{"$f":"SUM(ДомаДома!M2:M6)/5","v":0.6},{"$f":"(SUM(Дома!L2:L11)/10)","v":1.1000000000000001},{"$f":"(SUM(ДомаДома!L2:L11)/10)","v":1.3},{"$f":"(SUM(Дома!M2:M11)/10)","v":0.9},{"$f":"(SUM(ДомаДома!M2:M11)/10)","v":0.8},{"$f":"((M25+N25)/2)/((O26+P26)/2)","v":0.7272727272727274},{"$f":"((O25+P25)/2)/((M26+N26)/2)","v":0.85000000000000009},null,2,{"$f":"S6/R6/(L5/K5+M5/K5+S6/R6+T6/R6)","v":0},{"$f":"E6/D6/(E5/D5+F5/D5+E6/D6+F6/D6)","v":0.33333333333333337},{"$f":"AVERAGE(U25,V25)","v":0.16666666666666669},null,null,null,null,null,"ТМ3.5",{"$f":"SUM(AK32+AK31+AK30+AK27+AQ32+AQ31+AQ30+AQ27+AW5+AW6)","v":81.441435949408202},1.2278761889969678,null,4,2,{"$f":"VLOOKUP(AG25,AC5:AE12,2)","v":6.2501716707952975},{"$f":"VLOOKUP(AH25,AC5:AE12,3)","v":8.4390518940320227},0.52745523076450351,189.58955029236913,2,4,{"$f":"VLOOKUP(AM25,AC5:AE12,2)","v":26.338171978989227},{"$f":"VLOOKUP(AN25,AC5:AE12,3)","v":0.20317456968834899},5.351246758208867E-2,1868.7233932279237,null,null,null,null,null,null,null,"ТМ3.5",{"$f":"SUM(BH32+BH31+BH30+BH27+BN32+BN31+BN30+BN27+BT5+BT6)","v":{"$error":"#REF!"}},{"$error":"#REF!"},null,4,2,{"$f":"VLOOKUP(BD25,AZ5:BB12,2)","v":{"$error":"#REF!"}},{"$f":"VLOOKUP(BE25,AZ5:BB12,3)","v":{"$error":"#REF!"}},{"$error":"#REF!"},{"$error":"#REF!"},2,4,{"$f":"VLOOKUP(BJ25,AZ5:BB12,2)","v":{"$error":"#REF!"}},{"$f":"VLOOKUP(BK25,AZ5:BB12,3)","v":{"$error":"#REF!"}},{"$error":"#REF!"},{"$error":"#REF!"}]
[null,null,"Гости",{"$f":"Гости!Z6*1.5+Гости!AG6*2","v":9},{"$f":"Гости!AA6*1.5+Гости!AH6","v":9},{"$f":"D26/5","v":1.8},{"$f":"E26/5","v":1.8},null,"Гости",{"$f":"SUM(ГостиГости!L2:M6)/5","v":3.2},{"$f":"SUM(ГостиГости!L2:L6)/5","v":1},{"$f":"SUM(ГостиГости!M2:M6)/5","v":2.2000000000000002},{"$f":"(SUM(Гости!L2:L11)/10)","v":0.9},{"$f":"(SUM(ГостиГости!L2:L11)/10)","v":1.1000000000000001},{"$f":"(SUM(Гости!M2:M11)/10)","v":1.4},{"$f":"(SUM(ГостиГости!M2:M11)/10)","v":1.9},{"$f":"((M26+N26)/2)/((O25+P25)/2)","v":1.1764705882352939},{"$f":"((O26+P26)/2)/((M25+N25)/2)","v":1.3749999999999998},null,null,null,null,{"$f":"IF(AND(W23-W25>0.27,F12>F13),\"П1\",IF(AND(W23>W25,F12>=F13),\"1Х\",IF(AND(W25-W23>0.12,F13>0),\"П2\",IF(AND(W25>W23,F13>=F12),\"Х2\",\"\"))))","v":"1Х"},null,null,null,null,null,"К1 Заб",{"$f":"100-AD27","v":81.501861994334348},1.2269658330867528,null,4,3,{"$f":"VLOOKUP(AG26,AC5:AE12,2)","v":6.2501716707952975},{"$f":"VLOOKUP(AH26,AC5:AE12,3)","v":1.5119967976807374},9.4502395511973536E-2,1058.1742341899674,3,4,{"$f":"VLOOKUP(AM26,AC5:AE12,2)","v":14.815221738181444},{"$f":"VLOOKUP(AN26,AC5:AE12,3)","v":0.20317456968834899},3.0100763014924883E-2,3322.1749212940858,null,null,null,null,null,null,null,"К1 Заб",{"$f":"100-BA27","v":{"$error":"#REF!"}},{"$error":"#REF!"},null,4,3,{"$f":"VLOOKUP(BD26,AZ5:BB12,2)","v":{"$error":"#REF!"}},{"$f":"VLOOKUP(BE26,AZ5:BB12,3)","v":{"$error":"#REF!"}},{"$error":"#REF!"},{"$error":"#REF!"},3,4,{"$f":"VLOOKUP(BJ26,AZ5:BB12,2)","v":{"$error":"#REF!"}},{"$f":"VLOOKUP(BK26,AZ5:BB12,3)","v":{"$error":"#REF!"}},{"$error":"#REF!"},{"$error":"#REF!"}]
[null,null,{"$f":"((F25+G26)/2+(F26+G25)/2)/2","v":1.75},null,null,null,null,null,null,null,null,null,null,null,null,null,null,null,null,null,null,null,null,null,null,null,null,null,"К1 НЗ",{"$f":"SUM(AQ32+AQ30+AQ27+AQ23+AQ18+AQ12+AQ5+AW5)","v":18.498138005665659},5.4059495052621909,null,3,0,{"$f":"VLOOKUP(AG27,AC5:AE12,2)","v":14.815221738181444},{"$f":"VLOOKUP(AH27,AC5:AE12,3)","v":58.42069456117359},8.6551554402235737,11.553807518610766,0,3,{"$f":"VLOOKUP(AM27,AC5:AE12,2)","v":18.498139990730429},{"$f":"VLOOKUP(AN27,AC5:AE12,3)","v":1.5119967976807374},0.27969128429034396,357.53706181345029,null,null,null,null,null,null,null,"К1 НЗ",{"$f":"SUM(BN32+BN30+BN27+BN23+BN18+BN12+BN5+BT5)","v":{"$error":"#REF!"}},{"$error":"#REF!"},null,3,0,{"$f":"VLOOKUP(BD27,AZ5:BB12,2)","v":{"$error":"#REF!"}},{"$f":"VLOOKUP(BE27,AZ5:BB12,3)","v":{"$error":"#REF!"}},{"$error":"#REF!"},{"$error":"#REF!"},0,3,{"$f":"VLOOKUP(BJ27,AZ5:BB12,2)","v":{"$error":"#REF!"}},{"$f":"VLOOKUP(BK27,AZ5:BB12,3)","v":{"$error":"#REF!"}},{"$error":"#REF!"},{"$error":"#REF!"}]
[null,null,{"$f":"IF(C27>2.25,\"ТБ 2,5\",\"Нет ставки\")","v":"Нет ставки"},null,null,null,null,null,null,null,null,null,null,null,null,null,null,null,null,null,null,null,null,null,null,null,null,null,"К2 Заб",{"$f":"100-AD29","v":41.60089191794777},2.4037946156836423,null,3,1,{"$f":"VLOOKUP(AG28,AC5:AE12,2)","v":14.815221738181444},{"$f":"VLOOKUP(AH28,AC5:AE12,3)","v":31.401123326630799},4.6521460491201703,21.495455848578171,1,3,{"$f":"VLOOKUP(AM28,AC5:AE12,2)","v":31.215611234357599},{"$f":"VLOOKUP(AN28,AC5:AE12,3)","v":1.5119967976807374},0.47197904223995535,211.87381440797057,null,null,null,null,null,null,null,"К2 Заб",{"$f":"100-BA29","v":{"$error":"#REF!"}},{"$error":"#REF!"},null,3,1,{"$f":"VLOOKUP(BD28,AZ5:BB12,2)","v":{"$error":"#REF!"}},{"$f":"VLOOKUP(BE28,AZ5:BB12,3)","v":{"$error":"#REF!"}},{"$error":"#REF!"},{"$error":"#REF!"},1,3,{"$f":"VLOOKUP(BJ28,AZ5:BB12,2)","v":{"$error":"#REF!"}},{"$f":"VLOOKUP(BK28,AZ5:BB12,3)","v":{"$error":"#REF!"}},{"$error":"#REF!"},{"$error":"#REF!"}]
[null,null,null,null,null,null,null,null,null,null,null,null,null,null,null,null,null,null,null,null,null,null,null,null,null,null,null,null,"К2 НЗ",{"$f":"SUM(AK32+AK30+AK27+AK23+AK18+AK12+AK5+AW5)","v":58.39910808205223},1.712354919179544,null,3,2,{"$f":"VLOOKUP(AG29,AC5:AE12,2)","v":14.815221738181444},{"$f":"VLOOKUP(AH29,AC5:AE12,3)","v":8.4390518940320227},1.2502642507010451,79.983091529593239,2,3,{"$f":"VLOOKUP(AM29,AC5:AE12,2)","v":26.338171978989227},{"$f":"VLOOKUP(AN29,AC5:AE12,3)","v":1.5119967976807374},0.39823231688996236,251.10970596500212,null,null,null,null,null,null,null,"К2 НЗ",{"$f":"SUM(BH32+BH30+BH27+BH23+BH18+BH12+BH5+BT5)","v":{"$error":"#REF!"}},{"$error":"#REF!"},null,3,2,{"$f":"VLOOKUP(BD29,AZ5:BB12,2)","v":{"$error":"#REF!"}},{"$f":"VLOOKUP(BE29,AZ5:BB12,3)","v":{"$error":"#REF!"}},{"$error":"#REF!"},{"$error":"#REF!"},2,3,{"$f":"VLOOKUP(BJ29,AZ5:BB12,2)","v":{"$error":"#REF!"}},{"$f":"VLOOKUP(BK29,AZ5:BB12,3)","v":{"$error":"#REF!"}},{"$error":"#REF!"},{"$error":"#REF!"}]
[null,null,"1Х2",null,null,null,{"$f":"IF(E34=G34,\"Х\",IF(E34>G34,LOOKUP(MAX(E34:G34)-MIN(E34:G34),{0;0.2;0.4},{\"1Х\";\"П1\";\"П1\"}),LOOKUP(MAX(E34:G34)-MIN(E34:G35),{0;0.2;0.4},{\"Х2\";\"П2\";\"П2\"})))","v":"П1"},"Тотал",null,null,null,"Обе забьют",null,null,null,null,"Очные всречи (5 матчей)",null,null,null,null,null,null,null,null,null,null,null,"ОЗ",{"$f":"100-AD31","v":33.909495775765038},2.9490264515071187,null,2,0,{"$f":"VLOOKUP(AG30,AC5:AE12,2)","v":26.338171978989227},{"$f":"VLOOKUP(AH30,AC5:AE12,3)","v":58.42069456117359},15.386943004841905,6.4990167292185577,0,2,{"$f":"VLOOKUP(AM30,AC5:AE12,2)","v":18.498139990730429},{"$f":"VLOOKUP(AN30,AC5:AE12,3)","v":8.4390518940320227},1.5610676332484315,64.058723574909834,null,null,null,null,null,null,null,"ОЗ",{"$f":"100-BA31","v":{"$error":"#REF!"}},{"$error":"#REF!"},null,2,0,{"$f":"VLOOKUP(BD30,AZ5:BB12,2)","v":{"$error":"#REF!"}},{"$f":"VLOOKUP(BE30,AZ5:BB12,3)","v":{"$error":"#REF!"}},{"$error":"#REF!"},{"$error":"#REF!"},0,2,{"$f":"VLOOKUP(BJ30,AZ5:BB12,2)","v":{"$error":"#REF!"}},{"$f":"VLOOKUP(BK30,AZ5:BB12,3)","v":{"$error":"#REF!"}},{"$error":"#REF!"},{"$error":"#REF!"}]
[null,null,null,null,"маржа(%):",null,{"$f":"(E35+F35+G35)-1","v":0.10082752613240409},"маржа(%):",null,null,{"$f":"(J35+K35)-1","v":6.0291060291060239E-2},"маржа(%):",null,null,{"$f":"(N35+O35)-1","v":8.3333333333333259E-2},null,"команды","В","Н","П","Забито","Пропущено","итог","очки",null,null,null,null,"ОНЗ",{"$f":"SUM(AK32+AK30+AK27+AK23+AK18+AK12+AK5+AQ5+AQ12+AQ18+AQ23+AQ27+AQ30+AQ32+AW5)","v":66.090504224234962},1.5130766692400366,null,2,1,{"$f":"VLOOKUP(AG31,AC5:AE12,2)","v":26.338171978989227},{"$f":"VLOOKUP(AH31,AC5:AE12,3)","v":31.401123326630799},8.2704818651025231,12.091193914825224,1,2,{"$f":"VLOOKUP(AM31,AC5:AE12,2)","v":31.215611234357599},{"$f":"VLOOKUP(AN31,AC5:AE13,3)","v":8.4390518940320227},2.6343016311067275,37.960725081428059,null,null,null,null,null,null,null,"ОНЗ",{"$f":"SUM(BH32+BH30+BH27+BH23+BH18+BH12+BH5+BN5+BN12+BN18+BN23+BN27+BN30+BN32+BT5)","v":{"$error":"#REF!"}},{"$error":"#REF!"},null,2,1,{"$f":"VLOOKUP(BD31,AZ5:BB12,2)","v":{"$error":"#REF!"}},{"$f":"VLOOKUP(BE31,AZ5:BB12,3)","v":{"$error":"#REF!"}},{"$error":"#REF!"},{"$error":"#REF!"},1,2,{"$f":"VLOOKUP(BJ31,AZ5:BB12,2)","v":{"$error":"#REF!"}},{"$f":"VLOOKUP(BK31,AZ5:BB13,3)","v":{"$error":"#REF!"}},{"$error":"#REF!"},{"$error":"#REF!"}]
[null,null,"Линия:",null,"П1","Х","П2","Линия:",null,"ТБ 2,5","ТМ 2,5","Линия:",null,"ОЗ-да","ОЗ-нет",null,"1К",{"$f":"Очные!J6","v":""},{"$f":"Очные!K6","v":""},{"$f":"Очные!L6","v":""},{"$f":"Очные!H6","v":""},{"$f":"Очные!I6","v":""},{"$f":"U32/V32","v":{"$error":"#VALUE!"}},{"$f":"R32*3+S32","v":{"$error":"#VALUE!"}},null,null,null,null,null,null,null,null,1,0,{"$f":"VLOOKUP(AG32,AC5:AE12,2)","v":31.215611234357599},{"$f":"VLOOKUP(AH32,AC5:AE12,3)","v":58.42069456117359},18.23637689462744,5.4835453652781583,0,1,{"$f":"VLOOKUP(AM32,AC5:AE12,2)","v":18.498139990730429},{"$f":"VLOOKUP(AN32,AC5:AE12,3)","v":31.401123326630799},5.8086237516220729,17.215781960757013,null,null,null,null,null,null,null,"ТБ0.5",{"$f":"100-BA33","v":{"$error":"#REF!"}},{"$f":"100/BA32","v":{"$error":"#REF!"}},null,1,0,{"$f":"VLOOKUP(BD32,AZ5:BB12,2)","v":{"$error":"#REF!"}},{"$f":"VLOOKUP(BE32,AZ5:BB12,3)","v":{"$error":"#REF!"}},{"$error":"#REF!"},{"$error":"#REF!"},0,1,{"$f":"VLOOKUP(BJ32,AZ5:BB12,2)","v":{"$error":"#REF!"}},{"$f":"VLOOKUP(BK32,AZ5:BB12,3)","v":{"$error":"#REF!"}},{"$error":"#REF!"},{"$error":"#REF!"}]
[null,null,"Коэф-ы бук-ов:",null,{"$f":"Коэффициенты!B2","v":1.64},{"$f":"Коэффициенты!B3","v":3.2},{"$f":"Коэффициенты!B4","v":5.6},"Коэф-ы бук-ов:",null,{"$f":"Коэффициенты!B5","v":2.6},{"$f":"Коэффициенты!B6","v":1.48},"Коэф-ы бук-ов:",null,{"$f":"Коэффициенты!B7","v":2.4},{"$f":"Коэффициенты!B8","v":1.5},null,"2К",{"$f":"Очные!P6","v":""},{"$f":"Очные!Q6","v":""},{"$f":"Очные!R6","v":""},{"$f":"Очные!N6","v":""},{"$f":"Очные!O6","v":""},{"$f":"U33/V33","v":{"$error":"#VALUE!"}},{"$f":"R33*3+S33","v":{"$error":"#VALUE!"}},null,null,null,null,null,null,null,null,null,null,null,null,null,null,null,null,null,null,null,null,null,null,null,null,null,null,null,"ТМ0.5",{"$f":"SUM(BT5)","v":{"$error":"#REF!"}},{"$error":"#REF!"}]
[null,null,"Вероятность (%):",null,{"$f":"E35/(1+G31)","v":0.55390702274975279},{"$f":"F35/(1+G31)","v":0.28387734915924828},{"$f":"G35/(1+G31)","v":0.16221562809099901},"Вероятность (%):",null,{"$f":"J35/(1+K31)","v":0.36274509803921567},{"$f":"K35/(1+K31)","v":0.63725490196078438},"Вероятность (%):",null,{"$f":"N35/(1+O31)","v":0.38461538461538464},{"$f":"O35/(1+O31)","v":0.61538461538461542},null,null,null,null,null,null,null,null,null,null,null,null,null,null,null,null,null,null,null,null,null,null,null,null,null,null,null,null,null,null,null,null,null,null,null,null,"ТБ4.5",{"$f":"100-BA35","v":{"$error":"#REF!"}},{"$error":"#REF!"}]
[null,null,"Вер. с маржой (%):",null,{"$f":"1/E33","v":0.6097560975609756},{"$f":"1/F33","v":0.3125},{"$f":"1/G33","v":0.17857142857142858},"Вер. с маржой (%):",null,{"$f":"1/J33","v":0.38461538461538458},{"$f":"1/K33","v":0.67567567567567566},"Вер. с маржой (%):",null,{"$f":"1/N33","v":0.41666666666666669},{"$f":"1/O33","v":0.66666666666666663},null,null,null,null,null,null,null,null,null,null,null,null,null,null,null,null,null,null,null,null,null,null,null,null,null,null,null,null,null,null,null,null,null,null,null,null,"ТМ4.5",{"$f":"SUM(BH32+BH31+BH30+BH28+BH27+BN32+BN31+BN30+BN28+BN27+BT5+BT6+BT7)","v":{"$error":"#REF!"}},{"$error":"#REF!"}]
[]
[]
[null,null,"Тест №1 Анализ 10 игр команд дома и в гостях",null,null,null,null,null,null,null,"Последние  три  игры  команд  между  собой",null,null,null,null,null,null,null,null,"Первая",null,null,null,"Вторая",null,null,null,null,null,{"$f":"AVERAGE(W32,AN41)","v":{"$error":"#VALUE!"}},"Вероятность голов",null,null,null,null,null,{"$f":"AVERAGE(W33,AN42)","v":{"$error":"#VALUE!"}},"Расчет ТС и Тотал от #YMA "]
[null,null,"К1","К2","К1","К2","К1","К2",null,null,"Команда дома","Счёт","Счёт","Очки","Команда победитель","Команда в гостях",null,null,null,"Игра","Дома","Гости","Очки","Игра","Дома","Гости","Очки",null,null,"Забьют хозяева",1,"Вероятность",{"$f":"_xlfn.POISSON.DIST(AE39,AD38,FALSE)","v":{"$error":"#VALUE!"}},"Забьют гости",1,"Вероятность",{"$f":"_xlfn.POISSON.DIST(AI39,AK38,FALSE)","v":{"$error":"#VALUE!"}},{"$f":"O5","v":5},{"$f":"P5","v":3},{"$f":"K5","v":5}]
[null,null,{"$f":"IF(Дома!N2=\"П\",\"Поражение\",IF(Дома!N2=\"Н\",\"Ничья\",\"Победа\"))","v":"Поражение"},{"$f":"IF(Гости!N2=\"П\",\"Поражение\",IF(Гости!N2=\"Н\",\"Ничья\",\"Победа\"))","v":"Поражение"},{"$f":"IF(C40=\"Победа\",2,IF(C40=\"Ничья\",1,0))","v":0},{"$f":"IF(D40=\"Победа\",2,IF(D40=\"Ничья\",1,0))","v":0},{"$f":"IF(C40=\"Победа\",1,0)","v":0},{"$f":"IF(D40=\"Победа\",1,0)","v":0},null,null,{"$f":"IF(Очные!A1=Очные!C2,1,2)","v":2},{"$f":"Очные!E2","v":1},{"$f":"Очные!F2","v":1},{"$f":"IF(L40>M40,3+(L40-M40),IF(L40=M40,1,IF(M40>L40,3+(M40-L40),0)))","v":1},{"$f":"IF(L40>M40,K40,IF(M40>L40,P40,0))","v":0},{"$f":"IF(K40=2,1,2)","v":1},null,null,null,"1 игра",{"$f":"ДомаДома!L2","v":1},{"$f":"ДомаДома!M2","v":0},{"$f":"IF(U40>V40,2+(U40-V40),IF(U40=V40,1,0))","v":3},"1 игра",{"$f":"ГостиГости!M2","v":3},{"$f":"ГостиГости!L2","v":2},{"$f":"IF(Z40>Y40,2+(Z40-Y40),IF(Y40=Z40,1,0))","v":0},null,null,null,2,null,{"$f":"_xlfn.POISSON.DIST(AE40,AD38,FALSE)","v":{"$error":"#VALUE!"}},null,2,null,{"$f":"_xlfn.POISSON.DIST(AI40,AK38,FALSE)","v":{"$error":"#VALUE!"}},{"$f":"V6","v":5},{"$f":"W6","v":11},{"$f":"R6","v":5}]
[null,null,{"$f":"IF(Дома!N3=\"П\",\"Поражение\",IF(Дома!N3=\"Н\",\"Ничья\",\"Победа\"))","v":"Победа"},{"$f":"IF(Гости!N3=\"П\",\"Поражение\",IF(Гости!N3=\"Н\",\"Ничья\",\"Победа\"))","v":"Поражение"},2,0,1,0,null,null,{"$f":"IF(Очные!A1=Очные!C3,1,2)","v":2},{"$f":"Очные!E3","v":0},{"$f":"Очные!F3","v":0},{"$f":"IF(L41>M41,3+(L41-M41),IF(L41=M41,0,IF(M41>L41,3+(M41-L41),0)))","v":0},{"$f":"IF(L41>M41,K41,IF(M41>L41,P41,0))","v":0},{"$f":"IF(K41=2,1,2)","v":1},null,null,null,"2 игра",{"$f":"ДомаДома!L3","v":2},{"$f":"ДомаДома!M3","v":1},{"$f":"IF(U41>V41,2+(U41-V41),IF(U41=V41,1,0))","v":3},"2 игра",{"$f":"ГостиГости!M3","v":2},{"$f":"ГостиГости!L3","v":1},{"$f":"IF(Z41>Y41,2+(Z41-Y41),IF(Y41=Z41,1,0))","v":0},null,null,null,3,null,{"$f":"_xlfn.POISSON.DIST(AE41,AD38,FALSE)","v":{"$error":"#VALUE!"}},null,3,null,{"$f":"_xlfn.POISSON.DIST(AI41,AK38,FALSE)","v":{"$error":"#VALUE!"}},{"$f":"AL39/AN39","v":1},{"$f":"AM39/AN39","v":0.6},{"$f":"AVERAGE(AL41,AM42)","v":1.6}]
[null,null,{"$f":"IF(Дома!N4=\"П\",\"Поражение\",IF(Дома!N4=\"Н\",\"Ничья\",\"Победа\"))","v":"Поражение"},{"$f":"IF(Гости!N4=\"П\",\"Поражение\",IF(Гости!N4=\"Н\",\"Ничья\",\"Победа\"))","v":"Поражение"},0,0,0,0,null,null,{"$f":"IF(Очные!A1=Очные!C4,1,2)","v":2},{"$f":"Очные!E4","v":0},{"$f":"Очные!F4","v":0},{"$f":"IF(L42>M42,3+(L42-M42),IF(L42=M42,0,IF(M42>L42,3+(M42-L42),0)))","v":0},{"$f":"IF(L42>M42,K42,IF(M42>L42,P42,0))","v":0},{"$f":"IF(K42=2,1,2)","v":1},null,null,null,null,null,"Итог:",{"$f":"W40+W41","v":6},null,null,"Итог:",{"$f":"AA40+AA41","v":0},null,null,null,4,null,{"$f":"_xlfn.POISSON.DIST(AE42,AD38,FALSE)","v":{"$error":"#VALUE!"}},null,4,null,{"$f":"_xlfn.POISSON.DIST(AI42,AK38,FALSE)","v":{"$error":"#VALUE!"}},{"$f":"AL40/AN40","v":1},{"$f":"AM40/AN40","v":2.2000000000000002},{"$f":"AVERAGE(AL42,AM41)","v":0.8}]
[null,null,{"$f":"IF(Дома!N5=\"П\",\"Поражение\",IF(Дома!N5=\"Н\",\"Ничья\",\"Победа\"))","v":"Победа"},{"$f":"IF(Гости!N5=\"П\",\"Поражение\",IF(Гости!N5=\"Н\",\"Ничья\",\"Победа\"))","v":"Победа"},2,2,1,1,null,null,null,"П1","Команды",1,2,{"$f":"IF(N46>O46,1,IF(N46=O46,0,2))","v":1},null,null,null,"5 игра ",{"$f":"ДомаДома!L6","v":0},{"$f":"ДомаДома!M6","v":0},{"$f":"IF(U43>V43,2+(U43-V43),IF(U43=V43,1,0))","v":1},"5 игра ",{"$f":"ГостиГости!M6","v":2},{"$f":"ГостиГости!L6","v":1},{"$f":"IF(Z43>Y43,2+(Z43-Y43),IF(Y43=Z43,1,0))","v":0},null,null,null,5,null,{"$f":"_xlfn.POISSON.DIST(AE43,AD38,FALSE)","v":{"$error":"#VALUE!"}},null,5,null,{"$f":"_xlfn.POISSON.DIST(AI43,AK38,FALSE)","v":{"$error":"#VALUE!"}},{"$f":"ROUND(AN41,0)","v":2},{"$f":"ROUND(AN42,0)","v":1},{"$f":"AN41+AN42","v":2.4000000000000004}]
[null,null,{"$f":"IF(Дома!N6=\"П\",\"Поражение\",IF(Дома!N6=\"Н\",\"Ничья\",\"Победа\"))","v":"Победа"},{"$f":"IF(Гости!N6=\"П\",\"Поражение\",IF(Гости!N6=\"Н\",\"Ничья\",\"Победа\"))","v":"Поражение"},2,0,1,0,null,null,null,"П2","Очки",{"$f":"G61+IF(O40=1,N40,0)+IF(O41=1,N41,0)+IF(O42=1,N42,0)","v":7},{"$f":"K61+IF(O40=2,N40,0)+IF(O41=2,N41,0)+IF(O42=2,N42,0)","v":0},{"$f":"IF(P46=1,1,2)+IF(P47>0,99,0)","v":101},null,null,null,"6 игра",{"$f":"ДомаДома!L7","v":3},{"$f":"ДомаДома!M7","v":0},{"$f":"IF(U44>V44,2+(U44-V44),IF(U44=V44,1,0))","v":5},"6 игра",{"$f":"ГостиГости!M7","v":2},{"$f":"ГостиГости!L7","v":2},{"$f":"IF(Z44>Y44,2+(Z44-Y44),IF(Y44=Z44,1,0))","v":1},null,null,null,0,null,{"$f":"_xlfn.POISSON.DIST(AE44,AD38,FALSE)","v":{"$error":"#VALUE!"}},null,0,null,{"$f":"_xlfn.POISSON.DIST(AI44,AK38,FALSE)","v":{"$error":"#VALUE!"}},"Ставка тотал",null,{"$f":"IF(AN43>3,\"ТБ 2,5\",IF(AN43>2,\"ТБ 1,5\",\"ТМ 2,5\"))","v":"ТБ 1,5"}]
[null,null,{"$f":"IF(Дома!N7=\"П\",\"Поражение\",IF(Дома!N7=\"Н\",\"Ничья\",\"Победа\"))","v":"Поражение"},{"$f":"IF(Гости!N7=\"П\",\"Поражение\",IF(Гости!N7=\"Н\",\"Ничья\",\"Победа\"))","v":"Победа"},0,2,0,1,null,null,null,"П1","Доп. Очки",{"$f":"IF(P50=1,1,0)","v":1},null,null,null,null,null,null,null,"Итог:",{"$f":"SUM(W43:W44)","v":6},null,null,"Итог:",{"$f":"AA43+AA44","v":1},null,null,0.25,null,"Прогноз на матч",null,null,null,null,0.35]
[null,null,{"$f":"IF(Дома!N8=\"П\",\"Поражение\",IF(Дома!N8=\"Н\",\"Ничья\",\"Победа\"))","v":"Победа"},{"$f":"IF(Гости!N8=\"П\",\"Поражение\",IF(Гости!N8=\"Н\",\"Ничья\",\"Победа\"))","v":"Поражение"},2,0,1,0,null,null,null,"П2","Итоговые:",{"$f":"SUM(N44,N45)","v":8},{"$f":"SUM(O44,O45)","v":0},null,null,null,null,"Сколько побед 10 игр:",null,null,{"$f":"E5","v":5},"Сколько побед за 10 игр:",null,null,{"$f":"E6","v":3},null,null,null,{"$f":"IF(AF46>0,1,0)","v":0},{"$f":"SUMIFS(AE39:AE44,AG39:AG44,\">25%\")","v":0},{"$f":"SUMIFS(AI39:AI44,AK39:AK44,\">35%\")","v":0},{"$f":"IF(AG46>0,1,0)","v":0},null,"Обе забьют?",null,null,{"$f":"IF(AE46+AH46=2,\"Да\",\"Нет\")","v":"Нет"}]
[null,null,{"$f":"IF(Дома!N9=\"П\",\"Поражение\",IF(Дома!N9=\"Н\",\"Ничья\",\"Победа\"))","v":"Победа"},{"$f":"IF(Гости!N9=\"П\",\"Поражение\",IF(Гости!N9=\"Н\",\"Ничья\",\"Победа\"))","v":"Поражение"},2,0,1,0,null,null,null,"1Х","ИТОГОВЫЙ ВЫВОД:",null,{"$f":"IF(P43=1,M51,IF(P44=1,\"X1\",IF(P44=2,\"2X\",O51)))","v":"П1"},{"$f":"IF(P43=1,N46-O46,IF(P43=2,O46-N46,0))","v":8},null,null,null,"СОПЕРНИЧЕСТВО  КОМАНД МЕЖДУ СОБОЙ",null,null,null,null,null,"ИСХОД:",null,null,null,null,null,{"$f":"IF(AF46>0,\"Гол!\",\"Нет\")","v":"Нет"},{"$f":"IF(AG46>0,\"Гол!\",\"Нет\")","v":"Нет"}]
[null,null,{"$f":"IF(Дома!N10=\"П\",\"Поражение\",IF(Дома!N10=\"Н\",\"Ничья\",\"Победа\"))","v":"Поражение"},{"$f":"IF(Гости!N10=\"П\",\"Поражение\",IF(Гости!N10=\"Н\",\"Ничья\",\"Победа\"))","v":"Поражение"},0,0,0,0,null,null,null,"Х2",null,null,null,null,null,null,null,"Дома","Счёт","Счёт","Очки","Победа","Гости"]
[null,null,{"$f":"IF(Дома!N11=\"П\",\"Поражение\",IF(Дома!N11=\"Н\",\"Ничья\",\"Победа\"))","v":"Ничья"},{"$f":"IF(Гости!N11=\"П\",\"Поражение\",IF(Гости!N11=\"Н\",\"Ничья\",\"Победа\"))","v":"Победа"},1,2,0,1,null,null,null,"Х1","Для команды 1",null,"Для команды 2",null,null,null,null,{"$f":"K40","v":2},1,1,{"$f":"IF(U49>V49,3+(U49-V49),IF(U49=V49,1,IF(V49>U49,3+(V49-U49),0)))","v":1},{"$f":"IF(U49>V49,T49,IF(V49>U49,Y49,0))","v":0},{"$f":"IF(T49=2,1,2)","v":1}]
[null,null,"Среднее",null,{"$f":"SUM(E40:E49)","v":11},{"$f":"SUM(F40:F49)","v":6},{"$f":"SUM(G40:G49)","v":5},{"$f":"SUM(H40:H49)","v":3},null,null,null,"2Х",{"$f":"IF(P43=1,P47,P49)","v":8},null,{"$f":"IF(P43=2,P47,P48)","v":0},{"$f":"IF(P52=P51,1,0)","v":1},null,null,null,2,0,0,{"$f":"IF(U50>V50,3+(U50-V50),IF(U50=V50,0,IF(V50>U50,3+(V50-U50),0)))","v":0},{"$f":"IF(U50>V50,T50,IF(V50>U50,Y50,0))","v":0},{"$f":"IF(T50=2,1,2)","v":1},{"$f":"IF(X57=1,AA56,AA55)","v":" П1"},null,null,null,"ЗабитоДома",{"$f":"Дома!Z16","v":10},"ЗабитоГости",{"$f":"Гости!AG16","v":8},null,null,"Оригинал","Дома Все игры",null,null,"Гости все игры",null,null,"ДомаДома",null,null,"ГостиГости"]
[null,null,"Команда ","Очки","Значение","Число","ИТОГ",{"$f":"IF(G52>G53,C52,IF(G52<G53,C53,\"Х\"))","v":"П1"},null,null,null,"Ф1 (+1)",{"$f":"IF(M50>12,\"П1\",IF(M50>7,\"П1\",IF(M50>4,\"1X\",IF(M50>0,\"Ф1 (+1)\",P45))))","v":"П1"},null,{"$f":"IF(O50>13,\"П2\",IF(O50>7,\"П2\",IF(O50>4,\"X2\",IF(O50>0,\"Ф2 (+1)\",\"\"))))","v":""},{"$f":"IF(O40=0,1,0)","v":1},null,null,null,2,0,0,{"$f":"IF(U51>V51,3+(U51-V51),IF(U51=V51,0,IF(V51>U51,3+(V51-U51),0)))","v":0},{"$f":"IF(U51>V51,T51,IF(V51>U51,Y51,0))","v":0},{"$f":"IF(T51=2,1,2)","v":1},null,null,null,null,"ПропДома",{"$f":"Дома!AA16","v":6},"ПропГости",{"$f":"Гости!AH16","v":16},null,null,null,"Игр","Заб","Проп","Игр","Заб","Проп","Игр","Заб","Проп","Игр","Заб","Проп"]
[null,null,"П1",{"$f":"E50","v":11},{"$f":"IF(D52>18,4,IF(D52>15,3,IF(D52>10,2,IF(D52>5,1,0))))","v":2},{"$f":"IF(G50>=9,3,IF(G50>=6,2,IF(G50>=4,1,0)))","v":1},{"$f":"IF(D52>D53,1,0)+IF(E52>E53,1,0)+F52","v":3},null,null,null,null,"Ф2 (+1)",1,{"$f":"IF(P47=0,P46,8)","v":8},2,{"$f":"IF(K40=O52,1,0)","v":1},null,null,null,"Итоговые очки:",null,"Очки","Динамика","Итоговые очки",null,null,null,null,null,"Всего игр",{"$f":"Дома!O16","v":15},"Всего игр",{"$f":"Гости!O16","v":15},null,null,null,0,{"$f":"Дома!L11","v":0},{"$f":"Дома!M11","v":0},0,{"$f":"Гости!L11","v":1},{"$f":"Гости!M11","v":0},0,{"$f":"ДомаДома!L11","v":1},{"$f":"ДомаДома!M11","v":1},0,{"$f":"ГостиГости!L11","v":1},{"$f":"ГостиГости!M11","v":0}]
[null,null,"П2",{"$f":"F50","v":6},{"$f":"IF(D53>18,4,IF(D53>15,3,IF(D53>10,2,IF(D53>5,1,0))))","v":1},{"$f":"IF(H50>=9,3,IF(H50>=6,2,IF(H50>=4,1,0)))","v":0},{"$f":"IF(D53>D52,1,0)+IF(E53>E52,1,0)+F53","v":0},null,null,null,null,null,null,null,null,null,null,null,null,"Команда 1",null,{"$f":"W42+W45+IF(X49=1,W49,0)+IF(X50=1,W50,0)+IF(X51=1,W51,0)","v":12},{"$f":"IF(W42>W45,2,IF(W42=W45,1,0))","v":1},{"$f":"IF(W53=2,V53+(V53*0.3),IF(W53=1,V53,IF(W53=0,V53-(V53*0.3),0)))+IF(W42>AA42,(V53*0.15),0)+V57","v":13.8},null,null,null,null,null,"АЗД",{"$f":"AE50/AE52","v":0.66666666666666663},"БЗВ",{"$f":"AG50/AG52","v":0.53333333333333333},null,null,null,1,{"$f":"Дома!L10","v":0},{"$f":"Дома!M10","v":1},1,{"$f":"Гости!L10","v":1},{"$f":"Гости!M10","v":2},1,{"$f":"ДомаДома!L10","v":2},{"$f":"ДомаДома!M10","v":1},1,{"$f":"ГостиГости!L10","v":1},{"$f":"ГостиГости!M10","v":2}]
[null,null,null,null,null,null,null,null,null,null,null,null,null,null,null,null,null,null,null,"Команда 2",null,{"$f":"AA42+AA45+IF(X49=2,W49,0)+IF(X50=2,W50,0)+IF(X51=2,W51,0)","v":1},{"$f":"IF(AA42>AA45,2,IF(AA42=AA45,1,0))","v":0},{"$f":"IF(W54=2,V54+(V54*0.3),IF(W54=1,V54,IF(W54=0,V54-(V54*0.3),0)))+IF(AA42>W42,(V54*0.15),0)+W57","v":0.49999999999999994},null,"1Х","ИТОГ",null,null,"БПВ",{"$f":"AG51/AG52","v":1.0666666666666667},"АПД",{"$f":"AE51/AE52","v":0.4},null,null,null,2,{"$f":"Дома!L9","v":2},{"$f":"Дома!M9","v":0},2,{"$f":"Гости!L9","v":0},{"$f":"Гости!M9","v":1},2,{"$f":"ДомаДома!L9","v":1},{"$f":"ДомаДома!M9","v":0},2,{"$f":"ГостиГости!L9","v":1},{"$f":"ГостиГости!M9","v":1}]
[null,null,null,"Последние 3 игры команды 1 ДОМА",null,null,null,"Последние 3 игры команды 2 в гостях",null,null,null,"Второй прогноз на Тоталы",null,null,null,null,null,null,null,null,null,null,null,null,null,"Х2",{"$f":"IF(Y57<6,Z57,IF(Y57<10,Z55,T57))","v":" П2"},null,null,"А забьет",{"$f":"(AE53+AE54)/2.5","v":0.69333333333333336},"Б забьет",{"$f":"(AG53+AG54)/2.5","v":0.37333333333333335},null,null,null,3,{"$f":"Дома!L8","v":3},{"$f":"Дома!M8","v":0},3,{"$f":"Гости!L8","v":1},{"$f":"Гости!M8","v":3},3,{"$f":"ДомаДома!L8","v":1},{"$f":"ДомаДома!M8","v":3},3,{"$f":"ГостиГости!L8","v":1},{"$f":"ГостиГости!M8","v":3}]
[null,null,null,null,null,null,null,null,null,null,null,null,null,null,null,null,null,null,null," П1",2,"10BUH1","10BUH2","КТО ПОБЕДИЛ","Разница","Ф1(+1)",{"$f":"IF(Y57<6,Z56,IF(Y57<10,Z54,T56))","v":" П1"},null,null,"Примерный счет c округлением:",null,null,null,null,null,null,4,{"$f":"Дома!L7","v":0},{"$f":"Дома!M7","v":2},4,{"$f":"Гости!L7","v":1},{"$f":"Гости!M7","v":0},4,{"$f":"ДомаДома!L7","v":3},{"$f":"ДомаДома!M7","v":0},4,{"$f":"ГостиГости!L7","v":2},{"$f":"ГостиГости!M7","v":2}]
[null,null,null,null,"КОМАНДА 1","гости","Очки",null,"хозяева","КОМАНДА 2","Очки","Второй анализ.",null,"Команда 1","Команда 2",{"$f":"N58*N59","v":1.25},null,null,null," П2",1,{"$f":"IF(W46<=4,-(V53*0.2),IF(W46>=6,V53*0.1,IF(W46>=9,V53*0.2,0)))","v":0},{"$f":"IF(AA46<=4,-(V54*0.2),IF(AA46>=6,V54*0.1,IF(AA46>=9,V54*0.2,0)))","v":-0.2},{"$f":"IF(X53>X54,1,IF(X53=X54,0,2))","v":1},{"$f":"IF(X57=1,X53-X54,IF(X57=2,X54-X53,0))","v":13.3},"Ф2(+1)",null,null,null,"А забьет",{"$f":"IF(AE55>0.5,1,0)+IF(AE55>0.7,1,0)+IF(AE55>0.9,1,0)","v":1},"Б забьет",{"$f":"IF(AG55>0.5,1,0) + IF(AG55>0.7,1,0)+IF(AG55>0.9,1,0)","v":0},null,null,null,5,{"$f":"Дома!L6","v":2},{"$f":"Дома!M6","v":1},5,{"$f":"Гости!L6","v":0},{"$f":"Гости!M6","v":1},5,{"$f":"ДомаДома!L6","v":0},{"$f":"ДомаДома!M6","v":0},5,{"$f":"ГостиГости!L6","v":1},{"$f":"ГостиГости!M6","v":2}]
[null,null,null,"1 игра",{"$f":"ДомаДома!L2","v":1},{"$f":"ДомаДома!M2","v":0},{"$f":"IF(E58>F58,2+(E58-F58),IF(E58=F58,1,0))","v":3},"1 игра",{"$f":"ГостиГости!M2","v":3},{"$f":"ГостиГости!L2","v":2},{"$f":"IF(J58>I58,2+(J58-I58),IF(I58=J58,1,0))","v":0},"Забьёт в абстрактном матче ",null,{"$f":"(E58+E59+E60+1+I58+I59+I60)/6","v":1.6666666666666667},{"$f":"(J58+J59+J60+F58+F59+F60+1)/6","v":1.1666666666666667},{"$f":"O58+O59","v":1.5952380952380953},null,null,null,null,null,null,null,null,null,null,null,null,null,null,null,null,null,null,null,null,6,{"$f":"Дома!L5","v":2},{"$f":"Дома!M5","v":1},6,{"$f":"Гости!L5","v":1},{"$f":"Гости!M5","v":0},6,{"$f":"ДомаДома!L5","v":2},{"$f":"ДомаДома!M5","v":0},6,{"$f":"ГостиГости!L5","v":1},{"$f":"ГостиГости!M5","v":3}]
[null,null,null,"2 игра",{"$f":"ДомаДома!L3","v":2},{"$f":"ДомаДома!M3","v":1},{"$f":"IF(E59>F59,2+(E59-F59),IF(E59=F59,1,0))","v":3},"2 игра",{"$f":"ГостиГости!M3","v":2},{"$f":"ГостиГости!L3","v":1},{"$f":"IF(J59>I59,2+(J59-I59),IF(I59=J59,1,0))","v":0},"Забьёт/пропустит в конкретном",null,{"$f":"(E58+E59+E60)/(F58+F59+F60+1)","v":0.75},{"$f":"(J58+J59+J60)/(I58+I59+I60+1)","v":0.42857142857142855},{"$f":"P57/P58","v":0.78358208955223874},null,null,null,null,null,null,null,null,null,null,null,null,null,null,null,null,null,null,null,null,7,{"$f":"Дома!L4","v":1},{"$f":"Дома!M4","v":2},7,{"$f":"Гости!L4","v":1},{"$f":"Гости!M4","v":2},7,{"$f":"ДомаДома!L4","v":0},{"$f":"ДомаДома!M4","v":2},7,{"$f":"ГостиГости!L4","v":0},{"$f":"ГостиГости!M4","v":1}]
[null,null,null,"3 игра",{"$f":"ДомаДома!L4","v":0},{"$f":"ДомаДома!M4","v":2},{"$f":"IF(E60>F60,2+(E60-F60),IF(E60=F60,1,0))","v":0},"3 игра",{"$f":"ГостиГости!M4","v":1},{"$f":"ГостиГости!L4","v":0},{"$f":"IF(J60>I60,2+(J60-I60),IF(I60=J60,1,0))","v":0},"Забьёт в этом матче",null,{"$f":"P59","v":0.78358208955223874},{"$f":"P60","v":1.2761904761904763},{"$f":"P58/P57","v":1.2761904761904763},null,null,null,"Команда 1 ",null,"ввод данных",null,null,"Команда 2",null,"ввод данных",null,null,null,null,null,null,null,null,null,8,{"$f":"Дома!L3","v":1},{"$f":"Дома!M3","v":0},8,{"$f":"Гости!L3","v":1},{"$f":"Гости!M3","v":2},8,{"$f":"ДомаДома!L3","v":2},{"$f":"ДомаДома!M3","v":1},8,{"$f":"ГостиГости!L3","v":1},{"$f":"ГостиГости!M3","v":2}]
[null,null,null,null,null,"Итого:",{"$f":"SUM(G58,G59,G60) +1","v":7},null,null,"Итого:",{"$f":"SUM(K58,K59,K60)","v":0},"Счет матча",null,{"$f":"N58+N59+N60","v":3.2002487562189055},{"$f":"O58+O59+O60","v":2.8714285714285719},null,null,null,null,"Место в ТТ",null,{"$f":"E14","v":{"$error":"#REF!"}},"из",{"$f":"H14","v":0},"Место в ТТ",null,{"$f":"K14","v":{"$error":"#REF!"}},"из",{"$f":"H14","v":0},null,null,null,null,null,null,null,9,{"$f":"Дома!L2","v":0},{"$f":"Дома!M2","v":2},9,{"$f":"Гости!L2","v":2},{"$f":"Гости!M2","v":3},9,{"$f":"ДомаДома!L2","v":1},{"$f":"ДомаДома!M2","v":0},9,{"$f":"ГостиГости!L2","v":2},{"$f":"ГостиГости!M2","v":3}]
[null,null,null,null,null,null,null,null,null,null,null,null,null,null,null,null,null,null,null,"Сколько мячей забито",null,{"$f":"OFFSET(#REF!,MATCH(Расчеты!F14,#REF!:#REF!,0),5)","v":{"$error":"#REF!"}},null,null,"Сколько мячей забито",null,{"$f":"OFFSET(#REF!,MATCH(I14,#REF!:#REF!,0),5)","v":{"$error":"#REF!"}},null,null,null,null,null,null,null,null,"5из5",5,{"$f":"TREND(AL52:AL56,AK52:AK56,AK62)","v":1.9},{"$f":"TREND(AM52:AM56,AK52:AK56,AK62)","v":1.4999999999999996},5,{"$f":"TREND(AO52:AO56,AN52:AN56,AN62)","v":0.8},{"$f":"TREND(AP52:AP56,AN52:AN56,AN62)","v":1.5},5,{"$f":"TREND(AR52:AR56,AQ52:AQ56,AQ62)","v":2.5},{"$f":"TREND(AS52:AS56,AQ52:AQ56,AQ62)","v":1},5,{"$f":"TREND(AU52:AU56,AT52:AT56,AT62)","v":1.7999999999999998},{"$f":"TREND(AV52:AV56,AT52:AT56,AT62)","v":3.0999999999999996}]
[null,null,null,null,null,null,null,null,null,null,null,null,null,null,null,null,null,null,null,"Забито за 3 игры дома",null,{"$f":"ДомаДома!S4","v":3},null,null,"Забито за 3 игры в гостях",null,{"$f":"ГостиГости!S4","v":3},null,null,null,null,null,null,null,null,"5из10",5,{"$f":"TREND(AL52:AL61,AK52:AK61,AK63)","v":1.1030303030303032},{"$f":"TREND(AM52:AM61,AK52:AK61,AK63)","v":0.96969696969696972},5,{"$f":"TREND(AO52:AO61,AN52:AN61,AN63)","v":0.93939393939393945},{"$f":"TREND(AP52:AP61,AN52:AN61,AN63)","v":1.4727272727272727},5,{"$f":"TREND(AR52:AR61,AQ52:AQ61,AQ63)","v":1.2848484848484847},{"$f":"TREND(AS52:AS61,AQ52:AQ61,AQ63)","v":0.77575757575757587},5,{"$f":"TREND(AU52:AU61,AT52:AT61,AT63)","v":1.1090909090909091},{"$f":"TREND(AV52:AV61,AT52:AT61,AT63)","v":1.9818181818181819}]
[null,null,"Тест №3 Общая теория",null,null,null,null,null,"Победа 1","Ничья","Победа 2",null,"ПРОГНОЗЫ НА ТОТАЛЫ",null,null,null,null,null,null,"Игр сыграно за сезон",null,{"$f":"OFFSET(#REF!,MATCH(Расчеты!F14,#REF!:#REF!,0),1)","v":{"$error":"#REF!"}},null,null,"Игр сыграно за сезон",null,{"$f":"OFFSET(#REF!,MATCH(I14,#REF!:#REF!,0),1)","v":{"$error":"#REF!"}},null,null,null,null,null,null,null,null,"10из10",10,{"$f":"TREND(AL52:AL61,AK52:AK61,AK64)","v":1.1333333333333335},{"$f":"TREND(AM52:AM61,AK52:AK61,AK64)","v":1.666666666666667},10,{"$f":"TREND(AO52:AO61,AN52:AN61,AN64)","v":1.3333333333333335},{"$f":"TREND(AP52:AP61,AN52:AN61,AN64)","v":2.2000000000000002},10,{"$f":"TREND(AR52:AR61,AQ52:AQ61,AQ64)","v":1.1333333333333329},{"$f":"TREND(AS52:AS61,AQ52:AQ61,AQ64)","v":0.53333333333333344},10,{"$f":"TREND(AU52:AU61,AT52:AT61,AT64)","v":1.2000000000000002},{"$f":"TREND(AV52:AV61,AT52:AT61,AT64)","v":2.8000000000000003}]
[null,null,null,null,null,null,null,null,{"$f":"(E68+E67+E69)/13","v":0.46153846153846156},null,{"$f":"(H67+H68+H69)/13","v":0.30769230769230771},null,null,"Шансы =>","Забьёт","Пропустит","примерный счёт ",null,null,"Вероятный исход в процентах",null,null,null,null,"РАСЧЁТ ДАННЫХ",null,"Очки",null,null,null,null,null,null,null,null,null,"Дома","Гости","Тотал","Дельта","К1 Заб","2К Заб","ОЗ","Тотал1","Тотал2","1X2","ОНЗ","Чет/нечет"]
[null,null,"Расчёт команды 1",null,"Число","Расчёт команды 2",null,"Число",{"$f":"(1+1-1)/3","v":0.33333333333333331},null,{"$f":"(1+1-1)/3","v":0.33333333333333331},null,"Команда 1",null,{"$f":"P80","v":"0"},{"$f":"P79","v":1},{"$f":"O78","v":0},null,null,"П1","Ничья","П2","ТМ 2,5","ТБ2,5","Команда1",null,{"$f":"T68+T70+IF(V62>AA62,T71,0)","v":{"$error":"#REF!"}},null,null,null,null,null,null,null,null,"5_5",{"$f":"AVERAGE(AL62,AP62)","v":1.7},{"$f":"AVERAGE(AM62,AP62)","v":1.4999999999999998},{"$f":"AK66+AL66","v":3.1999999999999997},{"$f":"AK66-AL66","v":0.20000000000000018},{"$f":"IF(AK66>1.5,\"Да\",\"-\")","v":"Да"},"-",{"$f":"IF((AK66>1.5)*(AL66>1.5),\"Да\",\"-\")","v":"-"},{"$f":"IF(AM66>=3.5,\"ТБ2.5\",IF(AM66>=2.5,\"ТБ1.5\",IF(AM66<=0.5,\"ТМ2.5\",IF(AM66<2,\"ТМ3.5\",\"-\"))))","v":"ТБ1.5"},{"$f":"IF(AM66>=4.5,\"ТБ2.5\",IF(AM66>=3.5,\"ТБ1.5\",IF(AM66<=0.5,\"ТМ2.5\",IF(AM66<1,\"ТМ3.5\",\"-\"))))","v":"-"},{"$f":"IF(AN66>1.5,\"П1\",IF(AN66>1,\"1X\",IF(AN66<-1.5,\"П2\",IF(AN66<-1,\"X2\",\"-\"))))","v":"-"},{"$f":"IF(AK66<-0.5,\"Да\",IF(AL66<-0.5,\"Да\",\"-\"))","v":"-"},{"$f":"IF(ISEVEN(AM66*10),\"Чет\",\"Нечет\")","v":"Чет"}]
[null,null,"Сколько Побед из 5 последних игр дома",null,{"$f":"ДомаДома!P6","v":3},"Сколько Побед из 5 последних игр в гостях",null,{"$f":"ГостиГости!P6","v":0},{"$f":"I65/I66","v":1.3846153846153848},1,{"$f":"K65/K66","v":0.92307692307692313},null,"Команда 2",null,{"$f":"P66","v":1},{"$f":"O66","v":"0"},{"$f":"P78","v":0},null,null,{"$f":"(AA66/T69)*100","v":{"$error":"#REF!"}},{"$f":"100-(T67+V67)","v":{"$error":"#REF!"}},{"$f":"(AA67/T69)*100","v":{"$error":"#REF!"}},{"$f":"100-X67","v":{"$error":"#REF!"}},{"$f":"(AA68/W69)*100-10","v":{"$error":"#REF!"}},"Команда2",null,{"$f":"V68+V69+IF(AA62>V62,T71,0)","v":{"$error":"#REF!"}},null,null,null,null,null,null,null,null,"5_10",{"$f":"AVERAGE(AL63,AP63)","v":1.2878787878787881},{"$f":"AVERAGE(AM63,AP63)","v":1.2212121212121212},2.5090909090909093,6.6666666666666874E-2,"-","-","-",{"$f":"IF(AM67>=3.5,\"ТБ2.5\",IF(AM67>=2.5,\"ТБ1.5\",IF(AM67<=0.5,\"ТМ2.5\",IF(AM67<2,\"ТМ3.5\",\"ТМ2\"))))","v":"ТБ1.5"},{"$f":"IF(AM67>=4.5,\"ТБ2.5\",IF(AM67>=3.5,\"ТБ1.5\",IF(AM67<=0.5,\"ТМ2.5\",IF(AM67<1,\"ТМ3.5\",\"-\"))))","v":"-"},{"$f":"IF(AN67>1.5,\"П1\",IF(AN67>1,\"1X\",IF(AN67<-1.5,\"П2\",IF(AN67<-1,\"X2\",\"-\"))))","v":"-"},"-","Нечет"]
[null,null,"Сколько Побед из 5 последних игр вообще",null,{"$f":"Дома!P6","v":3},"Сколько Побед из 5 последних игр вообще",null,{"$f":"Гости!P6","v":1},{"$f":"((I72-I67)*I67)/3","v":0.88757396449704185},{"$f":"(I72-J67)*1/3","v":0.7692307692307695},{"$f":"((I72-K67)*K67)*1/3","v":0.73372781065088777},null,"Тотал матча: ",{"$f":"IF(N75>3,\"ТБ 2,5\",IF(N75>2,\"ТБ 1,5\",\"ТМ 2,5\"))","v":"ТМ 2,5"},null,null,null,null,null,{"$f":"X61-V61","v":{"$error":"#REF!"}},null,{"$f":"AC61-AA61","v":{"$error":"#REF!"}},{"$f":"(V64+AA64)/2","v":{"$error":"#REF!"}},null,{"$f":"(V62/V64)+V63/3","v":{"$error":"#REF!"}},{"$f":"AA62/AA64+AA63/3","v":{"$error":"#REF!"}},{"$f":"(Y68+Z68)/2","v":{"$error":"#REF!"}},null,null,null,null,null,null,null,null,"10_10",{"$f":"AVERAGE(AL64,AP64)","v":1.666666666666667},{"$f":"AVERAGE(AM64,AP64)","v":1.9333333333333336},3.6000000000000005,-0.26666666666666661,"Да","Да","Да",{"$f":"IF(AM68>=3.5,\"ТБ2.5\",IF(AM68>=2.5,\"ТБ1.5\",IF(AM68<=0.5,\"ТМ2.5\",IF(AM68<2,\"ТМ3.5\",\"-\"))))","v":"ТБ2.5"},"ТБ1.5","-","-","Чет"]
[null,null,"Сколько Побед из 3 последних игр между командами",null,{"$f":"SUM(E70:E72)","v":0},"Сколько Побед из 3 последних игр между командами",null,{"$f":"SUM(H70:H72)","v":3},null,null,null,null,{"$f":"(E58+E59+E60)/3+O70/3","v":1.3333333333333333},{"$f":"(I58+I59+I60)/3","v":2},null,null,null,null,null,{"$f":"X61-1+5+((V64+AA64)/2)+(((V62+AA64)/2)/2)-2","v":{"$error":"#REF!"}},null,{"$f":"(AA63*3)/2","v":4.5},{"$f":"((W68/4)*3+(W68/2)+(W68)+(W68/5)*4)/W68","v":{"$error":"#REF!"}},null,null,null,null,null,null,null,null,null,null,null,null,"5_5",{"$f":"AVERAGE(AR62,AV62)","v":2.8},{"$f":"AVERAGE(AS62,AU62)","v":1.4},4.1999999999999993,1.4,"Да","-","-",{"$f":"IF(AM69>=3.5,\"ТБ2.5\",IF(AM69>=2.5,\"ТБ1.5\",IF(AM69<=0.5,\"ТМ2.5\",IF(AM69<2,\"ТМ3.5\",\"-\"))))","v":"ТБ2.5"},"ТБ1.5","1X","-","Чет"]
[null,null,null,null,{"$f":"IF(K40=1,1,0)","v":0},null,null,{"$f":"IF(K40=2,1,0)","v":1},null,null,null,null,{"$f":"(J58+J59+J60)/3+O71/3","v":1.3333333333333333},{"$f":"(F58+F59+F60)/3","v":1},{"$f":"IF(K40=1,L40,M40)+IF(K41=1,L41,M41)+IF(K42=1,L42,M42)","v":1},"команда 1",null,null,null,{"$f":"(V63*3)/2","v":4.5},null,null,null,null,null,null,null,null,null,null,null,null,null,null,null,"5_10",{"$f":"AVERAGE(AR63,AV63)","v":1.6333333333333333},{"$f":"AVERAGE(AS63,AU63)","v":0.9424242424242425},2.5757575757575757,0.69090909090909081,"Да","-","-",{"$f":"IF(AM70>=3.5,\"ТБ2.5\",IF(AM70>=2.5,\"ТБ1.5\",IF(AM70<=0.5,\"ТМ2.5\",IF(AM70<2,\"ТМ3.5\",\"ТМ2\"))))","v":"ТБ1.5"},"-","-","-","Нечет"]
[null,null,null,"Тесты",{"$f":"IF(K41=1,1,0)","v":0},null,null,{"$f":"IF(K41=2,1,0)","v":1},null,null,null,null,null,null,{"$f":"IF(K40=2,L40,M40)+IF(K41=2,L41,M41)+IF(K42=2,L42,M42)","v":1},"команда 2",null,null,null,{"$f":"IF(V62>AA62,V62-AA62,IF(AA62>V62,AA62-V62,0))","v":{"$error":"#REF!"}},null,null,null,null,null,null,null,null,null,null,null,null,null,null,null,"10_10",{"$f":"AVERAGE(AR64,AV64)","v":1.9666666666666666},{"$f":"AVERAGE(AS64,AU64)","v":0.86666666666666681},2.8333333333333335,1.0999999999999996,"Да","-","-",{"$f":"IF(AM71>=3.5,\"ТБ2.5\",IF(AM71>=2.5,\"ТБ1.5\",IF(AM71<=0.5,\"ТМ2.5\",IF(AM71<2,\"ТМ3.5\",\"-\"))))","v":"ТБ1.5"},"-","1X","-","Чет"]
[null,null,"№1",{"$f":"IF(I68>K68,\"П1\",IF(K68>I68,\"П2\",0))","v":"П1"},{"$f":"IF(K42=1,1,0)","v":0},null,null,{"$f":"IF(K42=2,1,0)","v":1},{"$f":"I67+J67+K67","v":3.3076923076923084}]
[null,null,null,null,null,null,null,null,null,null,null,null,null,null,{"$f":"IF(O70>O71,O70/O71,O71/O70)","v":1},{"$f":"IF(O70>O71,P70,P71)","v":"команда 2"},null,null,null,null,null,null,null,null,null,null,null,null,null,null,null,null,null,null,null,"Инверсия","Дома Все игры",null,null,"Гости все игры",null,null,"ДомаДома",null,null,"ГостиГости"]
[null,null,"Общий прогноз",null,null,null,null,null,null,null,null,null,{"$f":"(M69*M70*O73)/3","v":0.59259259259259256},null,null,null,{"$f":"IF(Q66=0,1,Q66)","v":1},null,null,"Расчет матчей",null,null,null,null,null,null,null,null,null,null,null,null,null,null,null,null,"Игр","Заб","Проп","Игр","Заб","Проп","Игр","Заб","Проп","Игр","Заб","Проп"]
[null,null,"№ Теста","прогноз:",null,null,null,null,null,null,null,null,0.5,{"$f":"(((P79+P80)*M74)/(M70*N69)-N76)/1.75","v":-0.15873015873015875},null,null,{"$f":"IF(Q67=0,1,Q67)","v":1},null,null,"Вводные данные",null,"Хозяева",null,"Гости",null,{"$f":"IF(W81-Y81>0.23,\"П1\",IF(W81>Y81,\"1X\",IF(Y81-W81>0.24,\"П2\",IF(Y81>W81,\"Х2\",\"\"))))","v":"П1"},"Расчет",null,null,null,null,null,null,null,null,null,0,{"$f":"Дома!L2","v":0},{"$f":"Дома!M2","v":2},0,{"$f":"Гости!L2","v":2},{"$f":"Гости!M2","v":3},0,{"$f":"ДомаДома!L2","v":1},{"$f":"ДомаДома!M2","v":0},0,{"$f":"ГостиГости!L2","v":2},{"$f":"ГостиГости!M2","v":3}]
[null,null,"Тест № 1",{"$f":"H51","v":"П1"},null,null,null,null,null,null,null,null,1.5,{"$f":"(Q74/Q75)*(Q75/Q74)/2","v":0.5},"Примерный счёт",null,null,null,null,"Голов забито дома",{"$f":"Дома!Z11+Гости!Z11","v":9},"Забито дома",{"$f":"Дома!Z11","v":5},"Забито в гостях",{"$f":"Гости!AG11","v":5},{"$f":"IF(W81>=1,\"Yes\",\"No\")","v":"Yes"},"Ср. забитых дома",{"$f":"U76/U80/U81","v":0.9},null,null,null,null,null,null,null,null,1,{"$f":"Дома!L3","v":1},{"$f":"Дома!M3","v":0},1,{"$f":"Гости!L3","v":1},{"$f":"Гости!M3","v":2},1,{"$f":"ДомаДома!L3","v":2},{"$f":"ДомаДома!M3","v":1},1,{"$f":"ГостиГости!L3","v":1},{"$f":"ГостиГости!M3","v":2}]
[null,null,"Тест № 2",{"$f":"O47","v":"П1"},null,null,null,null,null,null,null,null,2.5,null,{"$f":"M69*N69*(O70/3)/3","v":0.29629629629629628},{"$f":"M70*N70*(O71/3)/3","v":0.14814814814814814},null,null,null,"Голов пропущено дома",{"$f":"Дома!AA11+Гости!AA11","v":6},"Пропущено дома",{"$f":"Дома!AA11","v":3},"Пропущено в гостях",{"$f":"Гости!AH11","v":11},{"$f":"IF(Y81>=1,\"Yes\",\"No\")","v":"No"},"Ср. забитых в гостях",{"$f":"U78/U80/U82","v":1.1000000000000001},null,null,null,null,null,null,null,null,2,{"$f":"Дома!L4","v":1},{"$f":"Дома!M4","v":2},2,{"$f":"Гости!L4","v":1},{"$f":"Гости!M4","v":2},2,{"$f":"ДомаДома!L4","v":0},{"$f":"ДомаДома!M4","v":2},2,{"$f":"ГостиГости!L4","v":0},{"$f":"ГостиГости!M4","v":1}]
[null,null,"Тест № 3",{"$f":"IF(N61>O61,\"П1\",IF(O61>N61,\"П2\",\"Х\"))","v":"П1"},null,null,null,null,null,null,null,null,3.5,null,{"$f":"IF(O77>4.55,5,IF(O77>3.55,4,IF(O77>2.55,3,IF(O77>1.55,2,IF(O77>0.55,1,0)))))","v":0},{"$f":"IF(P77>4.55,5,IF(P77>3.55,4,IF(P77>2.55,3,IF(P77>1.55,2,IF(P77>0.55,1,0)))))","v":0},null,null,null,"Голов забито в гостях",{"$f":"Дома!AG11+Гости!AG11","v":11},"Матчей дома",{"$f":"Дома!V11","v":5},"Матчей в гостях",{"$f":"Гости!AC11","v":5},"команда 1",null,"команда 2",null,null,null,null,null,null,null,null,3,{"$f":"Дома!L5","v":2},{"$f":"Дома!M5","v":1},3,{"$f":"Гости!L5","v":1},{"$f":"Гости!M5","v":0},3,{"$f":"ДомаДома!L5","v":2},{"$f":"ДомаДома!M5","v":0},3,{"$f":"ГостиГости!L5","v":1},{"$f":"ГостиГости!M5","v":3}]
[null,null,"Тест № 4",{"$f":"D72","v":"П1"},null,null,null,null,null,null,null,null,null,null,null,{"$f":"IF(M70>=N70,N70,\"0\")","v":1},"к2",null,null,"Голов пропущено в гостях",{"$f":"Дома!AH11+Гости!AH11","v":17},"Сила атаки",{"$f":"W76/W78","v":1},"Сила атаки",{"$f":"Y76/Y78","v":1},"атака","оборона","атака","оборона",null,null,null,null,null,null,null,4,{"$f":"Дома!L6","v":2},{"$f":"Дома!M6","v":1},4,{"$f":"Гости!L6","v":0},{"$f":"Гости!M6","v":1},4,{"$f":"ДомаДома!L6","v":0},{"$f":"ДомаДома!M6","v":0},4,{"$f":"ГостиГости!L6","v":1},{"$f":"ГостиГости!M6","v":2}]
[null,null,"Тотал",{"$f":"N68","v":"ТМ 2,5"},null,null,null,null,null,null,null,null,{"$f":"((P79+P80)*M74)/(M70*N69)+N76","v":0.72222222222222221},null,null,{"$f":"IF(M69>=N69,N69,\"0\")","v":"0"},"к1",null,null,"Кол-во команд",2,"Сила обороны",{"$f":"W77/W78","v":0.6},"Сила обороны",{"$f":"Y77/Y78","v":2.2000000000000002},{"$f":"W79","v":1},{"$f":"W80","v":0.6},{"$f":"Y79","v":1},{"$f":"Y80","v":2.2000000000000002},null,null,null,null,null,null,null,5,{"$f":"Дома!L7","v":0},{"$f":"Дома!M7","v":2},5,{"$f":"Гости!L7","v":1},{"$f":"Гости!M7","v":0},5,{"$f":"ДомаДома!L7","v":3},{"$f":"ДомаДома!M7","v":0},5,{"$f":"ГостиГости!L7","v":2},{"$f":"ГостиГости!M7","v":2}]
[null,null,null,null,null,null,null,null,null,null,null,null,null,null,null,null,null,null,null,"Игр сыграно дома",{"$f":"(Дома!V11+Гости!V11)/2","v":5},"Расчет голов",{"$f":"(AVERAGE(W79,Y80))-0.25","v":1.35},"Расчет голов",{"$f":"(AVERAGE(Y79,W80))-0.5","v":0.30000000000000004},null,null,"Прогноз на матч",null,null,null,null,null,null,null,null,6,{"$f":"Дома!L8","v":3},{"$f":"Дома!M8","v":0},6,{"$f":"Гости!L8","v":1},{"$f":"Гости!M8","v":3},6,{"$f":"ДомаДома!L8","v":1},{"$f":"ДомаДома!M8","v":3},6,{"$f":"ГостиГости!L8","v":1},{"$f":"ГостиГости!M8","v":3}]
[null,null,null,null,null,null,null,null,null,null,null,null,null,null,null,null,null,null,null,"Игр сыграно в гостях",{"$f":"(Дома!AC11+Гости!AC11)/2","v":5},null,null,null,null,null,null,{"$f":"SUMIFS(U84:U89,W84:W89,\">27,7%\")","v":1},{"$f":"SUMIFS(Y84:Y89,AA84:AA89,\">27,7%\")","v":0},null,null,null,null,null,null,null,7,{"$f":"Дома!L9","v":2},{"$f":"Дома!M9","v":0},7,{"$f":"Гости!L9","v":0},{"$f":"Гости!M9","v":1},7,{"$f":"ДомаДома!L9","v":1},{"$f":"ДомаДома!M9","v":0},7,{"$f":"ГостиГости!L9","v":1},{"$f":"ГостиГости!M9","v":1}]
[null,null,null,null,null,null,null,null,null,null,null,null,null,null,null,null,null,null,null,"Расчитываем вероятность голов",null,null,null,null,null,null,null,{"$f":"MAX(W84:W89)","v":0.34997435187195353},{"$f":"MAX(AA84:AA89)","v":0.74081822068171788},null,null,null,null,null,null,null,8,{"$f":"Дома!L10","v":0},{"$f":"Дома!M10","v":1},8,{"$f":"Гости!L10","v":1},{"$f":"Гости!M10","v":2},8,{"$f":"ДомаДома!L10","v":2},{"$f":"ДомаДома!M10","v":1},8,{"$f":"ГостиГости!L10","v":1},{"$f":"ГостиГости!M10","v":2}]
[null,null,"15 матчей","голы дома","голы гости","проп дома","проп гости","забито","проп","итог",null,null,null,null,null,null,null,null,null,"Забьют хозяева",1,"Вероятность",{"$f":"_xlfn.POISSON.DIST(U84,W81,FALSE)","v":0.34997435187195353},"Забьют гости",1,"Вероятность",{"$f":"_xlfn.POISSON.DIST(Y84,Y81,FALSE)","v":0.22224546620451538},null,null,null,null,null,null,null,null,null,9,{"$f":"Дома!L11","v":0},{"$f":"Дома!M11","v":0},9,{"$f":"Гости!L11","v":1},{"$f":"Гости!M11","v":0},9,{"$f":"ДомаДома!L11","v":1},{"$f":"ДомаДома!M11","v":1},9,{"$f":"ГостиГости!L11","v":1},{"$f":"ГостиГости!M11","v":0}]
[null,null,{"$f":"Очные!A1","v":"Бадеран Тегеран"},{"$f":"Дома!Z16","v":10},{"$f":"Дома!AG16","v":12},{"$f":"Дома!AA16","v":6},{"$f":"Дома!AH16","v":11},{"$f":"D85+E85","v":22},{"$f":"F85+G85","v":17},{"$f":"H85/I85","v":1.2941176470588236},null,null,null,null,null,null,null,null,null,null,2,null,{"$f":"_xlfn.POISSON.DIST(U85,W81,FALSE)","v":0.23623268751356868},null,2,null,{"$f":"_xlfn.POISSON.DIST(Y85,Y81,FALSE)","v":3.333681993067731E-2},null,null,null,null,null,null,null,null,"5из5",5,{"$f":"TREND(AL75:AL79,AK75:AK79,AK85)","v":2.7},{"$f":"TREND(AM75:AM79,AK75:AK79,AK85)","v":0.8999999999999998},5,{"$f":"TREND(AO75:AO79,AN75:AN79,AN85)","v":-0.19999999999999973},{"$f":"TREND(AP75:AP79,AN75:AN79,AN85)","v":-0.20000000000000018},5,{"$f":"TREND(AR75:AR79,AQ75:AQ79,AQ85)","v":0.39999999999999991},{"$f":"TREND(AS75:AS79,AQ75:AQ79,AQ85)","v":0.30000000000000004},5,{"$f":"TREND(AU75:AU79,AT75:AT79,AT85)","v":0.4},{"$f":"TREND(AV75:AV79,AT75:AT79,AT85)","v":1.9000000000000001}]
[null,null,{"$f":"Очные!B1","v":"Эстеглал Моласани"},{"$f":"Гости!Z16","v":5},{"$f":"Гости!AG16","v":8},{"$f":"Гости!AA16","v":4},{"$f":"Гости!AH16","v":16},{"$f":"D86+E86","v":13},{"$f":"F86+G86","v":20},{"$f":"H86/I86","v":0.65},null,null,null,null,null,null,null,null,null,null,3,null,{"$f":"_xlfn.POISSON.DIST(U86,W81,FALSE)","v":0.10630470938110595},null,3,null,{"$f":"_xlfn.POISSON.DIST(Y86,Y81,FALSE)","v":3.3336819930677311E-3},null,null,null,null,null,null,null,null,"5из10",5,{"$f":"TREND(AL75:AL84,AK75:AK84,AK86)","v":1.0969696969696972},{"$f":"TREND(AM75:AM84,AK75:AK84,AK86)","v":0.83030303030303032},5,{"$f":"TREND(AO75:AO84,AN75:AN84,AN86)","v":0.8606060606060606},{"$f":"TREND(AP75:AP84,AN75:AN84,AN86)","v":1.3272727272727272},5,{"$f":"TREND(AR75:AR84,AQ75:AQ84,AQ86)","v":1.3151515151515152},{"$f":"TREND(AS75:AS84,AQ75:AQ84,AQ86)","v":0.82424242424242422},5,{"$f":"TREND(AU75:AU84,AT75:AT84,AT86)","v":1.0909090909090908},{"$f":"TREND(AV75:AV84,AT75:AT84,AT86)","v":1.8181818181818181}]
[null,null,"Первый гол :",null,null,null,{"$f":"IF(J85>=J86,\"1 команда\",\"2 команда\")","v":"1 команда"},null,null,null,null,null,null,null,null,null,null,null,null,null,4,null,{"$f":"_xlfn.POISSON.DIST(U87,W81,FALSE)","v":3.5877839416123249E-2},null,4,null,{"$f":"_xlfn.POISSON.DIST(Y87,Y81,FALSE)","v":2.5002614948007982E-4},null,null,null,null,null,null,null,null,"10из10",10,{"$f":"TREND(AL75:AL84,AK75:AK84,AK87)","v":1.0666666666666667},{"$f":"TREND(AM75:AM84,AK75:AK84,AK87)","v":0.1333333333333333},10,{"$f":"TREND(AO75:AO84,AN75:AN84,AN87)","v":0.46666666666666656},{"$f":"TREND(AP75:AP84,AN75:AN84,AN87)","v":0.60000000000000009},10,{"$f":"TREND(AR75:AR84,AQ75:AQ84,AQ87)","v":1.4666666666666668},{"$f":"TREND(AS75:AS84,AQ75:AQ84,AQ87)","v":1.0666666666666667},10,{"$f":"TREND(AU75:AU84,AT75:AT84,AT87)","v":1.0000000000000002},{"$f":"TREND(AV75:AV84,AT75:AT84,AT87)","v":1}]
[null,null,null,null,null,null,null,null,null,null,null,null,null,null,null,null,null,null,null,null,5,null,{"$f":"_xlfn.POISSON.DIST(U88,W81,FALSE)","v":9.687016642353271E-3},null,5,null,{"$f":"_xlfn.POISSON.DIST(Y88,Y81,FALSE)","v":1.5001568968804795E-5},null,null,null,null,null,null,null,null,null,"Дома","Гости","Тотал","Дельта","К1 Заб","2К Заб","ОЗ","Тотал1","Тотал2","1X2","ОНЗ","Чет/нечет"]
[null,null,null,null,null,null,null,null,null,null,null,null,null,null,null,null,null,null,null,null,0,null,{"$f":"_xlfn.POISSON.DIST(U89,W81,FALSE)","v":0.25924026064589151},null,0,null,{"$f":"_xlfn.POISSON.DIST(Y89,Y81,FALSE)","v":0.74081822068171788},null,null,null,null,null,null,null,null,"5_5",{"$f":"AVERAGE(AL85,AP85)","v":1.25},{"$f":"AVERAGE(AM85,AP85)","v":0.34999999999999981},{"$f":"AK89+AL89","v":1.5999999999999999},{"$f":"AK89-AL89","v":0.90000000000000013},{"$f":"IF(AK89>1.5,\"Да\",\"-\")","v":"-"},"-",{"$f":"IF((AK89>1.5)*(AL89>1.5),\"Да\",\"-\")","v":"-"},{"$f":"IF(AM89>=3.5,\"ТБ2.5\",IF(AM89>=2.5,\"ТБ1.5\",IF(AM89<=0.5,\"ТМ2.5\",IF(AM89<2,\"ТМ3.5\",\"-\"))))","v":"ТМ3.5"},{"$f":"IF(AM89>=4.5,\"ТБ2.5\",IF(AM89>=3.5,\"ТБ1.5\",IF(AM89<=0.5,\"ТМ2.5\",IF(AM89<1,\"ТМ3.5\",\"-\"))))","v":"-"},{"$f":"IF(AN89>1.5,\"П1\",IF(AN89>1,\"1X\",IF(AN89<-1.5,\"П2\",IF(AN89<-1,\"X2\",\"-\"))))","v":"-"},{"$f":"IF(AK89<-0.5,\"Да\",IF(AL89<-0.5,\"Да\",\"-\"))","v":"-"},{"$f":"IF(ISEVEN(AM89*10),\"Чет\",\"Нечет\")","v":"Чет"}]
[null,null,null,null,null,null,null,null,null,null,null,null,null,null,null,null,null,null,null,null,null,null,null,null,null,null,null,null,null,null,null,null,null,null,null,"5_10",{"$f":"AVERAGE(AL86,AP86)","v":1.2121212121212122},{"$f":"AVERAGE(AM86,AP86)","v":1.0787878787878786},2.290909090909091,0.13333333333333353,"-","-","-",{"$f":"IF(AM90>=3.5,\"ТБ2.5\",IF(AM90>=2.5,\"ТБ1.5\",IF(AM90<=0.5,\"ТМ2.5\",IF(AM90<2,\"ТМ3.5\",\"ТМ2\"))))","v":"ТМ2"},{"$f":"IF(AM90>=4.5,\"ТБ2.5\",IF(AM90>=3.5,\"ТБ1.5\",IF(AM90<=0.5,\"ТМ2.5\",IF(AM90<1,\"ТМ3.5\",\"-\"))))","v":"-"},{"$f":"IF(AN90>1.5,\"П1\",IF(AN90>1,\"1X\",IF(AN90<-1.5,\"П2\",IF(AN90<-1,\"X2\",\"-\"))))","v":"-"},"-","Чет"]
[null,null,null,null,null,null,null,null,null,null,null,null,null,null,null,null,null,null,null,null,null,null,null,null,null,null,null,null,null,null,null,null,null,null,null,"10_10",{"$f":"AVERAGE(AL87,AP87)","v":0.83333333333333337},{"$f":"AVERAGE(AM87,AP87)","v":0.3666666666666667},1.2000000000000002,0.46666666666666667,"-","-","-",{"$f":"IF(AM91>=3.5,\"ТБ2.5\",IF(AM91>=2.5,\"ТБ1.5\",IF(AM91<=0.5,\"ТМ2.5\",IF(AM91<2,\"ТМ3.5\",\"-\"))))","v":"ТМ3.5"},"-","-","-","Чет"]
[null,null,null,"Всего",null,null,null,null,null,null,"Дома",null,null,null,null,null,null,"На выезде",null,null,null,null,null,null,null,null,null,null,null,null,null,null,null,null,null,"5_5",{"$f":"AVERAGE(AR85,AV85)","v":1.1499999999999999},{"$f":"AVERAGE(AS85,AU85)","v":0.35000000000000003},1.5,0.79999999999999982,"-","-","-",{"$f":"IF(AM92>=3.5,\"ТБ2.5\",IF(AM92>=2.5,\"ТБ1.5\",IF(AM92<=0.5,\"ТМ2.5\",IF(AM92<2,\"ТМ3.5\",\"-\"))))","v":"ТМ3.5"},"-","-","-","Нечет"]
[null,null,null,"Игр","В","Н","П","Забито","Пропущено","Очки","Игр","В","Н","П","Забито","Пропущено","Очки","Игр","В","Н","П","Забито","Пропущено","Очки",null,null,null,null,null,null,null,null,null,null,null,"5_10",{"$f":"AVERAGE(AR86,AV86)","v":1.5666666666666667},{"$f":"AVERAGE(AS86,AU86)","v":0.95757575757575752},2.5242424242424244,0.60909090909090913,"Да","-","-",{"$f":"IF(AM93>=3.5,\"ТБ2.5\",IF(AM93>=2.5,\"ТБ1.5\",IF(AM93<=0.5,\"ТМ2.5\",IF(AM93<2,\"ТМ3.5\",\"ТМ2\"))))","v":"ТБ1.5"},"-","-","-","Нечет"]
[null,null,"Хозяева",{"$f":"Дома!O16","v":15},{"$f":"Дома!P16","v":8},{"$f":"Дома!Q16","v":1},{"$f":"Дома!R16","v":6},{"$f":"Дома!S16","v":22},{"$f":"Дома!T16","v":17},{"$f":"Дома!U16","v":25},{"$f":"Дома!V15","v":7},{"$f":"Дома!W16","v":5},{"$f":"Дома!X16","v":1},{"$f":"Дома!Y16","v":2},{"$f":"Дома!Z16","v":10},{"$f":"Дома!AA16","v":6},{"$f":"Дома!AB16","v":16},{"$f":"Дома!AC16","v":7},{"$f":"Дома!AD16","v":3},{"$f":"Дома!AE16","v":0},{"$f":"Дома!AF16","v":4},{"$f":"Дома!AG16","v":12},{"$f":"Дома!AH16","v":11},{"$f":"Дома!AI16","v":9},null,null,null,null,null,null,null,null,null,null,null,"10_10",{"$f":"AVERAGE(AR87,AV87)","v":1.2333333333333334},{"$f":"AVERAGE(AS87,AU87)","v":1.0333333333333334},2.2666666666666666,0.19999999999999996,"-","-","-",{"$f":"IF(AM94>=3.5,\"ТБ2.5\",IF(AM94>=2.5,\"ТБ1.5\",IF(AM94<=0.5,\"ТМ2.5\",IF(AM94<2,\"ТМ3.5\",\"-\"))))","v":"-"},"-","-","-","Чет"]
[null,null,"Гости",{"$f":"Гости!O16","v":15},{"$f":"Гости!P16","v":3},{"$f":"Гости!Q16","v":4},{"$f":"Гости!R16","v":8},{"$f":"Гости!S16","v":13},{"$f":"Гости!U16","v":13},{"$f":"Гости!U16","v":13},{"$f":"Гости!V16","v":8},{"$f":"Гости!W16","v":3},{"$f":"Гости!X16","v":3},{"$f":"Гости!Y16","v":2},{"$f":"Гости!Z16","v":5},{"$f":"Гости!AA16","v":4},{"$f":"Гости!AB16","v":12},{"$f":"Гости!AC16","v":7},{"$f":"Гости!AD16","v":0},{"$f":"Гости!AE16","v":1},{"$f":"Гости!AF16","v":6},{"$f":"Гости!AG16","v":8},{"$f":"Гости!AH16","v":16},{"$f":"Гости!AI16","v":1}]
[null,null,null,"Забивают","Пропускают","Забивают","Пропускают","Забивают","Пропускают",null,"Т1","Т2","Заб1","Заб2","Ср. заб.","Счет",null,"Забьет гол ",null,"Обе забьют?"]
[null,null,"Хозяева",{"$f":"H94/D94","v":1.4666666666666666},{"$f":"I94/D94","v":1.1333333333333333},{"$f":"O94/K94","v":1.4285714285714286},{"$f":"P94/K94","v":0.8571428571428571},{"$f":"V94/R94","v":1.7142857142857142},{"$f":"W94/R94","v":1.5714285714285714},null,{"$f":"AVERAGE(F97,D97)+AVERAGE(I98,E98)-AVERAGE(1.25,O97)","v":1.7988095238095236},{"$f":"AVERAGE(H98,D98)+AVERAGE(G97,E97)-AVERAGE(1.25,O97)","v":0.77499999999999991},{"$f":"AVERAGE(F97,D97)","v":1.4476190476190476},{"$f":"AVERAGE(H98,D98)","v":1.0047619047619047},{"$f":"AVERAGE(Дома!L2:M16,Гости!L2:M16)","v":1.2},{"$f":"ROUND(AVERAGE(K97,M97),0)","v":2},{"$f":"ROUND(AVERAGE(L97,N97),0)","v":1},{"$f":"IF(P97>1,\"ДА\",\"НЕТ\")","v":"ДА"},{"$f":"IF(Q97>=1,\"ДА\",\"НЕТ\")","v":"ДА"},{"$f":"IF(AND(R97=\"ДА\",S97=\"ДА\"),\"ДА\",\"НЕТ\")","v":"ДА"}]
[null,null,"Гости",{"$f":"H95/D95","v":0.8666666666666667},{"$f":"I95/D95","v":0.8666666666666667},{"$f":"O95/K95","v":0.625},{"$f":"P95/K95","v":0.5},{"$f":"V95/R95","v":1.1428571428571428},{"$f":"W95/R95","v":2.2857142857142856}]
[]
[]
[null,null,"Исходы №1",null,null,"Исходы №2",null,null,"Исходы №3",null,null,"Исходы №4"]
[null,null,"П1","Х","П2","П1","Х","П2","П1","Х","П2","П1","П2",null,null,null,null,null,{"$f":"Очные!A1","v":"Бадеран Тегеран"},null,null,null,null,null,null,null,null,{"$f":"Очные!B1","v":"Эстеглал Моласани"}]
[null,null,{"$f":"SUM(Дома!J2:J6)","v":8},{"$f":"(SUM(Дома!K2:K6)+SUM(Гости!J2:J6))/1.5","v":8},{"$f":"SUM(Гости!K2:K6)","v":5},{"$f":"Дома!P6/5/(Дома!P6/5+Дома!Q6/5+Гости!P6/5+Гости!Q6/5)","v":0.74999999999999989},{"$f":"(Дома!Q6/5+Гости!Q6/5)/(Дома!P6/5+Дома!Q6/5+Гости!P6/5+Гости!Q6/5)","v":0},{"$f":"Гости!P6/5/(Дома!P6/5+Дома!Q6/5+Гости!P6/5+Гости!Q6/5)","v":0.25},{"$f":"Дома!S6+Дома!T6+Гости!S6+Гости!T6","v":25},{"$f":"Дома!S6+Дома!T6+Гости!S6+Гости!T6+ДомаДома!S6+ДомаДома!T6+ГостиГости!S6+ГостиГости!T6","v":49},{"$f":"ДомаДома!S6+ДомаДома!T6+ГостиГости!S6+ГостиГости!T6","v":24},{"$f":"E103+I103","v":30},{"$f":"C103+K103","v":32},null,null,null,null,null,null,"Матчей","В","Н","П","Заб","Проп","Очки","Место",null,"Матчей","В","Н","П","Заб","Проп","Очки","Место"]
[null,null,{"$f":"C103/(C103+D103+E103)","v":0.38095238095238093},{"$f":"D103/(C103+D103+E103)","v":0.38095238095238093},{"$f":"E103/(C103+D103+E103)","v":0.23809523809523808},null,null,null,{"$f":"I103/(I103+J103+K103)","v":0.25510204081632654},{"$f":"J103/(I103+J103+K103)","v":0.5},{"$f":"K103/(I103+J103+K103)","v":0.24489795918367346},{"$f":"L103/(L103+M103)","v":0.4838709677419355},{"$f":"M103/(L103+M103)","v":0.5161290322580645},null,null,null,null,null,"Общая",{"$f":"INDEX(#REF!,MATCH(Расчеты!S102,#REF!,FALSE),1)","v":{"$error":"#REF!"}},{"$f":"INDEX(#REF!,MATCH(Расчеты!S102,#REF!,FALSE),1)","v":{"$error":"#REF!"}},{"$f":"INDEX(#REF!,MATCH(Расчеты!S102,#REF!,FALSE),1)","v":{"$error":"#REF!"}},{"$f":"INDEX(#REF!,MATCH(Расчеты!S102,#REF!,FALSE),1)","v":{"$error":"#REF!"}},{"$f":"INDEX(#REF!,MATCH(Расчеты!S102,#REF!,FALSE),1)","v":{"$error":"#REF!"}},{"$f":"INDEX(#REF!,MATCH(Расчеты!S102,#REF!,FALSE),1)","v":{"$error":"#REF!"}},{"$f":"INDEX(#REF!,MATCH(Расчеты!S102,#REF!,FALSE),1)","v":{"$error":"#REF!"}},{"$f":"INDEX(#REF!,MATCH(Расчеты!S102,#REF!,FALSE),1)","v":{"$error":"#REF!"}},"Общая",{"$f":"INDEX(#REF!,MATCH(Расчеты!AB102,#REF!,FALSE),1)","v":{"$error":"#REF!"}},{"$f":"INDEX(#REF!,MATCH(Расчеты!AB102,#REF!,FALSE),1)","v":{"$error":"#REF!"}},{"$f":"INDEX(#REF!,MATCH(Расчеты!AB102,#REF!,FALSE),1)","v":{"$error":"#REF!"}},{"$f":"INDEX(#REF!,MATCH(Расчеты!AB102,#REF!,FALSE),1)","v":{"$error":"#REF!"}},{"$f":"INDEX(#REF!,MATCH(Расчеты!AB102,#REF!,FALSE),1)","v":{"$error":"#REF!"}},{"$f":"INDEX(#REF!,MATCH(Расчеты!AB102,#REF!,FALSE),1)","v":{"$error":"#REF!"}},{"$f":"INDEX(#REF!,MATCH(Расчеты!AB102,#REF!,FALSE),1)","v":{"$error":"#REF!"}},{"$f":"INDEX(#REF!,MATCH(Расчеты!AB102,#REF!,FALSE),1)","v":{"$error":"#REF!"}}]
[null,null,"ДИ №1",null,null,"ДИ №2",null,null,"ДИ №3",null,null,"ДИ №4",null,null,null,null,null,null,"Дома",{"$f":"INDEX(#REF!,MATCH(S102,#REF!,FALSE),1)","v":{"$error":"#REF!"}},{"$f":"INDEX(#REF!,MATCH(S102,#REF!,FALSE),1)","v":{"$error":"#REF!"}},{"$f":"INDEX(#REF!,MATCH(S102,#REF!,FALSE),1)","v":{"$error":"#REF!"}},{"$f":"INDEX(#REF!,MATCH(S102,#REF!,FALSE),1)","v":{"$error":"#REF!"}},{"$f":"INDEX(#REF!,MATCH(S102,#REF!,FALSE),1)","v":{"$error":"#REF!"}},{"$f":"INDEX(#REF!,MATCH(S102,#REF!,FALSE),1)","v":{"$error":"#REF!"}},{"$f":"INDEX(#REF!,MATCH(S102,#REF!,FALSE),1)","v":{"$error":"#REF!"}},{"$f":"INDEX(#REF!,MATCH(S102,#REF!,FALSE),1)","v":{"$error":"#REF!"}},"Дома",{"$f":"INDEX(#REF!,MATCH(AB102,#REF!,FALSE),1)","v":{"$error":"#REF!"}},{"$f":"INDEX(#REF!,MATCH(AB102,#REF!,FALSE),1)","v":{"$error":"#REF!"}},{"$f":"INDEX(#REF!,MATCH(AB102,#REF!,FALSE),1)","v":{"$error":"#REF!"}},{"$f":"INDEX(#REF!,MATCH(AB102,#REF!,FALSE),1)","v":{"$error":"#REF!"}},{"$f":"INDEX(#REF!,MATCH(AB102,#REF!,FALSE),1)","v":{"$error":"#REF!"}},{"$f":"INDEX(#REF!,MATCH(AB102,#REF!,FALSE),1)","v":{"$error":"#REF!"}},{"$f":"INDEX(#REF!,MATCH(AB102,#REF!,FALSE),1)","v":{"$error":"#REF!"}},{"$f":"INDEX(#REF!,MATCH(AB102,#REF!,FALSE),1)","v":{"$error":"#REF!"}}]
[null,null,"1Х",12,"Х2","1Х",12,"Х2","1Х",12,"Х2","1X2","ФОРА",null,null,null,null,null,"Гости",{"$f":"INDEX(#REF!,MATCH(S102,#REF!,FALSE),1)","v":{"$error":"#REF!"}},{"$f":"INDEX(#REF!,MATCH(S102,#REF!,FALSE),1)","v":{"$error":"#REF!"}},{"$f":"INDEX(#REF!,MATCH(S102,#REF!,FALSE),1)","v":{"$error":"#REF!"}},{"$f":"INDEX(#REF!,MATCH(S102,#REF!,FALSE),1)","v":{"$error":"#REF!"}},{"$f":"INDEX(#REF!,MATCH(S102,#REF!,FALSE),1)","v":{"$error":"#REF!"}},{"$f":"INDEX(#REF!,MATCH(S102,#REF!,FALSE),1)","v":{"$error":"#REF!"}},{"$f":"INDEX(#REF!,MATCH(S102,#REF!,FALSE),1)","v":{"$error":"#REF!"}},{"$f":"INDEX(#REF!,MATCH(S102,#REF!,FALSE),1)","v":{"$error":"#REF!"}},"Гости",{"$f":"INDEX(#REF!,MATCH(AB102,#REF!,FALSE),1)","v":{"$error":"#REF!"}},{"$f":"INDEX(#REF!,MATCH(AB102,#REF!,FALSE),1)","v":{"$error":"#REF!"}},{"$f":"INDEX(#REF!,MATCH(AB102,#REF!,FALSE),1)","v":{"$error":"#REF!"}},{"$f":"INDEX(#REF!,MATCH(AB102,#REF!,FALSE),1)","v":{"$error":"#REF!"}},{"$f":"INDEX(#REF!,MATCH(AB102,#REF!,FALSE),1)","v":{"$error":"#REF!"}},{"$f":"INDEX(#REF!,MATCH(AB102,#REF!,FALSE),1)","v":{"$error":"#REF!"}},{"$f":"INDEX(#REF!,MATCH(AB102,#REF!,FALSE),1)","v":{"$error":"#REF!"}},{"$f":"INDEX(#REF!,MATCH(AB102,#REF!,FALSE),1)","v":{"$error":"#REF!"}}]
[null,null,{"$f":"AVERAGE(C104,D104)","v":0.38095238095238093},{"$f":"AVERAGE(C104,E104)","v":0.30952380952380953},{"$f":"AVERAGE(D104,E104)","v":0.30952380952380953},{"$f":"AVERAGE(F103,G103)","v":0.37499999999999994},{"$f":"AVERAGE(F103,H103)","v":0.49999999999999994},{"$f":"AVERAGE(G103,H103)","v":0.125},{"$f":"AVERAGE(I104,J104)","v":0.37755102040816324},{"$f":"AVERAGE(I104,K104)","v":0.25},{"$f":"AVERAGE(J104,K104)","v":0.37244897959183676},{"$f":"IF(L104>M104,\"1Х\",\"Х2\")","v":"Х2"},{"$f":"IF(L104>M104,\"Ф1(0)\",\"Ф2(0)\")","v":"Ф2(0)"},null,null,"Команды","Дмашние матчи","Гостевые матчи","Домашние голы","Гостевые голы","Среднее дома","Среднее гости","Атака дома","Сила атаки дома","Сила атаки в гостях","взвешенная сила атаки дома","взвешенная сила атаки в гостях","Дома пропущенно","Пропущенно в гостях","среднее дома","среднее в гостях","защита дома","слабость дома","слабость гости","слабость дома","слабость гости"]
[null,null,"ТОТАЛЫ №1",null,"ТОТАЛЫ №2",null,"ТОТАЛЫ №3",null,null,"З 1к","П 1к","З 2к","П 2к",null,null,{"$f":"S102","v":"Бадеран Тегеран"},{"$f":"T105","v":{"$error":"#REF!"}},{"$f":"T106","v":{"$error":"#REF!"}},{"$f":"X105","v":{"$error":"#REF!"}},{"$f":"X106","v":{"$error":"#REF!"}},{"$f":"S108/Q108","v":{"$error":"#REF!"}},{"$error":"#REF!"},{"$f":"U108/V108","v":{"$error":"#REF!"}},{"$f":"U108/U110","v":{"$error":"#REF!"}},{"$f":"V108/V110","v":{"$error":"#REF!"}},{"$f":"(U108+V108)/((U110+V110))","v":{"$error":"#REF!"}},{"$f":"(V108 + U108)/(U110 + V110)","v":{"$error":"#REF!"}},{"$f":"Y105","v":{"$error":"#REF!"}},{"$f":"Y106","v":{"$error":"#REF!"}},{"$f":"AB108/Q108","v":{"$error":"#REF!"}},{"$f":"AC108/R108","v":{"$error":"#REF!"}},{"$f":" AE108/AD108","v":{"$error":"#REF!"}},{"$f":"AD108/AD110","v":{"$error":"#REF!"}},{"$f":"AE108/AE110","v":{"$error":"#REF!"}},{"$f":"(AD108 + AE108)/(AD110 +AE110)","v":{"$error":"#REF!"}},{"$f":"(AE108 + AD108)/(AD110 + AE110)","v":{"$error":"#REF!"}}]
[null,null,"ТБ","ТМ","ТБ","ТМ","Тотал №1","Тотал №2","Тотал №3",{"$f":"Дома!S6","v":6},{"$f":"Дома!T6","v":6},{"$f":"Гости!S6","v":5},{"$f":"Гости!T6","v":8},null,null,{"$f":"AB102","v":"Эстеглал Моласани"},{"$f":"AC105","v":{"$error":"#REF!"}},{"$f":"AC106","v":{"$error":"#REF!"}},{"$f":"AG105","v":{"$error":"#REF!"}},{"$f":"AG106","v":{"$error":"#REF!"}},{"$error":"#REF!"},{"$error":"#REF!"},{"$f":"U109/V109","v":{"$error":"#REF!"}},{"$f":"U109/U110","v":{"$error":"#REF!"}},{"$f":"V109/V110","v":{"$error":"#REF!"}},{"$f":"(U109 + V109)/(U110 + V110)","v":{"$error":"#REF!"}},{"$f":"(V109 +U109)/(U110 + V110)","v":{"$error":"#REF!"}},{"$f":"AH105","v":{"$error":"#REF!"}},{"$f":"AH106","v":{"$error":"#REF!"}},{"$f":"AB109/Q109","v":{"$error":"#REF!"}},{"$f":"AC109/R109","v":{"$error":"#REF!"}},{"$f":" AE109/AD109","v":{"$error":"#REF!"}},{"$f":"AD109/AD110","v":{"$error":"#REF!"}},{"$f":"AE109/AE110","v":{"$error":"#REF!"}},{"$f":"(AD109+AE109)/(AD110+AE110)","v":{"$error":"#REF!"}},{"$f":"(AE109 + AD109)/(AD110 + AE110)","v":{"$error":"#REF!"}}]
[null,null,{"$f":"(Дома!S6+ДомаДома!T6+Гости!T6+ГостиГости!S6-0.2)/12","v":1.8166666666666667},{"$f":"(Дома!T6+ДомаДома!S6+Гости!S6+ГостиГости!T6)/12","v":2.25},{"$f":"(Дома!T6+Гости!T6)/5","v":2.8},{"$f":"(Дома!S6+Гости!S6)/5","v":2.2000000000000002},{"$f":"IF(AND(L112+M112<K109+L109/10-1,L112+M112<J109+L109/10-1),CONCATENATE(\"ТМ\",\"(\"&((L112+M112)+(K109+M109)/50)&\")\"),CONCATENATE(\"ТБ\",\"(\"&((L112+M112)+(J109+L109)/10-3&\")\")))","v":"ТМ(2,48)"},{"$f":"IF(AND(L112+M112+1<K109+L109/10,L112+M112+1<J109+K109/10),CONCATENATE(\"ТМ\",\"(\"&((L112+M112+1)+(K109+M109)/50)&\")\"),CONCATENATE(\"ТБ\",\"(\"&((L112+M112+0.5)+(J109+L109)/10-3&\")\")))","v":"ТМ(3,48)"},{"$f":"IF(AND(L112+M112<K109+L109/10-1,L112+M112<J109+L109/10-1),CONCATENATE(\"ТМ\",\"(\"&((L112+M112)+(K109+M109)/50-1)&\")\"),CONCATENATE(\"ТБ\",\"(\"&((L112+M112+0.5)+(J109+L109)/10-3&\")\")))","v":"ТМ(1,48)"},"З 1кд","П 1кд","З 2кг","П 2кг",null,null,"Среднее",{"$f":"SUM(Q108:Q109)","v":{"$error":"#REF!"}},{"$f":"SUM(R108:R109)","v":{"$error":"#REF!"}},{"$f":"SUM(S108:S109)","v":{"$error":"#REF!"}},{"$f":"SUM(T108:T109)","v":{"$error":"#REF!"}},{"$error":"#REF!"},{"$error":"#REF!"},{"$f":"U110/V110","v":{"$error":"#REF!"}},{"$f":"U110/U110","v":{"$error":"#REF!"}},{"$f":"V110/V110","v":{"$error":"#REF!"}},{"$f":"U110/U110","v":{"$error":"#REF!"}},{"$f":"V110/V110","v":{"$error":"#REF!"}},{"$f":"AB108+AB109","v":{"$error":"#REF!"}},{"$f":"AC108+AC109","v":{"$error":"#REF!"}},{"$f":"AB110/Q110","v":{"$error":"#REF!"}},{"$f":"AC110/Q110","v":{"$error":"#REF!"}},{"$f":" AE110/AD110","v":{"$error":"#REF!"}},{"$f":"AD110/AD110","v":{"$error":"#REF!"}},{"$f":"AE110/AE110","v":{"$error":"#REF!"}},{"$f":"(AD110 +AE110)/(AD110 +AE110)","v":{"$error":"#REF!"}},{"$f":"(AE110 +AD110)/(AD110 + AE110)","v":{"$error":"#REF!"}}]
[null,null,{"$f":"D110/(C110+D110)","v":0.55327868852459017},{"$f":"C110/(C110+D110)","v":0.44672131147540983},{"$f":"F110/(E110+F110)","v":0.44000000000000006},{"$f":"E110/(E110+F110)","v":0.55999999999999994},null,null,null,{"$f":"ДомаДома!S6","v":5},{"$f":"ДомаДома!T6","v":3},{"$f":"ГостиГости!S6","v":5},{"$f":"ГостиГости!T6","v":11},null,null,{"$f":"S102","v":"Бадеран Тегеран"},null,"голов","сила","слабость","голов","Результат 1",null,"Результат 2",null,"ПРОГНОЗ №1",null,"МИНУТА"]
[null,null,"ИТБ №1",null,"ИТБ №2",null,"ИТМ №1",null,"ИТМ №1",null,null,{"$f":"J109/5","v":1.2},{"$f":"L111/5","v":1},null,null,null,null,{"$f":"U110","v":{"$error":"#REF!"}},{"$f":"Z108","v":{"$error":"#REF!"}},{"$f":"AJ109","v":{"$error":"#REF!"}},{"$f":"R112*S112*T112","v":{"$error":"#REF!"}},{"$f":"AZ13-1","v":{"$error":"#REF!"}},{"$f":"BC13-1","v":{"$error":"#REF!"}},{"$f":"AZ13","v":{"$error":"#REF!"}},{"$f":"BC13","v":{"$error":"#REF!"}},{"$f":"IF(X116-Z116>25,1,IF(X116>Z116,\"1X\",IF(Z116-X116>25,2,IF(Z116>X116,\"X2\",\"\"))))","v":{"$error":"#REF!"}},null,90]
[null,null,"ИТБ1","ИТБ2","ИТБ1","ИТБ2","ИТМ1","ИТМ2","ИТМ1","ИТМ2",null,null,null,null,null,{"$f":"AB102","v":"Эстеглал Моласани"},null,"голов","сила","слабость","голов"]
[null,null,{"$f":"C110/2","v":0.90833333333333333},{"$f":"D110/2+0.75","v":1.875},{"$f":"E110/2","v":1.4},{"$f":"F110/2.5","v":0.88000000000000012},{"$f":"D114/2+0.35","v":1.2875000000000001},{"$f":"C114/2+0.75","v":1.2041666666666666},{"$f":"F114/2+0.5","v":0.94000000000000006},{"$f":"E114/2+0.5","v":1.2},null,null,null,null,null,null,null,{"$f":"V110","v":{"$error":"#REF!"}},{"$f":"AA109","v":{"$error":"#REF!"}},{"$f":"AJ108","v":{"$error":"#REF!"}},{"$f":"R114*S114*T114","v":{"$error":"#REF!"}}]
[null,null,{"$f":"D114/(C114+D114)","v":0.67365269461077848},{"$f":"C114/(C114+D114)","v":0.32634730538922158},{"$f":"E114/(E114+F114)","v":0.61403508771929816},{"$f":"F114/(E114+F114)","v":0.38596491228070179},{"$f":"H114/(G114+H114)","v":0.4832775919732441},{"$f":"G114/(G114+H114)","v":0.51672240802675584},{"$f":"D115","v":0.32634730538922158},{"$f":"C115","v":0.67365269461077848},null,null,null,null,null,null,null,null,null,null,null,null,null,1,"X",2,"МЕНЬШЕ 2,5","БОЛЬШЕ 2,5"]
[null,null,{"$f":"MAX(Дома!J2:J6)","v":2},{"$f":"MIN(Дома!J2:J6)","v":1},"1к","ТС",null,null,"В матче будет забито",null,null,null,null,null,null,null,null,null,null,null,null,"Шансы",null,{"$f":"BA17","v":{"$error":"#REF!"}},{"$f":"BA18","v":{"$error":"#REF!"}},{"$f":"BA19","v":{"$error":"#REF!"}},{"$f":"BA23","v":{"$error":"#REF!"}},{"$f":"BA22","v":{"$error":"#REF!"}}]
[null,null,{"$f":"MAX(Дома!K2:K6)","v":2},{"$f":"MIN(Дома!K2:K6)","v":0},null,null,null,null,{"$f":"E120+E121","v":2},{"$f":"E120+E121+1","v":3},null,null,null,null,null,null,null,null,null,null,null,"Величина",null,{"$f":"BB17","v":{"$error":"#REF!"}},{"$f":"BB18","v":{"$error":"#REF!"}},{"$f":"BB19","v":{"$error":"#REF!"}},{"$f":"BB23","v":{"$error":"#REF!"}},{"$f":"BB22","v":{"$error":"#REF!"}}]
[null,null,{"$f":"MAX(Гости!J2:J6)","v":3},{"$f":"MIN(Гости!J2:J6)","v":1},"2к","ТС №1",{"$f":"E120","v":2},{"$f":"E121","v":0},"обе забьют",null,null,null,null,null,null,null,null,null,null,null,null,{"$f":"S102","v":"Бадеран Тегеран"},{"$f":"AB102","v":"Эстеглал Моласани"},"МОЖНО СТАВИТЬ",{"$f":"IF(Y119>50,\"OK\",IF(Y119<50,\"NO\"))","v":{"$error":"#REF!"}},{"$f":"IF(Z119>50,\"OK\",IF(Z119<50,\"NO\"))","v":{"$error":"#REF!"}},{"$error":"#REF!"},{"$error":"#REF!"},{"$error":"#REF!"}]
[null,null,{"$f":"MAX(Гости!K2:K6)","v":2},{"$f":"MIN(Гости!K2:K6)","v":0},null,"ТС №2",{"$f":"D119","v":0},{"$f":"D118","v":1},{"$f":"IF(G118-1=0,\"НЕТ\",IF(H118=0,\"НЕТ\",\"ДА\"))","v":"НЕТ"},{"$f":"IF(G118=0,\"НЕТ\",IF(G119=0,\"НЕТ\",\"ДА\"))","v":"НЕТ"},null,null,null,null,null,null,null,null,null,null,null,null,null,"%",{"$f":"BA32","v":{"$error":"#REF!"}},{"$f":"BA20","v":{"$error":"#REF!"}},{"$f":"BA22","v":{"$error":"#REF!"}},{"$f":"BA24","v":{"$error":"#REF!"}},{"$f":"BA34","v":{"$error":"#REF!"}}]
[null,null,{"$f":"SUM(Дома!J2:J5)-C116-D116","v":4},{"$f":"C120/2","v":2},{"$f":"ROUND(D120+D123-1.5,0)","v":2},"ТС №3",{"$f":"G118-1","v":1},{"$f":"H118-1","v":-1},"ДИСТАНЦИЯ",null,null,null,null,null,null,null,null,null,null,null,null,{"$f":"AB112*U112/90","v":{"$error":"#REF!"}},{"$f":"AB112*U114/90","v":{"$error":"#REF!"}},"БОЛЬШЕ",0.5,1.5,2.5,3.5,4.5]
[null,null,{"$f":"SUM(Дома!K2:K5)-C117-D117","v":0},{"$f":"C121/2","v":0},{"$f":"ROUND(D121+D122-1.5,0)","v":0},"ТС №4",{"$f":"Дома!K2","v":0},{"$f":"Гости!J6","v":1},{"$f":"(J109-L109)+(K109-L109)+(L109-J109)+(M109-J109)","v":3},{"$f":"(J111-L111)+(K111-L111)+(L111-J111)+(M111-J111)","v":4},null,null,null,null,null,null,null,null,null,null,null,null,null,null,{"$f":"BB32","v":{"$error":"#REF!"}},{"$f":"BB20","v":{"$error":"#REF!"}},{"$f":"BB22","v":{"$error":"#REF!"}},{"$f":"BB24","v":{"$error":"#REF!"}},{"$f":"BB34","v":{"$error":"#REF!"}}]
[null,null,{"$f":"SUM(Гости!J2:J5)-C118-D118","v":3},{"$f":"C122/2","v":1.5},null,"ТС №5",{"$f":"G121-1","v":-1},{"$f":"H121-1","v":0},"мотивация"]
[null,null,{"$f":"SUM(Гости!K2:K5)-C119-D119","v":3},{"$f":"C123/2","v":1.5},null,"ТС №6",{"$f":"G121+1","v":1},{"$f":"H121+1","v":2},{"$f":"IF(I121>J121,\"Команда 1\",\"Команда 2\")","v":"Команда 2"}]